mesos-reviews mailing list archives

Site index · List index
Message view « Date » · « Thread »
Top « Date » · « Thread »
From Mesos Reviewbot Windows <revi...@mesos.apache.org>
Subject Re: Review Request 69612: Refactored parallel test runner.
Date Wed, 16 Jan 2019 15:11:30 GMT

-----------------------------------------------------------
This is an automatically generated e-mail. To reply, visit:
https://reviews.apache.org/r/69612/#review212072
-----------------------------------------------------------



FAIL: Some of the unit tests failed. Please check the relevant logs.

Reviews applied: `['69612']`

Failed command: `Start-MesosCITesting`

All the build artifacts available at: http://dcos-win.westus2.cloudapp.azure.com/artifacts/mesos-reviewbot-testing/2791/mesos-review-69612

Relevant logs:

- [mesos-tests.log](http://dcos-win.westus2.cloudapp.azure.com/artifacts/mesos-reviewbot-testing/2791/mesos-review-69612/logs/mesos-tests.log):

```
[  FAILED  ] DockerContainerizerTest.ROOT_DOCKER_Default_CMD
[  FAILED  ] DockerContainerizerTest.ROOT_DOCKER_Default_CMD_Override
[  FAILED  ] DockerContainerizerTest.ROOT_DOCKER_Default_CMD_Args
[  FAILED  ] DockerContainerizerTest.ROOT_DOCKER_SlaveRecoveryTaskContainer
[  FAILED  ] DockerContainerizerTest.ROOT_DOCKER_DestroyWhileFetching
[  FAILED  ] DockerContainerizerTest.ROOT_DOCKER_DestroyWhilePulling
[  FAILED  ] DockerContainerizerTest.ROOT_DOCKER_DestroyUnknownContainer
[  FAILED  ] DockerContainerizerTest.ROOT_DOCKER_ExecutorCleanupWhenLaunchFailed
[  FAILED  ] DockerContainerizerTest.ROOT_DOCKER_FetchFailure
[  FAILED  ] DockerContainerizerTest.ROOT_DOCKER_DockerPullFailure
[  FAILED  ] DockerContainerizerTest.ROOT_DOCKER_DockerInspectDiscard
[  FAILED  ] DockerContainerizerTest.ROOT_DOCKER_WaitUnknownContainer
[  FAILED  ] DockerContainerizerTest.ROOT_DOCKER_NoTransitionFromKillingToRunning
[  FAILED  ] DockerContainerizerTest.ROOT_DOCKER_DefaultDNS
[  FAILED  ] HungDockerTest.ROOT_DOCKER_InspectHungDuringPull

28 FAILED TESTS
  YOU HAVE 231 DISABLED TESTS

3 from RUNNING to DESTROYING
I0116 15:11:14.373539 15168 launcher.cpp:161] Asked to destroy container e9ac3179-3a19-410d-9141-d0064309e313
W0116 15:11:14.374548 18324 process.cpp:1423] Failed to recv on socket WindowsFD::Type::SOCKET=6208
to peer '192.10.1.6:49859': IO failed with error code: The specified network name is no longer
available.

W0116 15:11:14.375532 18324 process.cpp:838] Failed to recv on socket WindowsFD::Type::SOCKET=9068
to peer '192.10.1.6:49860': IO failed with error code: The specified network name is no longer
available.

I0116 15:11:14.459478 27384 containerizer.cpp:2975] Container e9ac3179-3a19-410d-9141-d0064309e313
has exited
I0116 15:11:14.488662 26908 master.cpp:1109] Master terminating
I0116 15:11:14.490479 22140 hierarchical.cpp:644] Removed agent a1313f56-2a59-49b4-a47e-fc3fa39da70c-S0
I0116 15:11:14.985491 18324 process.cpp:927] Stopped the socket accept loop
```

- Mesos Reviewbot Windows


On Dec. 20, 2018, 4:40 p.m., Andrei Budnik wrote:
> 
> -----------------------------------------------------------
> This is an automatically generated e-mail. To reply, visit:
> https://reviews.apache.org/r/69612/
> -----------------------------------------------------------
> 
> (Updated Dec. 20, 2018, 4:40 p.m.)
> 
> 
> Review request for mesos, Armand Grillet and Benjamin Bannier.
> 
> 
> Repository: mesos
> 
> 
> Description
> -------
> 
> See summary.
> 
> 
> Diffs
> -----
> 
>   support/mesos-gtest-runner.py 88a60c39e32730cd2875dc97c2d85cc314255050 
> 
> 
> Diff: https://reviews.apache.org/r/69612/diff/2/
> 
> 
> Testing
> -------
> 
> make check
> sudo make check
> 
> 
> Thanks,
> 
> Andrei Budnik
> 
>


Mime
  • Unnamed multipart/alternative (inline, None, 0 bytes)
View raw message