mesos-reviews mailing list archives

Site index · List index
Message view « Date » · « Thread »
Top « Date » · « Thread »
From Mesos Reviewbot Windows <revi...@mesos.apache.org>
Subject Re: Review Request 69612: Refactored parallel test runner.
Date Wed, 16 Jan 2019 21:02:58 GMT

-----------------------------------------------------------
This is an automatically generated e-mail. To reply, visit:
https://reviews.apache.org/r/69612/#review212080
-----------------------------------------------------------



FAIL: Some of the unit tests failed. Please check the relevant logs.

Reviews applied: `['69612']`

Failed command: `Start-MesosCITesting`

All the build artifacts available at: http://dcos-win.westus2.cloudapp.azure.com/artifacts/mesos-reviewbot-testing/2793/mesos-review-69612

Relevant logs:

- [mesos-tests.log](http://dcos-win.westus2.cloudapp.azure.com/artifacts/mesos-reviewbot-testing/2793/mesos-review-69612/logs/mesos-tests.log):

```
I0116 21:02:42.454562  5428 master.cpp:1269] Agent d6b36ada-fe2d-4058-b3b7-038988d8af30-S0
at slave(468)@192.10.1.6:49906 (windows-02.chtsmhjxogyevckjfayqqcnjda.xx.internal.cloudapp.net)
disconnected
I0116 21:02:42.455560  5428 master.cpp:3272] Disconnecting agent d6b36ada-fe2d-4058-b3b7-038988d8af30-S0
at slave(468)@192.10.1.6:49906 (windows-02.chtsmhjxogyevckjfayqqcnjda.xx.internal.cloudapp.net)
I0116 21:02:42.455560  5428 master.cpp:3291] Deactivating agent d6b36ada-fe2d-4058-b3b7-038988d8af30-S0
at slave(468)@192.10.1.6:49906 (windows-02.chtsmhjxogyevckjfayqqcnjda.xx.internal.cloudapp.net)
I0116 21:02:42.455560  3768 hierarchical.cpp:358] Removed framework d6b36ada-fe2d-4058-b3b7-038988d8af30-0000
I0116 21:02:42.455560  3768 hierarchical.cpp:802] Agent d6b36ada-fe2d-4058-b3b7-038988d8af30-S0
deactivated
I0116 21:02:42.456586  5428 containerizer.cpp:2469] Destroying container 7e8db58b-cec6-42c1-9192-ce74c3e89fb8
in RUNNING state
I0116 21:02:42.456586  5428 containerizer.cpp:3136] Transitioning the state of container 7e8db58b-cec6-42c1-9192-ce74c3e89fb8
from RUNNING to DESTROYING
I0116 21:02:42.457639  5428 launcher.cpp:161] Asked to destroy container 7e8db58b-cec6-42c1-9192-ce74c3e89fb8
W0116 21:02:42.458611  6388 process.cpp:838] Failed to recv on socket WindowsFD::Type::SOCKET=2956
to peer '192.10.1.6:51750': IO failed with error code: The specified network name is no longer
available.

W0116 21:02:42.458611  6388 p[       OK ] IsolationFlag/MemoryIsolatorTest.ROOT_MemUsage/0
(589 ms)
[----------] 1 test from IsolationFlag/MemoryIsolatorTest (607 ms total)

[----------] Global test environment tear-down
[==========] 1085 tests from 104 test cases ran. (499646 ms total)
[  PASSED  ] 1083 tests.
[  FAILED  ] 2 tests, listed below:
[  FAILED  ] ContentType/MasterAPITest.OperationUpdatesUponAgentGone/0, where GetParam() =
application/x-protobuf
[  FAILED  ] ContentType/MasterAPITest.OperationUpdatesUponAgentGone/1, where GetParam() =
application/json

 2 FAILED TESTS
  YOU HAVE 231 DISABLED TESTS

rocess.cpp:1423] Failed to recv on socket WindowsFD::Type::SOCKET=2296 to peer '192.10.1.6:51749':
IO failed with error code: The specified network name is no longer available.

I0116 21:02:42.465565  6048 containerizer.cpp:2975] Container 7e8db58b-cec6-42c1-9192-ce74c3e89fb8
has exited
I0116 21:02:42.492586  7144 master.cpp:1109] Master terminating
I0116 21:02:42.494570  4228 hierarchical.cpp:644] Removed agent d6b36ada-fe2d-4058-b3b7-038988d8af30-S0
I0116 21:02:42.727299  6388 process.cpp:927] Stopped the socket accept loop
```

- Mesos Reviewbot Windows


On Dec. 20, 2018, 8:40 a.m., Andrei Budnik wrote:
> 
> -----------------------------------------------------------
> This is an automatically generated e-mail. To reply, visit:
> https://reviews.apache.org/r/69612/
> -----------------------------------------------------------
> 
> (Updated Dec. 20, 2018, 8:40 a.m.)
> 
> 
> Review request for mesos, Armand Grillet and Benjamin Bannier.
> 
> 
> Repository: mesos
> 
> 
> Description
> -------
> 
> See summary.
> 
> 
> Diffs
> -----
> 
>   support/mesos-gtest-runner.py 88a60c39e32730cd2875dc97c2d85cc314255050 
> 
> 
> Diff: https://reviews.apache.org/r/69612/diff/2/
> 
> 
> Testing
> -------
> 
> make check
> sudo make check
> 
> 
> Thanks,
> 
> Andrei Budnik
> 
>


Mime
  • Unnamed multipart/alternative (inline, None, 0 bytes)
View raw message