metron-dev mailing list archives

Site index · List index
Message view « Date » · « Thread »
Top « Date » · « Thread »
From Otto Fowler <ottobackwa...@gmail.com>
Subject Re: Dependency Checks
Date Wed, 24 Jan 2018 22:28:49 GMT
There isn’t a maven plugin for this?


On January 24, 2018 at 16:44:02, Nick Allen (nick@nickallen.org) wrote:

We should re-jigger `platform-info.sh` (or create a new tool) that very
obviously passes or fails based on what it discovers in the user's
environment. Right now, a user just runs the `platform-info.sh` and it is
not apparent to them what the problem is.

The script could be manually executed by a user. This could also be called
at the start of a deployment so that it fails fast if the user is missing
dependencies.

I wish there was a better way to handle this.


On Wed, Jan 24, 2018 at 1:05 PM Sujay Jaladi <jsujay@gmail.com> wrote:

> Thanks Otto. Please find the output below
>
> scripts sujay$ ./platform-info.sh
>
> Metron 0.4.2
>
> --
>
> --
>
> fatal: your current branch 'master' does not have any commits yet
>
> --
>
> --
>
> ansible 2.2.2.0
>
> config file =
>
> configured module search path = Default w/o overrides
>
> --
>
> Vagrant 2.0.1
>
> --
>
> Python 2.7.10
>
> --
>
> Apache Maven 3.3.9 (bb52d8502b132ec0a5a3f4c09453c07478323dc5;
> 2015-11-10T08:41:47-08:00)
>
> Maven home: /usr/local/Cellar/maven@3.3/3.3.9/libexec
>
> Java version: 1.8.0_131, vendor: Oracle Corporation
>
> Java home:
> /Library/Java/JavaVirtualMachines/jdk1.8.0_131.jdk/Contents/Home/jre
>
> Default locale: en_US, platform encoding: UTF-8
>
> OS name: "mac os x", version: "10.12.6", arch: "x86_64", family: "mac"
>
> --
>
> ./platform-info.sh: line 64: docker: command not found
>
> --
>
> node
>
> v9.4.0
>
> --
>
> npm
>
> 5.6.0
>
> --
>
> Configured with: --prefix=/Library/Developer/CommandLineTools/usr
> --with-gxx-include-dir=/usr/include/c++/4.2.1
>
> Apple LLVM version 9.0.0 (clang-900.0.38)
>
> Target: x86_64-apple-darwin16.7.0
>
> Thread model: posix
>
> InstalledDir: /Library/Developer/CommandLineTools/usr/bin
>
> --
>
> Compiler is C++11 compliant
>
> --
>
> Darwin sujay-lm 16.7.0 Darwin Kernel Version 16.7.0: Wed Oct 4 00:17:00
> PDT 2017; root:xnu-3789.71.6~1/RELEASE_X86_64 x86_64
>
> --
>
> Total System Memory = 16384 MB
>
> Processor Model: Intel(R) Core(TM) i7-6567U CPU
>
> Processor Speed: 3.30GHz
>
> Total Physical Processors: 2
>
> Total cores: 2
>
> Disk information:
>
> /dev/disk1 233Gi 83Gi 149Gi 36% 1222172 4293745107 0% /
>
> This CPU appears to support virtualization
>
> On Wed, Jan 24, 2018 at 4:53 AM, Otto Fowler <ottobackwards@gmail.com>
> wrote:
>
>> Can you run metron-deployment/scripts/platform_info.sh and send the
>> output?
>>
>>
>> On January 23, 2018 at 21:43:34, Sujay Jaladi (jsujay@gmail.com) wrote:
>>
>> Hello,
>>
>> Everytime I attempt to deploy apache metron on AWS, I get the following
>> error and all the servers are up and running expect Metron or its
>> components are not installed. Please help.
>>
>> fatal: [ec2-52-10-94-22.us-west-2.compute.amazonaws.com -> localhost]:
>> FAILED! => {"changed": true, "cmd": "cd
>>
/Users/sujay/Downloads/apache-metron-0.4.2-rc2/metron-deployment/amazon-ec2/../playbooks/../..

>> && mvn clean package -DskipTests -T 2C -P HDP-2.5.0.0,mpack", "delta":
>> "0:00:04.845260", "end": "2018-01-23 18:28:27.608265", "failed": true,
>> "rc": 1, "start": "2018-01-23 18:28:22.763005", "stderr": "", "stdout":
>> "[INFO] Scanning for projects...\n[INFO]
>>
------------------------------------------------------------------------\n[INFO]

>> Reactor Build Order:\n[INFO] \n[INFO] Metron\n[INFO]
metron-stellar\n[INFO]
>> stellar-common\n[INFO] metron-analytics\n[INFO]
metron-maas-common\n[INFO]
>> metron-platform\n[INFO] metron-zookeeper\n[INFO]
>> metron-test-utilities\n[INFO] metron-integration-test\n[INFO]
>> metron-maas-service\n[INFO] metron-common\n[INFO]
metron-statistics\n[INFO]
>> metron-writer\n[INFO] metron-storm-kafka-override\n[INFO]
>> metron-storm-kafka\n[INFO] metron-hbase\n[INFO]
>> metron-profiler-common\n[INFO] metron-profiler-client\n[INFO]
>> metron-profiler\n[INFO] metron-hbase-client\n[INFO]
>> metron-enrichment\n[INFO] metron-indexing\n[INFO] metron-solr\n[INFO]
>> metron-pcap\n[INFO] metron-parsers\n[INFO] metron-pcap-backend\n[INFO]
>> metron-data-management\n[INFO] metron-api\n[INFO]
metron-management\n[INFO]
>> elasticsearch-shaded\n[INFO] metron-elasticsearch\n[INFO]
>> metron-deployment\n[INFO] Metron Ambari Management Pack\n[INFO]
>> metron-contrib\n[INFO] metron-docker\n[INFO] metron-interface\n[INFO]
>> metron-config\n[INFO] metron-alerts\n[INFO] metron-rest-client\n[INFO]
>> metron-rest\n[INFO] site-book\n[INFO] 3rd party Functions (just for
>> tests)\n[INFO] \n[INFO] Using the MultiThreadedBuilder implementation
with
>> a thread count of 8\n[INFO]
>> \n[INFO]
>>
------------------------------------------------------------------------\n[INFO]

>> Building Metron 0.4.2\n[INFO]
>>
------------------------------------------------------------------------\n[INFO]

>> \n[INFO] --- maven-clean-plugin:2.5:clean (default-clean) @ Metron
>> ---\n[INFO] \n[INFO] --- maven-enforcer-plugin:1.4.1:enforce
>> (enforce-versions) @ Metron ---\n[INFO] \n[INFO] ---
>> jacoco-maven-plugin:0.7.9:prepare-agent (default) @ Metron ---\n[INFO]
>> argLine set to
>>
-javaagent:/Users/sujay/.m2/repository/org/jacoco/org.jacoco.agent/0.7.9/org.jacoco.agent-0.7.9-runtime.jar=destfile=/Users/sujay/Downloads/apache-metron-0.4.2-rc2/target/jacoco.exec\n[INFO]

>> \n[INFO] --- jacoco-maven-plugin:0.7.9:report (report) @ Metron
---\n[INFO]
>> Skipping JaCoCo execution due to missing execution data file.\n[INFO]
>>
>> \n[INFO]
>>
------------------------------------------------------------------------\n[INFO]

>> Building metron-stellar 0.4.2\n[INFO]
>>
------------------------------------------------------------------------\n[INFO]

>>
>> \n[INFO]
>> \n[INFO]
>>
------------------------------------------------------------------------\n[INFO]

>> Building metron-platform 0.4.2\n[INFO]
>>
------------------------------------------------------------------------\n[INFO]

>>
------------------------------------------------------------------------\n[INFO]

>> Building metron-analytics 0.4.2\n[INFO]
>>
------------------------------------------------------------------------\n[INFO]

>>
>> \n[INFO]
>>
------------------------------------------------------------------------\n[INFO]

>>
>> \n[INFO]
>>
------------------------------------------------------------------------\n[INFO]

>> Building metron-contrib 0.4.2\n[INFO]
>>
------------------------------------------------------------------------\n[INFO]

>> Building metron-deployment 0.4.2\n[INFO]
>>
------------------------------------------------------------------------\n[INFO]

>>
>> \n[INFO]
>>
------------------------------------------------------------------------\n[INFO]

>> Building metron-interface 0.4.2\n[INFO]
>>
------------------------------------------------------------------------\n[INFO]

>>
>> \n[INFO]
>>
------------------------------------------------------------------------\n[INFO]

>> Building site-book 0.4.2\n[INFO]
>>
------------------------------------------------------------------------\n[INFO]

>> \n[INFO] --- maven-clean-plugin:2.5:clean (default-clean) @
metron-contrib
>> ---\n[INFO] \n[INFO] --- maven-clean-plugin:2.5:clean (default-clean) @
>> metron-deployment ---\n[INFO] \n[INFO] ---
>> maven-enforcer-plugin:1.4.1:enforce (enforce-versions) @
metron-deployment
>> ---\n[INFO] \n[INFO] --- maven-enforcer-plugin:1.4.1:enforce
>> (enforce-versions) @ metron-contrib ---\n[INFO] \n[INFO] ---
>> maven-clean-plugin:2.5:clean (default-clean) @ site-book ---\n[INFO]
>> \n[INFO] --- jacoco-maven-plugin:0.7.9:prepare-agent (default) @
>> metron-contrib ---\n[INFO] \n[INFO] ---
>> jacoco-maven-plugin:0.7.9:prepare-agent (default) @ metron-deployment
>> ---\n[INFO] argLine set to
>>
-javaagent:/Users/sujay/.m2/repository/org/jacoco/org.jacoco.agent/0.7.9/org.jacoco.agent-0.7.9-runtime.jar=destfile=/Users/sujay/Downloads/apache-metron-0.4.2-rc2/metron-contrib/target/jacoco.exec\n[INFO]

>> \n[INFO] --- maven-enforcer-plugin:1.4.1:enforce (enforce-versions) @
>> site-book ---\n[INFO] \n[INFO] --- jacoco-maven-plugin:0.7.9:report
>> (report) @ metron-contrib ---\n[INFO] argLine set to
>>
-javaagent:/Users/sujay/.m2/repository/org/jacoco/org.jacoco.agent/0.7.9/org.jacoco.agent-0.7.9-runtime.jar=destfile=/Users/sujay/Downloads/apache-metron-0.4.2-rc2/metron-deployment/target/jacoco.exec\n[INFO]

>> \n[INFO] --- jacoco-maven-plugin:0.7.9:report (report) @
metron-deployment
>> ---\n[INFO] Skipping JaCoCo execution due to missing execution data
>> file.\n[INFO] \n[INFO] --- jacoco-maven-plugin:0.7.9:prepare-agent
>> (default) @ site-book ---\n[INFO] Skipping JaCoCo execution due to
missing
>> execution data file.\n[INFO]
>> \n[INFO]
>> \n[INFO]
>>
------------------------------------------------------------------------\n[INFO]

>> Building Metron Ambari Management Pack 0.4.2.0\n[INFO]
>>
------------------------------------------------------------------------\n[INFO]

>>
------------------------------------------------------------------------\n[INFO]

>> Building metron-docker 0.4.2\n[INFO]
>>
------------------------------------------------------------------------\n[INFO]

>> argLine set to
>>
-javaagent:/Users/sujay/.m2/repository/org/jacoco/org.jacoco.agent/0.7.9/org.jacoco.agent-0.7.9-runtime.jar=destfile=/Users/sujay/Downloads/apache-metron-0.4.2-rc2/site-book/target/jacoco.exec\n[INFO]

>> \n[INFO] --- maven-site-plugin:3.4:site (default) @ site-book
---\n[INFO]
>>
------------------------------------------------------------------------\n[INFO]

>> Reactor Summary:\n[INFO] \n[INFO] Metron
>> ............................................. SUCCESS [ 2.170
>> s]\n[INFO] metron-stellar .....................................
>> SKIPPED\n[INFO] stellar-common .....................................
>> SKIPPED\n[INFO] metron-analytics ...................................
>> SKIPPED\n[INFO] metron-maas-common .................................
>> SKIPPED\n[INFO] metron-platform ....................................
>> SKIPPED\n[INFO] metron-zookeeper ...................................
>> SKIPPED\n[INFO] metron-test-utilities ..............................
>> SKIPPED\n[INFO] metron-integration-test ............................
>> SKIPPED\n[INFO] metron-maas-service ................................
>> SKIPPED\n[INFO] metron-common ......................................
>> SKIPPED\n[INFO] metron-statistics ..................................
>> SKIPPED\n[INFO] metron-writer ......................................
>> SKIPPED\n[INFO] metron-storm-kafka-override ........................
>> SKIPPED\n[INFO] metron-storm-kafka .................................
>> SKIPPED\n[INFO] metron-hbase .......................................
>> SKIPPED\n[INFO] metron-profiler-common .............................
>> SKIPPED\n[INFO] metron-profiler-client .............................
>> SKIPPED\n[INFO] metron-profiler ....................................
>> SKIPPED\n[INFO] metron-hbase-client ................................
>> SKIPPED\n[INFO] metron-enrichment ..................................
>> SKIPPED\n[INFO] metron-indexing ....................................
>> SKIPPED\n[INFO] metron-solr ........................................
>> SKIPPED\n[INFO] metron-pcap ........................................
>> SKIPPED\n[INFO] metron-parsers .....................................
>> SKIPPED\n[INFO] metron-pcap-backend ................................
>> SKIPPED\n[INFO] metron-data-management .............................
>> SKIPPED\n[INFO] metron-api .........................................
>> SKIPPED\n[INFO] metron-management ..................................
>> SKIPPED\n[INFO] elasticsearch-shaded ...............................
>> SKIPPED\n[INFO] metron-elasticsearch ...............................
>> SKIPPED\n[INFO] metron-deployment ..................................
>> SUCCESS [ 0.043 s]\n[INFO] Metron Ambari Management Pack
>> ...................... SKIPPED\n[INFO] metron-contrib
>> ..................................... SUCCESS [ 0.043 s]\n[INFO]
>> metron-docker ...................................... SKIPPED\n[INFO]
>> metron-interface ................................... FAILURE [ 0.115
>> s]\n[INFO] metron-config ......................................
>> SKIPPED\n[INFO] metron-alerts ......................................
>> SKIPPED\n[INFO] metron-rest-client .................................
>> SKIPPED\n[INFO] metron-rest ........................................
>> SKIPPED\n[INFO] site-book ..........................................
>> SKIPPED\n[INFO] 3rd party Functions (just for tests) ...............
>> SKIPPED\n[INFO]
>>
------------------------------------------------------------------------\n[INFO]

>> BUILD FAILURE\n[INFO]
>>
------------------------------------------------------------------------\n[INFO]

>> Total time: 3.038 s (Wall Clock)\n[INFO] Finished at:
>> 2018-01-23T18:28:27-08:00\n[INFO] Final Memory: 23M/79M\n[INFO]
>>
------------------------------------------------------------------------\n[ERROR]

>> Failed to execute goal on project metron-interface: Could not resolve
>> dependencies for project org.apache.metron:metron-interface:pom:0.4.2:
>> Could not find artifact sun.jdk:tools:jar:LATEST at specified path
>>
/Library/Java/JavaVirtualMachines/jdk-9.0.4.jdk/Contents/Home/../lib/tools.jar

>> -> [Help 1]\n[ERROR] \n[ERROR] To see the full stack trace of the
errors,
>> re-run Maven with the -e switch.\n[ERROR] Re-run Maven using the -X
switch
>> to enable full debug logging.\n[ERROR] \n[ERROR] For more information
about
>> the errors and possible solutions, please read the following
>> articles:\n[ERROR] [Help 1]
>>
http://cwiki.apache.org/confluence/display/MAVEN/DependencyResolutionException\n[ERROR]
>> <
http://cwiki.apache.org/confluence/display/MAVEN/DependencyResolutionException/n%5BERROR%5D>

>> \n[ERROR] After correcting the problems, you can resume the build with
the
>> command\n[ERROR] mvn <goals> -rf :metron-interface", "stdout_lines":
>> ["[INFO] Scanning for projects...", "[INFO]
>>
------------------------------------------------------------------------",
>> "[INFO] Reactor Build Order:", "[INFO] ", "[INFO] Metron", "[INFO]
>> metron-stellar", "[INFO] stellar-common", "[INFO] metron-analytics",
>> "[INFO] metron-maas-common", "[INFO] metron-platform", "[INFO]
>> metron-zookeeper", "[INFO] metron-test-utilities", "[INFO]
>> metron-integration-test", "[INFO] metron-maas-service", "[INFO]
>> metron-common", "[INFO] metron-statistics", "[INFO] metron-writer",
"[INFO]
>> metron-storm-kafka-override", "[INFO] metron-storm-kafka", "[INFO]
>> metron-hbase", "[INFO] metron-profiler-common", "[INFO]
>> metron-profiler-client", "[INFO] metron-profiler", "[INFO]
>> metron-hbase-client", "[INFO] metron-enrichment", "[INFO]
metron-indexing",
>> "[INFO] metron-solr", "[INFO] metron-pcap", "[INFO] metron-parsers",
>> "[INFO] metron-pcap-backend", "[INFO] metron-data-management", "[INFO]
>> metron-api", "[INFO] metron-management", "[INFO] elasticsearch-shaded",
>> "[INFO] metron-elasticsearch", "[INFO] metron-deployment", "[INFO]
Metron
>> Ambari Management Pack", "[INFO] metron-contrib", "[INFO]
metron-docker",
>> "[INFO] metron-interface", "[INFO] metron-config", "[INFO]
metron-alerts",
>> "[INFO] metron-rest-client", "[INFO] metron-rest", "[INFO] site-book",
>> "[INFO] 3rd party Functions (just for tests)", "[INFO] ", "[INFO] Using
the
>> MultiThreadedBuilder implementation with a thread count of 8", "[INFO]
>> ",
>> "[INFO]
>>
------------------------------------------------------------------------",
>> "[INFO] Building Metron 0.4.2", "[INFO]
>>
------------------------------------------------------------------------",
>> "[INFO] ", "[INFO] --- maven-clean-plugin:2.5:clean (default-clean) @
>> Metron ---", "[INFO] ", "[INFO] --- maven-enforcer-plugin:1.4.1:enforce
>> (enforce-versions) @ Metron ---", "[INFO] ", "[INFO] ---
>> jacoco-maven-plugin:0.7.9:prepare-agent (default) @ Metron ---", "[INFO]
>> argLine set to
>>
-javaagent:/Users/sujay/.m2/repository/org/jacoco/org.jacoco.agent/0.7.9/org.jacoco.agent-0.7.9-runtime.jar=destfile=/Users/sujay/Downloads/apache-metron-0.4.2-rc2/target/jacoco.exec",

>> "[INFO] ", "[INFO] --- jacoco-maven-plugin:0.7.9:report (report) @
Metron
>> ---", "[INFO] Skipping JaCoCo execution due to missing execution data
>> file.", "[INFO]
>> ", "[INFO]
>>
------------------------------------------------------------------------",
>> "[INFO] Building metron-stellar 0.4.2", "[INFO]
>>
------------------------------------------------------------------------",
>> "[INFO]
>> ", "[INFO]
>> ", "[INFO]
>>
------------------------------------------------------------------------",
>> "[INFO] Building metron-platform 0.4.2", "[INFO]
>>
------------------------------------------------------------------------",
>> "[INFO]
>>
------------------------------------------------------------------------",
>> "[INFO] Building metron-analytics 0.4.2", "[INFO]
>>
------------------------------------------------------------------------",
>> "[INFO]
>> ", "[INFO]
>>
------------------------------------------------------------------------",
>> "[INFO]
>> ", "[INFO]
>>
------------------------------------------------------------------------",
>> "[INFO] Building metron-contrib 0.4.2", "[INFO]
>>
------------------------------------------------------------------------",
>> "[INFO] Building metron-deployment 0.4.2", "[INFO]
>>
------------------------------------------------------------------------",
>> "[INFO]
>> ", "[INFO]
>>
------------------------------------------------------------------------",
>> "[INFO] Building metron-interface 0.4.2", "[INFO]
>>
------------------------------------------------------------------------",
>> "[INFO]
>> ", "[INFO]
>>
------------------------------------------------------------------------",
>> "[INFO] Building site-book 0.4.2", "[INFO]
>>
------------------------------------------------------------------------",
>> "[INFO] ", "[INFO] --- maven-clean-plugin:2.5:clean (default-clean) @
>> metron-contrib ---", "[INFO] ", "[INFO] --- maven-clean-plugin:2.5:clean
>> (default-clean) @ metron-deployment ---", "[INFO] ", "[INFO] ---
>> maven-enforcer-plugin:1.4.1:enforce (enforce-versions) @
metron-deployment
>> ---", "[INFO] ", "[INFO] --- maven-enforcer-plugin:1.4.1:enforce
>> (enforce-versions) @ metron-contrib ---", "[INFO] ", "[INFO] ---
>> maven-clean-plugin:2.5:clean (default-clean) @ site-book ---", "[INFO]
",
>> "[INFO] --- jacoco-maven-plugin:0.7.9:prepare-agent (default) @
>> metron-contrib ---", "[INFO] ", "[INFO] ---
>> jacoco-maven-plugin:0.7.9:prepare-agent (default) @ metron-deployment
---",
>> "[INFO] argLine set to
>>
-javaagent:/Users/sujay/.m2/repository/org/jacoco/org.jacoco.agent/0.7.9/org.jacoco.agent-0.7.9-runtime.jar=destfile=/Users/sujay/Downloads/apache-metron-0.4.2-rc2/metron-contrib/target/jacoco.exec",

>> "[INFO] ", "[INFO] --- maven-enforcer-plugin:1.4.1:enforce
>> (enforce-versions) @ site-book ---", "[INFO] ", "[INFO] ---
>> jacoco-maven-plugin:0.7.9:report (report) @ metron-contrib ---", "[INFO]
>> argLine set to
>>
-javaagent:/Users/sujay/.m2/repository/org/jacoco/org.jacoco.agent/0.7.9/org.jacoco.agent-0.7.9-runtime.jar=destfile=/Users/sujay/Downloads/apache-metron-0.4.2-rc2/metron-deployment/target/jacoco.exec",

>> "[INFO] ", "[INFO] --- jacoco-maven-plugin:0.7.9:report (report) @
>> metron-deployment ---", "[INFO] Skipping JaCoCo execution due to missing
>> execution data file.", "[INFO] ", "[INFO] ---
>> jacoco-maven-plugin:0.7.9:prepare-agent (default) @ site-book ---",
"[INFO]
>> Skipping JaCoCo execution due to missing execution data file.", "[INFO]
>> ",
>> "[INFO]
>> ", "[INFO]
>>
------------------------------------------------------------------------",
>> "[INFO] Building Metron Ambari Management Pack 0.4.2.0", "[INFO]
>>
------------------------------------------------------------------------",
>> "[INFO]
>>
------------------------------------------------------------------------",
>> "[INFO] Building metron-docker 0.4.2", "[INFO]
>>
------------------------------------------------------------------------",
>> "[INFO] argLine set to
>>
-javaagent:/Users/sujay/.m2/repository/org/jacoco/org.jacoco.agent/0.7.9/org.jacoco.agent-0.7.9-runtime.jar=destfile=/Users/sujay/Downloads/apache-metron-0.4.2-rc2/site-book/target/jacoco.exec",

>> "[INFO] ", "[INFO] --- maven-site-plugin:3.4:site (default) @ site-book
>> ---", "[INFO]
>>
------------------------------------------------------------------------",
>> "[INFO] Reactor Summary:", "[INFO] ", "[INFO] Metron
>> ............................................. SUCCESS [ 2.170 s]",
>> "[INFO] metron-stellar ..................................... SKIPPED",
>> "[INFO] stellar-common ..................................... SKIPPED",
>> "[INFO] metron-analytics ................................... SKIPPED",
>> "[INFO] metron-maas-common ................................. SKIPPED",
>> "[INFO] metron-platform .................................... SKIPPED",
>> "[INFO] metron-zookeeper ................................... SKIPPED",
>> "[INFO] metron-test-utilities .............................. SKIPPED",
>> "[INFO] metron-integration-test ............................ SKIPPED",
>> "[INFO] metron-maas-service ................................ SKIPPED",
>> "[INFO] metron-common ...................................... SKIPPED",
>> "[INFO] metron-statistics .................................. SKIPPED",
>> "[INFO] metron-writer ...................................... SKIPPED",
>> "[INFO] metron-storm-kafka-override ........................ SKIPPED",
>> "[INFO] metron-storm-kafka ................................. SKIPPED",
>> "[INFO] metron-hbase ....................................... SKIPPED",
>> "[INFO] metron-profiler-common ............................. SKIPPED",
>> "[INFO] metron-profiler-client ............................. SKIPPED",
>> "[INFO] metron-profiler .................................... SKIPPED",
>> "[INFO] metron-hbase-client ................................ SKIPPED",
>> "[INFO] metron-enrichment .................................. SKIPPED",
>> "[INFO] metron-indexing .................................... SKIPPED",
>> "[INFO] metron-solr ........................................ SKIPPED",
>> "[INFO] metron-pcap ........................................ SKIPPED",
>> "[INFO] metron-parsers ..................................... SKIPPED",
>> "[INFO] metron-pcap-backend ................................ SKIPPED",
>> "[INFO] metron-data-management ............................. SKIPPED",
>> "[INFO] metron-api ......................................... SKIPPED",
>> "[INFO] metron-management .................................. SKIPPED",
>> "[INFO] elasticsearch-shaded ............................... SKIPPED",
>> "[INFO] metron-elasticsearch ............................... SKIPPED",
>> "[INFO] metron-deployment .................................. SUCCESS [
>> 0.043 s]", "[INFO] Metron Ambari Management Pack ......................
>> SKIPPED", "[INFO] metron-contrib .....................................
>> SUCCESS [ 0.043 s]", "[INFO] metron-docker
>> ...................................... SKIPPED", "[INFO]
metron-interface
>> ................................... FAILURE [ 0.115 s]", "[INFO]
>> metron-config ...................................... SKIPPED", "[INFO]
>> metron-alerts ...................................... SKIPPED", "[INFO]
>> metron-rest-client ................................. SKIPPED", "[INFO]
>> metron-rest ........................................ SKIPPED", "[INFO]
>> site-book .......................................... SKIPPED", "[INFO]
3rd
>> party Functions (just for tests) ............... SKIPPED", "[INFO]
>>
------------------------------------------------------------------------",
>> "[INFO] BUILD FAILURE", "[INFO]
>>
------------------------------------------------------------------------",
>> "[INFO] Total time: 3.038 s (Wall Clock)", "[INFO] Finished at:
>> 2018-01-23T18:28:27-08:00", "[INFO] Final Memory: 23M/79M", "[INFO]
>>
------------------------------------------------------------------------",
>> "[ERROR] Failed to execute goal on project metron-interface: Could not
>> resolve dependencies for project
>> org.apache.metron:metron-interface:pom:0.4.2: Could not find artifact
>> sun.jdk:tools:jar:LATEST at specified path
>>
/Library/Java/JavaVirtualMachines/jdk-9.0.4.jdk/Contents/Home/../lib/tools.jar

>> -> [Help 1]", "[ERROR] ", "[ERROR] To see the full stack trace of the
>> errors, re-run Maven with the -e switch.", "[ERROR] Re-run Maven using
the
>> -X switch to enable full debug logging.", "[ERROR] ", "[ERROR] For more
>> information about the errors and possible solutions, please read the
>> following articles:", "[ERROR] [Help 1]
>>
http://cwiki.apache.org/confluence/display/MAVEN/DependencyResolutionException",

>> "[ERROR] ", "[ERROR] After correcting the problems, you can resume the
>> build with the command", "[ERROR] mvn <goals> -rf :metron-interface"],
>> "warnings": []}
>>
>> --
>> Sujay Jaladi MS, CISSP, CSOX, CCSK, Security+, CCNA, Server+
>> Information Security
>>
>>
>
>
> --
> Sujay Jaladi MS, CISSP, CSOX, CCSK, Security+, CCNA, Server+
> Information Security
>

Mime
  • Unnamed multipart/alternative (inline, None, 0 bytes)
View raw message