metron-dev mailing list archives

Site index · List index
Message view « Date » · « Thread »
Top « Date » · « Thread »
From Simon Elliston Ball <si...@simonellistonball.com>
Subject Re: Build Failed for 0.7.2
Date Wed, 22 May 2019 07:26:48 GMT
See https://github.com/apache/metron/pull/1419 which fixes this issue and
will likely make it to master pretty soon.

FYI: probably only necessary to post things like this to one list, not to
add them to random JIRAs.

Simon

On Wed, 22 May 2019 at 06:41, Farrukh Naveed Anjum <anjum.farrukh@gmail.com>
wrote:

> Requires: /bin/bash
> Checking for unpackaged file(s): /usr/lib/rpm/check-files
> /root/BUILDROOT/metron-0.7.2-root
> error: Installed (but unpackaged) file(s) found:
>    /usr/metron/0.7.2/config/zookeeper/parsers/leef.json
>     Macro %_prerelease has empty body
>     Macro %_prerelease has empty body
>     Installed (but unpackaged) file(s) found:
>    /usr/metron/0.7.2/config/zookeeper/parsers/leef.json
>
>
> RPM build errors:
> RPM build errors encountered
> [ERROR] Command execution failed.
> org.apache.commons.exec.ExecuteException: Process exited with an error: 1
> (Exit value: 1)
> at
>
> org.apache.commons.exec.DefaultExecutor.executeInternal(DefaultExecutor.java:404)
> at
> org.apache.commons.exec.DefaultExecutor.execute(DefaultExecutor.java:166)
> at org.codehaus.mojo.exec.ExecMojo.executeCommandLine(ExecMojo.java:764)
> at org.codehaus.mojo.exec.ExecMojo.executeCommandLine(ExecMojo.java:711)
> at org.codehaus.mojo.exec.ExecMojo.execute(ExecMojo.java:289)
> at
>
> org.apache.maven.plugin.DefaultBuildPluginManager.executeMojo(DefaultBuildPluginManager.java:134)
> at
>
> org.apache.maven.lifecycle.internal.MojoExecutor.execute(MojoExecutor.java:207)
> at
>
> org.apache.maven.lifecycle.internal.MojoExecutor.execute(MojoExecutor.java:153)
> at
>
> org.apache.maven.lifecycle.internal.MojoExecutor.execute(MojoExecutor.java:145)
> at
>
> org.apache.maven.lifecycle.internal.LifecycleModuleBuilder.buildProject(LifecycleModuleBuilder.java:116)
> at
>
> org.apache.maven.lifecycle.internal.LifecycleModuleBuilder.buildProject(LifecycleModuleBuilder.java:80)
> at
>
> org.apache.maven.lifecycle.internal.builder.singlethreaded.SingleThreadedBuilder.build(SingleThreadedBuilder.java:51)
> at
>
> org.apache.maven.lifecycle.internal.LifecycleStarter.execute(LifecycleStarter.java:128)
> at org.apache.maven.DefaultMaven.doExecute(DefaultMaven.java:307)
> at org.apache.maven.DefaultMaven.doExecute(DefaultMaven.java:193)
> at org.apache.maven.DefaultMaven.execute(DefaultMaven.java:106)
> at org.apache.maven.cli.MavenCli.execute(MavenCli.java:863)
> at org.apache.maven.cli.MavenCli.doMain(MavenCli.java:288)
> at org.apache.maven.cli.MavenCli.main(MavenCli.java:199)
> at sun.reflect.NativeMethodAccessorImpl.invoke0(Native Method)
> at
>
> sun.reflect.NativeMethodAccessorImpl.invoke(NativeMethodAccessorImpl.java:62)
> at
>
> sun.reflect.DelegatingMethodAccessorImpl.invoke(DelegatingMethodAccessorImpl.java:43)
> at java.lang.reflect.Method.invoke(Method.java:498)
> at
>
> org.codehaus.plexus.classworlds.launcher.Launcher.launchEnhanced(Launcher.java:289)
> at
> org.codehaus.plexus.classworlds.launcher.Launcher.launch(Launcher.java:229)
> at
>
> org.codehaus.plexus.classworlds.launcher.Launcher.mainWithExitCode(Launcher.java:415)
> at
> org.codehaus.plexus.classworlds.launcher.Launcher.main(Launcher.java:356)
> [INFO]
> ------------------------------------------------------------------------
> [INFO] BUILD FAILURE
> [INFO]
> ------------------------------------------------------------------------
>
>
> --
> *Best Regards*
> Farrukh Naveed Anjum
> *M:* +92 321 5083954 (WhatsApp Enabled)
> *W:* https://www.farrukh.cc/
>


-- 
--
simon elliston ball
@sireb

Mime
  • Unnamed multipart/alternative (inline, None, 0 bytes)
View raw message