metron-issues mailing list archives

Site index · List index
Message view « Date » · « Thread »
Top « Date » · « Thread »
From "ASF GitHub Bot (JIRA)" <j...@apache.org>
Subject [jira] [Commented] (METRON-408) Intermittent Failures of Profile Integration Tests
Date Wed, 07 Sep 2016 20:46:20 GMT

    [ https://issues.apache.org/jira/browse/METRON-408?page=com.atlassian.jira.plugin.system.issuetabpanels:comment-tabpanel&focusedCommentId=15471743#comment-15471743
] 

ASF GitHub Bot commented on METRON-408:
---------------------------------------

Github user cestella commented on the issue:

    https://github.com/apache/incubator-metron/pull/245
  
    Looks good, +1


> Intermittent Failures of Profile Integration Tests 
> ---------------------------------------------------
>
>                 Key: METRON-408
>                 URL: https://issues.apache.org/jira/browse/METRON-408
>             Project: Metron
>          Issue Type: Bug
>            Reporter: Nick Allen
>            Assignee: Nick Allen
>
> {code}
> Tests run: 5, Failures: 0, Errors: 1, Skipped: 0, Time elapsed: 104.015 sec <<<
FAILURE!
> testExample1(org.apache.metron.profiler.integration.ProfilerIntegrationTest)  Time elapsed:
27.212 sec  <<< ERROR!
> java.lang.IllegalStateException: No results found
> 	at org.apache.metron.profiler.integration.ProfilerIntegrationTest.readDouble(ProfilerIntegrationTest.java:231)
> 	at org.apache.metron.profiler.integration.ProfilerIntegrationTest.testExample1(ProfilerIntegrationTest.java:136)
> Results :
> Tests in error: 
>   testExample1(org.apache.metron.profiler.integration.ProfilerIntegrationTest): No results
found
> {code}
> The exception that actually causes this problem looks like the following.
> {code}
> 2016-09-07 20:00:49 ERROR ProfileSplitterBolt:97 - Unexpected failure: message='Fatal:
Unable to find valid profiler definition', tuple='source: kafkaSpout:3, stream: default, id:
{}, [[B@602c79d6]'
> java.lang.IllegalArgumentException: Fatal: Unable to find valid profiler definition
> 	at org.apache.metron.profiler.bolt.ProfileSplitterBolt.doExecute(ProfileSplitterBolt.java:114)
> 	at org.apache.metron.profiler.bolt.ProfileSplitterBolt.execute(ProfileSplitterBolt.java:94)
> 2016-09-07 20:00:49 ERROR executor:0 - 
> java.lang.IllegalArgumentException: Fatal: Unable to find valid profiler definition
> 	at org.apache.metron.profiler.bolt.ProfileSplitterBolt.doExecute(ProfileSplitterBolt.java:114)
> 	at org.apache.metron.profiler.bolt.ProfileSplitterBolt.execute(ProfileSplitterBolt.java:94)
> 2016-09-07 20:01:10 ERROR ProfileSplitterBolt:97 - Unexpected failure: message='Fatal:
Unable to find valid profiler definition', tuple='source: kafkaSpout:3, stream: default, id:
{}, [[B@6e01711d]'
> java.lang.IllegalArgumentException: Fatal: Unable to find valid profiler definition
> 	at org.apache.metron.profiler.bolt.ProfileSplitterBolt.doExecute(ProfileSplitterBolt.java:114)
> 	at org.apache.metron.profiler.bolt.ProfileSplitterBolt.execute(ProfileSplitterBolt.java:94)
> {code}



--
This message was sent by Atlassian JIRA
(v6.3.4#6332)

Mime
View raw message