metron-issues mailing list archives

Site index · List index
Message view « Date » · « Thread »
Top « Date » · « Thread »
From "Otto Fowler (JIRA)" <j...@apache.org>
Subject [jira] [Created] (METRON-1843) ElasticsearchUpdateIntegrationTest can fail sometimes
Date Wed, 24 Oct 2018 17:23:00 GMT
Otto Fowler created METRON-1843:
-----------------------------------

             Summary: ElasticsearchUpdateIntegrationTest can fail sometimes
                 Key: METRON-1843
                 URL: https://issues.apache.org/jira/browse/METRON-1843
             Project: Metron
          Issue Type: Bug
            Reporter: Otto Fowler


 

 

Tests run: 3, Failures: 1, Errors: 0, Skipped: 0, Time elapsed: 16.437 sec <<< FAILURE!
- in org.apache.metron.elasticsearch.integration.ElasticsearchUpdateIntegrationTest test(org.apache.metron.elasticsearch.integration.ElasticsearchUpdateIntegrationTest)
Time elapsed: 6.205 sec <<< FAILURE! java.lang.AssertionError: Data store is not
updated!. Actual: 0 at org.junit.Assert.fail(Assert.java:88) at org.junit.Assert.failEquals(Assert.java:185)
at org.junit.Assert.assertNotEquals(Assert.java:199) at org.apache.metron.indexing.dao.UpdateIntegrationTest.test(UpdateIntegrationTest.java:132)
at sun.reflect.NativeMethodAccessorImpl.invoke0(Native Method) at sun.reflect.NativeMethodAccessorImpl.invoke(NativeMethodAccessorImpl.java:62)
at sun.reflect.DelegatingMethodAccessorImpl.invoke(DelegatingMethodAccessorImpl.java:43) at
java.lang.reflect.Method.invoke(Method.java:498) at org.junit.runners.model.FrameworkMethod$1.runReflectiveCall(FrameworkMethod.java:50)
at org.junit.internal.runners.model.ReflectiveCallable.run(ReflectiveCallable.java:12) at
org.junit.runners.model.FrameworkMethod.invokeExplosively(FrameworkMethod.java:47) at org.junit.internal.runners.statements.InvokeMethod.evaluate(InvokeMethod.java:17)
at org.junit.internal.runners.statements.RunBefores.evaluate(RunBefores.java:26) at org.junit.internal.runners.statements.RunAfters.evaluate(RunAfters.java:27)
at org.junit.runners.ParentRunner.runLeaf(ParentRunner.java:325) at org.junit.runners.BlockJUnit4ClassRunner.runChild(BlockJUnit4ClassRunner.java:78)
at org.junit.runners.BlockJUnit4ClassRunner.runChild(BlockJUnit4ClassRunner.java:57) at org.junit.runners.ParentRunner$3.run(ParentRunner.java:290)
at org.junit.runners.ParentRunner$1.schedule(ParentRunner.java:71) at org.junit.runners.ParentRunner.runChildren(ParentRunner.java:288)
at org.junit.runners.ParentRunner.access$000(ParentRunner.java:58) at org.junit.runners.ParentRunner$2.evaluate(ParentRunner.java:268)
at org.junit.internal.runners.statements.RunBefores.evaluate(RunBefores.java:26) at org.junit.internal.runners.statements.RunAfters.evaluate(RunAfters.java:27)
at org.junit.runners.ParentRunner.run(ParentRunner.java:363) at org.apache.maven.surefire.junit4.JUnit4Provider.execute(JUnit4Provider.java:283)
at org.apache.maven.surefire.junit4.JUnit4Provider.executeWithRerun(JUnit4Provider.java:173)
at org.apache.maven.surefire.junit4.JUnit4Provider.executeTestSet(JUnit4Provider.java:153)
at org.apache.maven.surefire.junit4.JUnit4Provider.invoke(JUnit4Provider.java:128) at org.apache.maven.surefire.booter.ForkedBooter.invokeProviderInSameClassLoader(ForkedBooter.java:203)
at org.apache.maven.surefire.booter.ForkedBooter.runSuitesInProcess(ForkedBooter.java:155)



--
This message was sent by Atlassian JIRA
(v7.6.3#76005)

Mime
View raw message