mina-dev mailing list archives

Site index · List index
Message view « Date » · « Thread »
Top « Date » · « Thread »
From "John Conlon (JIRA)" <j...@apache.org>
Subject [jira] Created: (DIRMINA-293) Test failures when building 1.1.0-SNAPSHOT
Date Wed, 25 Oct 2006 21:38:16 GMT
Test failures when building 1.1.0-SNAPSHOT
------------------------------------------

                 Key: DIRMINA-293
                 URL: http://issues.apache.org/jira/browse/DIRMINA-293
             Project: Directory MINA
          Issue Type: Bug
          Components: Core
    Affects Versions: 1.1
         Environment: GNU/Linux 2.6.9-42.0.3.ELsmp, JDK 1.5.0_06
            Reporter: John Conlon


Encountering two test failures with Mina core when attempting to build latest apacheds trunks.

(Mina 1.0.0 release builds and tests fine.)

Here is the surefire outputs:

-------------------------------------------------------------------------------
Test set: org.apache.mina.transport.vmpipe.VmPipeBindTest
-------------------------------------------------------------------------------
Tests run: 5, Failures: 1, Errors: 0, Skipped: 0, Time elapsed: 1.126 sec <<< FAILURE!
testAnonymousBind(org.apache.mina.transport.vmpipe.VmPipeBindTest)  Time elapsed: 0.004 sec
 <<< FAILURE!
junit.framework.AssertionFailedError
        at junit.framework.Assert.fail(Assert.java:47)
        at junit.framework.Assert.assertTrue(Assert.java:20)
        at junit.framework.Assert.assertTrue(Assert.java:27)
        at org.apache.mina.transport.AbstractBindTest.testAnonymousBind(AbstractBindTest.java:131)
        at sun.reflect.NativeMethodAccessorImpl.invoke0(Native Method)
        at sun.reflect.NativeMethodAccessorImpl.invoke(NativeMethodAccessorImpl.java:39)
        at sun.reflect.DelegatingMethodAccessorImpl.invoke(DelegatingMethodAccessorImpl.java:25)
        at java.lang.reflect.Method.invoke(Method.java:585)
        at junit.framework.TestCase.runTest(TestCase.java:154)
        at junit.framework.TestCase.runBare(TestCase.java:127)
        at junit.framework.TestResult$1.protect(TestResult.java:106)
        at junit.framework.TestResult.runProtected(TestResult.java:124)
        at junit.framework.TestResult.run(TestResult.java:109)
        at junit.framework.TestCase.run(TestCase.java:118)
        at junit.framework.TestSuite.runTest(TestSuite.java:208)
        at junit.framework.TestSuite.run(TestSuite.java:203)
        at sun.reflect.NativeMethodAccessorImpl.invoke0(Native Method)
        at sun.reflect.NativeMethodAccessorImpl.invoke(NativeMethodAccessorImpl.java:39)
        at sun.reflect.DelegatingMethodAccessorImpl.invoke(DelegatingMethodAccessorImpl.java:25)
        at java.lang.reflect.Method.invoke(Method.java:585)
        at org.apache.maven.surefire.junit.JUnitTestSet.execute(JUnitTestSet.java:210)
        at org.apache.maven.surefire.suite.AbstractDirectoryTestSuite.executeTestSet(AbstractDirectoryTestSuite.java:135)
        at org.apache.maven.surefire.suite.AbstractDirectoryTestSuite.execute(AbstractDirectoryTestSuite.java:122)
        at org.apache.maven.surefire.Surefire.run(Surefire.java:129)
        at sun.reflect.NativeMethodAccessorImpl.invoke0(Native Method)
        at sun.reflect.NativeMethodAccessorImpl.invoke(NativeMethodAccessorImpl.java:39)
        at sun.reflect.DelegatingMethodAccessorImpl.invoke(DelegatingMethodAccessorImpl.java:25)
        at java.lang.reflect.Method.invoke(Method.java:585)
        at org.apache.maven.surefire.booter.SurefireBooter.runSuitesInProcess(SurefireBooter.java:225)
        at org.apache.maven.surefire.booter.SurefireBooter.main(SurefireBooter.java:747)

-------------------------------------------------------------------------------
Test set: org.apache.mina.transport.socket.nio.SocketBindTest
-------------------------------------------------------------------------------
Tests run: 5, Failures: 1, Errors: 0, Skipped: 0, Time elapsed: 2.579 sec <<< FAILURE!
testAnonymousBind(org.apache.mina.transport.socket.nio.SocketBindTest)  Time elapsed: 0.002
sec  <<< FAILURE!
junit.framework.AssertionFailedError
        at junit.framework.Assert.fail(Assert.java:47)
        at junit.framework.Assert.assertTrue(Assert.java:20)
        at junit.framework.Assert.assertTrue(Assert.java:27)
        at org.apache.mina.transport.AbstractBindTest.testAnonymousBind(AbstractBindTest.java:131)
        at sun.reflect.NativeMethodAccessorImpl.invoke0(Native Method)
        at sun.reflect.NativeMethodAccessorImpl.invoke(NativeMethodAccessorImpl.java:39)
        at sun.reflect.DelegatingMethodAccessorImpl.invoke(DelegatingMethodAccessorImpl.java:25)
        at java.lang.reflect.Method.invoke(Method.java:585)
        at junit.framework.TestCase.runTest(TestCase.java:154)
        at junit.framework.TestCase.runBare(TestCase.java:127)
        at junit.framework.TestResult$1.protect(TestResult.java:106)
        at junit.framework.TestResult.runProtected(TestResult.java:124)
        at junit.framework.TestResult.run(TestResult.java:109)
        at junit.framework.TestCase.run(TestCase.java:118)
        at junit.framework.TestSuite.runTest(TestSuite.java:208)
        at junit.framework.TestSuite.run(TestSuite.java:203)
        at sun.reflect.NativeMethodAccessorImpl.invoke0(Native Method)
        at sun.reflect.NativeMethodAccessorImpl.invoke(NativeMethodAccessorImpl.java:39)
        at sun.reflect.DelegatingMethodAccessorImpl.invoke(DelegatingMethodAccessorImpl.java:25)
        at java.lang.reflect.Method.invoke(Method.java:585)
        at org.apache.maven.surefire.junit.JUnitTestSet.execute(JUnitTestSet.java:210)
        at org.apache.maven.surefire.suite.AbstractDirectoryTestSuite.executeTestSet(AbstractDirectoryTestSuite.java:135)
        at org.apache.maven.surefire.suite.AbstractDirectoryTestSuite.execute(AbstractDirectoryTestSuite.java:122)
        at org.apache.maven.surefire.Surefire.run(Surefire.java:129)
        at sun.reflect.NativeMethodAccessorImpl.invoke0(Native Method)
        at sun.reflect.NativeMethodAccessorImpl.invoke(NativeMethodAccessorImpl.java:39)
        at sun.reflect.DelegatingMethodAccessorImpl.invoke(DelegatingMethodAccessorImpl.java:25)
        at java.lang.reflect.Method.invoke(Method.java:585)
        at org.apache.maven.surefire.booter.SurefireBooter.runSuitesInProcess(SurefireBooter.java:225)
        at org.apache.maven.surefire.booter.SurefireBooter.main(SurefireBooter.java:747)



-- 
This message is automatically generated by JIRA.
-
If you think it was sent incorrectly contact one of the administrators: http://issues.apache.org/jira/secure/Administrators.jspa
-
For more information on JIRA, see: http://www.atlassian.com/software/jira

        

Mime
View raw message