mina-dev mailing list archives

Site index · List index
Message view « Date » · « Thread »
Top « Date » · « Thread »
From Emmanuel Lécharny <elecha...@gmail.com>
Subject Re: [VOTE] Release SSHD 1.0.0 (2nd try)
Date Wed, 02 Sep 2015 23:16:40 GMT
Le 02/09/15 14:51, Lyor Goldstein a écrit :
> +1 (if developers can vote for the very code they wrote... :-))

I tested the code (from git and from the published package, and I get an
error :

...
Tests run: 10, Failures: 0, Errors: 1, Skipped: 0, Time elapsed: 2.744
sec <<< FAILURE! - in org.apache.sshd.PortForwardingTest
testLocalForwarding(org.apache.sshd.PortForwardingTest)  Time elapsed:
0.156 sec  <<< ERROR!
java.net.ConnectException: Connection refused
    at java.net.PlainSocketImpl.socketConnect(Native Method)
    at
java.net.AbstractPlainSocketImpl.doConnect(AbstractPlainSocketImpl.java:345)
    at
java.net.AbstractPlainSocketImpl.connectToAddress(AbstractPlainSocketImpl.java:206)
    at
java.net.AbstractPlainSocketImpl.connect(AbstractPlainSocketImpl.java:188)
    at java.net.SocksSocketImpl.connect(SocksSocketImpl.java:392)
    at java.net.Socket.connect(Socket.java:589)
    at java.net.Socket.connect(Socket.java:538)
    at java.net.Socket.<init>(Socket.java:434)
    at java.net.Socket.<init>(Socket.java:211)
    at
org.apache.sshd.PortForwardingTest.testLocalForwarding(PortForwardingTest.java:332)
...
Results :

Tests in error:
  PortForwardingTest.testLocalForwarding:332 » Connect Connection refused

Tests run: 441, Failures: 0, Errors: 1, Skipped: 12

[INFO]
------------------------------------------------------------------------
[INFO] Reactor Summary:
[INFO]
[INFO] Apache Mina SSHD ................................... SUCCESS [
24.408 s]
[INFO] Apache Mina SSHD :: Core ........................... FAILURE
[02:46 min]
[INFO] Apache Mina SSHD :: Git ............................ SKIPPED
[INFO] Apache Mina SSHD :: Assembly ....................... SKIPPED
[INFO]
------------------------------------------------------------------------
[INFO] BUILD FAILURE
[INFO]
------------------------------------------------------------------------
[INFO] Total time: 03:11 min
[INFO] Finished at: 2015-09-03T01:15:16+02:00
[INFO] Final Memory: 39M/247M
[INFO]
------------------------------------------------------------------------


Mime
View raw message