mrunit-dev mailing list archives

Site index · List index
Message view « Date » · « Thread »
Top « Date » · « Thread »
From "Dave Beech (JIRA)" <j...@apache.org>
Subject [jira] [Updated] (MRUNIT-160) mvn package fails on Mac OS X 10.8.2
Date Sun, 11 Nov 2012 14:45:12 GMT

     [ https://issues.apache.org/jira/browse/MRUNIT-160?page=com.atlassian.jira.plugin.system.issuetabpanels:all-tabpanel ]

Dave Beech updated MRUNIT-160:
------------------------------

    Description: 
After cloning the repo and trying to build the jars by running "mvn package", the command fails. The log is below.
I've finally been able to build it by running "mvn package -DskipTests -fn" and commenting out the Rat dependency in pom.xml.

(log attached)

  was:
After cloning the repo and trying to build the jars by running "mvn package", the command fails. The log is below.
I've finally been able to build it by running "mvn package -DskipTests -fn" and commenting out the Rat dependency in pom.xml.

Apache Maven 3.0.3 (r1075438; 2011-02-28 19:31:09+0200)
Maven home: /usr/share/maven
Java version: 1.7.0_10-ea, vendor: Oracle Corporation
Java home: /Library/Java/JavaVirtualMachines/jdk1.7.0_10.jdk/Contents/Home/jre
Default locale: en_US, platform encoding: UTF-8
OS name: "mac os x", version: "10.8.2", arch: "x86_64", family: "mac"
[INFO] Error stacktraces are turned on.
[DEBUG] Reading global settings from /usr/share/maven/conf/settings.xml
[DEBUG] Reading user settings from /Users/dan/.m2/settings.xml
[DEBUG] Using local repository at /Users/dan/.m2/repository
[DEBUG] Using manager EnhancedLocalRepositoryManager with priority 10 for /Users/dan/.m2/repository
[INFO] Scanning for projects...
[DEBUG] Extension realms for project org.apache.mrunit:mrunit:jar:1.0.0-SNAPSHOT: (none)
[DEBUG] Looking up lifecyle mappings for packaging jar from ClassRealm[plexus.core, parent: null]
[DEBUG] === REACTOR BUILD PLAN ================================================
[DEBUG] Project: org.apache.mrunit:mrunit:jar:1.0.0-SNAPSHOT
[DEBUG] Tasks:   [package]
[DEBUG] Style:   Regular
[DEBUG] =======================================================================
[INFO]                                                                         
[INFO] ------------------------------------------------------------------------
[INFO] Building MRUnit 1.0.0-SNAPSHOT
[INFO] ------------------------------------------------------------------------
[DEBUG] Lifecycle default -> [validate, initialize, generate-sources, process-sources, generate-resources, process-resources, compile, process-classes, generate-test-sources, process-test-sources, generate-test-resources, process-test-resources, test-compile, process-test-classes, test, prepare-package, package, pre-integration-test, integration-test, post-integration-test, verify, install, deploy]
[DEBUG] Lifecycle clean -> [pre-clean, clean, post-clean]
[DEBUG] Lifecycle site -> [pre-site, site, post-site, site-deploy]
[DEBUG] Lifecycle default -> [validate, initialize, generate-sources, process-sources, generate-resources, process-resources, compile, process-classes, generate-test-sources, process-test-sources, generate-test-resources, process-test-resources, test-compile, process-test-classes, test, prepare-package, package, pre-integration-test, integration-test, post-integration-test, verify, install, deploy]
[DEBUG] Lifecycle clean -> [pre-clean, clean, post-clean]
[DEBUG] Lifecycle site -> [pre-site, site, post-site, site-deploy]
[DEBUG] Lifecycle default -> [validate, initialize, generate-sources, process-sources, generate-resources, process-resources, compile, process-classes, generate-test-sources, process-test-sources, generate-test-resources, process-test-resources, test-compile, process-test-classes, test, prepare-package, package, pre-integration-test, integration-test, post-integration-test, verify, install, deploy]
[DEBUG] Lifecycle clean -> [pre-clean, clean, post-clean]
[DEBUG] Lifecycle site -> [pre-site, site, post-site, site-deploy]
[DEBUG] Lifecycle default -> [validate, initialize, generate-sources, process-sources, generate-resources, process-resources, compile, process-classes, generate-test-sources, process-test-sources, generate-test-resources, process-test-resources, test-compile, process-test-classes, test, prepare-package, package, pre-integration-test, integration-test, post-integration-test, verify, install, deploy]
[DEBUG] Lifecycle clean -> [pre-clean, clean, post-clean]
[DEBUG] Lifecycle site -> [pre-site, site, post-site, site-deploy]
[DEBUG] Lifecycle default -> [validate, initialize, generate-sources, process-sources, generate-resources, process-resources, compile, process-classes, generate-test-sources, process-test-sources, generate-test-resources, process-test-resources, test-compile, process-test-classes, test, prepare-package, package, pre-integration-test, integration-test, post-integration-test, verify, install, deploy]
[DEBUG] Lifecycle clean -> [pre-clean, clean, post-clean]
[DEBUG] Lifecycle site -> [pre-site, site, post-site, site-deploy]
[DEBUG] Lifecycle default -> [validate, initialize, generate-sources, process-sources, generate-resources, process-resources, compile, process-classes, generate-test-sources, process-test-sources, generate-test-resources, process-test-resources, test-compile, process-test-classes, test, prepare-package, package, pre-integration-test, integration-test, post-integration-test, verify, install, deploy]
[DEBUG] Lifecycle clean -> [pre-clean, clean, post-clean]
[DEBUG] Lifecycle site -> [pre-site, site, post-site, site-deploy]
[DEBUG] Lifecycle default -> [validate, initialize, generate-sources, process-sources, generate-resources, process-resources, compile, process-classes, generate-test-sources, process-test-sources, generate-test-resources, process-test-resources, test-compile, process-test-classes, test, prepare-package, package, pre-integration-test, integration-test, post-integration-test, verify, install, deploy]
[DEBUG] Lifecycle clean -> [pre-clean, clean, post-clean]
[DEBUG] Lifecycle site -> [pre-site, site, post-site, site-deploy]
[DEBUG] Lifecycle default -> [validate, initialize, generate-sources, process-sources, generate-resources, process-resources, compile, process-classes, generate-test-sources, process-test-sources, generate-test-resources, process-test-resources, test-compile, process-test-classes, test, prepare-package, package, pre-integration-test, integration-test, post-integration-test, verify, install, deploy]
[DEBUG] Lifecycle clean -> [pre-clean, clean, post-clean]
[DEBUG] Lifecycle site -> [pre-site, site, post-site, site-deploy]
[DEBUG] Lifecycle default -> [validate, initialize, generate-sources, process-sources, generate-resources, process-resources, compile, process-classes, generate-test-sources, process-test-sources, generate-test-resources, process-test-resources, test-compile, process-test-classes, test, prepare-package, package, pre-integration-test, integration-test, post-integration-test, verify, install, deploy]
[DEBUG] Lifecycle clean -> [pre-clean, clean, post-clean]
[DEBUG] Lifecycle site -> [pre-site, site, post-site, site-deploy]
[DEBUG] === PROJECT BUILD PLAN ================================================
[DEBUG] Project:       org.apache.mrunit:mrunit:1.0.0-SNAPSHOT
[DEBUG] Dependencies (collect): []
[DEBUG] Dependencies (resolve): [compile, runtime, test]
[DEBUG] Repositories (dependencies): [apache.snapshots (http://repository.apache.org/snapshots, snapshots), central (http://repo1.maven.org/maven2, releases)]
[DEBUG] Repositories (plugins)     : [central (http://repo1.maven.org/maven2, releases)]
[DEBUG] -----------------------------------------------------------------------
[DEBUG] Goal:          org.apache.maven.plugins:maven-remote-resources-plugin:1.3:process (default)
[DEBUG] Style:         Regular
[DEBUG] Configuration: <?xml version="1.0" encoding="UTF-8"?>
<configuration>
  <appendedResourcesDirectory default-value="${basedir}/src/main/appended-resources"/>
  <attached default-value="true"/>
  <basedir default-value="${basedir}"/>
  <encoding default-value="${project.build.sourceEncoding}">${encoding}</encoding>
  <excludeArtifactIds default-value="">${excludeArtifactIds}</excludeArtifactIds>
  <excludeGroupIds default-value="">${excludeGroupIds}</excludeGroupIds>
  <excludeScope default-value="">${excludeScope}</excludeScope>
  <excludeTransitive default-value="false">${excludeTransitive}</excludeTransitive>
  <includeArtifactIds default-value="">${includeArtifactIds}</includeArtifactIds>
  <includeGroupIds default-value="">${includeGroupIds}</includeGroupIds>
  <includeProjectProperties default-value="false"/>
  <includeScope default-value="runtime">${includeScope}</includeScope>
  <localRepository default-value="${localRepository}"/>
  <mavenSession default-value="${session}"/>
  <outputDirectory default-value="${project.build.directory}/maven-shared-archive-resources"/>
  <project default-value="${project}"/>
  <remoteArtifactRepositories default-value="${project.remoteArtifactRepositories}"/>
  <resourceBundles>
    <resourceBundle>org.apache:apache-jar-resource-bundle:1.4</resourceBundle>
  </resourceBundles>
  <resources default-value="${project.build.resources}"/>
  <runOnlyAtExecutionRoot default-value="false"/>
  <skip default-value="false">${remoteresources.skip}</skip>
  <useDefaultFilterDelimiters default-value="true"/>
</configuration>
[DEBUG] -----------------------------------------------------------------------
[DEBUG] Goal:          org.apache.maven.plugins:maven-resources-plugin:2.5:resources (default-resources)
[DEBUG] Style:         Regular
[DEBUG] Configuration: <?xml version="1.0" encoding="UTF-8"?>
<configuration>
  <buildFilters default-value="${project.build.filters}"/>
  <encoding default-value="${project.build.sourceEncoding}">${encoding}</encoding>
  <escapeString>${maven.resources.escapeString}</escapeString>
  <escapeWindowsPaths default-value="true">${maven.resources.escapeWindowsPaths}</escapeWindowsPaths>
  <includeEmptyDirs default-value="false">${maven.resources.includeEmptyDirs}</includeEmptyDirs>
  <outputDirectory default-value="${project.build.outputDirectory}"/>
  <overwrite default-value="false">${maven.resources.overwrite}</overwrite>
  <project default-value="${project}"/>
  <resources default-value="${project.resources}"/>
  <session default-value="${session}"/>
  <supportMultiLineFiltering default-value="false">${maven.resources.supportMultiLineFiltering}</supportMultiLineFiltering>
  <useBuildFilters default-value="true"/>
  <useDefaultDelimiters default-value="true"/>
</configuration>
[DEBUG] -----------------------------------------------------------------------
[DEBUG] Goal:          org.apache.maven.plugins:maven-compiler-plugin:2.3.2:compile (default-compile)
[DEBUG] Style:         Regular
[DEBUG] Configuration: <?xml version="1.0" encoding="UTF-8"?>
<configuration>
  <basedir default-value="${basedir}"/>
  <buildDirectory default-value="${project.build.directory}"/>
  <classpathElements default-value="${project.compileClasspathElements}"/>
  <compileSourceRoots default-value="${project.compileSourceRoots}"/>
  <compilerId default-value="javac">${maven.compiler.compilerId}</compilerId>
  <compilerVersion>${maven.compiler.compilerVersion}</compilerVersion>
  <debug default-value="true">${maven.compiler.debug}</debug>
  <debuglevel>${maven.compiler.debuglevel}</debuglevel>
  <encoding default-value="${project.build.sourceEncoding}">${encoding}</encoding>
  <executable>${maven.compiler.executable}</executable>
  <failOnError default-value="true">${maven.compiler.failOnError}</failOnError>
  <fork default-value="false">${maven.compiler.fork}</fork>
  <generatedSourcesDirectory default-value="${project.build.directory}/generated-sources/annotations"/>
  <maxmem>${maven.compiler.maxmem}</maxmem>
  <meminitial>${maven.compiler.meminitial}</meminitial>
  <optimize default-value="false">${maven.compiler.optimize}</optimize>
  <outputDirectory default-value="${project.build.outputDirectory}"/>
  <outputFileName>${project.build.finalName}</outputFileName>
  <projectArtifact default-value="${project.artifact}"/>
  <session default-value="${session}"/>
  <showDeprecation default-value="false">${maven.compiler.showDeprecation}</showDeprecation>
  <showWarnings default-value="false">${maven.compiler.showWarnings}</showWarnings>
  <source default-value="1.5">1.6</source>
  <staleMillis default-value="0">${lastModGranularityMs}</staleMillis>
  <target default-value="1.5">1.6</target>
  <verbose default-value="false">${maven.compiler.verbose}</verbose>
</configuration>
[DEBUG] -----------------------------------------------------------------------
[DEBUG] Goal:          org.apache.maven.plugins:maven-resources-plugin:2.5:testResources (default-testResources)
[DEBUG] Style:         Regular
[DEBUG] Configuration: <?xml version="1.0" encoding="UTF-8"?>
<configuration>
  <buildFilters default-value="${project.build.filters}"/>
  <encoding default-value="${project.build.sourceEncoding}">${encoding}</encoding>
  <escapeString>${maven.resources.escapeString}</escapeString>
  <escapeWindowsPaths default-value="true">${maven.resources.escapeWindowsPaths}</escapeWindowsPaths>
  <includeEmptyDirs default-value="false">${maven.resources.includeEmptyDirs}</includeEmptyDirs>
  <outputDirectory>${project.build.testOutputDirectory}</outputDirectory>
  <overwrite default-value="false">${maven.resources.overwrite}</overwrite>
  <project default-value="${project}"/>
  <resources>${project.testResources}</resources>
  <session default-value="${session}"/>
  <supportMultiLineFiltering default-value="false">${maven.resources.supportMultiLineFiltering}</supportMultiLineFiltering>
  <useBuildFilters default-value="true"/>
  <useDefaultDelimiters default-value="true"/>
</configuration>
[DEBUG] -----------------------------------------------------------------------
[DEBUG] Goal:          org.apache.maven.plugins:maven-compiler-plugin:2.3.2:testCompile (default-testCompile)
[DEBUG] Style:         Regular
[DEBUG] Configuration: <?xml version="1.0" encoding="UTF-8"?>
<configuration>
  <basedir default-value="${basedir}"/>
  <buildDirectory default-value="${project.build.directory}"/>
  <classpathElements default-value="${project.testClasspathElements}"/>
  <compileSourceRoots default-value="${project.testCompileSourceRoots}"/>
  <compilerId default-value="javac">${maven.compiler.compilerId}</compilerId>
  <compilerVersion>${maven.compiler.compilerVersion}</compilerVersion>
  <debug default-value="true">${maven.compiler.debug}</debug>
  <debuglevel>${maven.compiler.debuglevel}</debuglevel>
  <encoding default-value="${project.build.sourceEncoding}">${encoding}</encoding>
  <executable>${maven.compiler.executable}</executable>
  <failOnError default-value="true">${maven.compiler.failOnError}</failOnError>
  <fork default-value="false">${maven.compiler.fork}</fork>
  <generatedTestSourcesDirectory default-value="${project.build.directory}/generated-sources/test-annotations"/>
  <maxmem>${maven.compiler.maxmem}</maxmem>
  <meminitial>${maven.compiler.meminitial}</meminitial>
  <optimize default-value="false">${maven.compiler.optimize}</optimize>
  <outputDirectory default-value="${project.build.testOutputDirectory}"/>
  <outputFileName>${project.build.finalName}</outputFileName>
  <session default-value="${session}"/>
  <showDeprecation default-value="false">${maven.compiler.showDeprecation}</showDeprecation>
  <showWarnings default-value="false">${maven.compiler.showWarnings}</showWarnings>
  <skip>${maven.test.skip}</skip>
  <source default-value="1.5">1.6</source>
  <staleMillis default-value="0">${lastModGranularityMs}</staleMillis>
  <target default-value="1.5">1.6</target>
  <testSource>${maven.compiler.testSource}</testSource>
  <testTarget>${maven.compiler.testTarget}</testTarget>
  <verbose default-value="false">${maven.compiler.verbose}</verbose>
</configuration>
[DEBUG] -----------------------------------------------------------------------
[DEBUG] Goal:          org.apache.maven.plugins:maven-surefire-plugin:2.8.1:test (default-test)
[DEBUG] Style:         Regular
[DEBUG] Configuration: <?xml version="1.0" encoding="UTF-8"?>
<configuration>
  <argLine>${argLine}</argLine>
  <basedir default-value="${basedir}"/>
  <childDelegation default-value="false">${childDelegation}</childDelegation>
  <classesDirectory default-value="${project.build.outputDirectory}"/>
  <debugForkedProcess>${maven.surefire.debug}</debugForkedProcess>
  <disableXmlReport default-value="false">${disableXmlReport}</disableXmlReport>
  <enableAssertions default-value="true">${enableAssertions}</enableAssertions>
  <excludedGroups>${excludedGroups}</excludedGroups>
  <failIfNoTests>${failIfNoTests}</failIfNoTests>
  <forkMode default-value="once">${forkMode}</forkMode>
  <forkedProcessTimeoutInSeconds>${surefire.timeout}</forkedProcessTimeoutInSeconds>
  <groups>${groups}</groups>
  <junitArtifactName default-value="junit:junit">${junitArtifactName}</junitArtifactName>
  <jvm>${jvm}</jvm>
  <localRepository>${localRepository}</localRepository>
  <objectFactory>${objectFactory}</objectFactory>
  <parallel>${parallel}</parallel>
  <parallelMavenExecution default-value="${session.parallel}"/>
  <perCoreThreadCount default-value="true">${perCoreThreadCount}</perCoreThreadCount>
  <pluginArtifactMap>${plugin.artifactMap}</pluginArtifactMap>
  <printSummary default-value="true">${surefire.printSummary}</printSummary>
  <project default-value="${project}"/>
  <projectArtifactMap>${project.artifactMap}</projectArtifactMap>
  <redirectTestOutputToFile default-value="false">true</redirectTestOutputToFile>
  <remoteRepositories>${project.pluginArtifactRepositories}</remoteRepositories>
  <reportFormat default-value="brief">${surefire.reportFormat}</reportFormat>
  <reportsDirectory default-value="${project.build.directory}/surefire-reports"/>
  <runOrder default-value="filesystem"/>
  <session>${session}</session>
  <skip default-value="false">${maven.test.skip}</skip>
  <skipExec>${maven.test.skip.exec}</skipExec>
  <skipTests default-value="false">${skipTests}</skipTests>
  <test>${test}</test>
  <testClassesDirectory default-value="${project.build.testOutputDirectory}"/>
  <testFailureIgnore default-value="false">${maven.test.failure.ignore}</testFailureIgnore>
  <testNGArtifactName default-value="org.testng:testng">${testNGArtifactName}</testNGArtifactName>
  <testSourceDirectory default-value="${project.build.testSourceDirectory}"/>
  <threadCount>${threadCount}</threadCount>
  <trimStackTrace default-value="true">${trimStackTrace}</trimStackTrace>
  <useFile default-value="true">${surefire.useFile}</useFile>
  <useManifestOnlyJar default-value="true">${surefire.useManifestOnlyJar}</useManifestOnlyJar>
  <useSystemClassLoader default-value="true">${surefire.useSystemClassLoader}</useSystemClassLoader>
  <useUnlimitedThreads default-value="false">${useUnlimitedThreads}</useUnlimitedThreads>
  <workingDirectory>${basedir}</workingDirectory>
</configuration>
[DEBUG] -----------------------------------------------------------------------
[DEBUG] Goal:          org.apache.rat:apache-rat-plugin:0.8:check (default)
[DEBUG] Style:         Regular
[DEBUG] Configuration: <?xml version="1.0" encoding="UTF-8"?>
<configuration>
  <addDefaultLicenseMatchers default-value="true">${rat.addDefaultLicenseMatchers}</addDefaultLicenseMatchers>
  <addLicenseHeaders default-value="false">${rat.addLicenseHeaders}</addLicenseHeaders>
  <basedir default-value="${basedir}">${rat.basedir}</basedir>
  <copyrightMessage>${rat.copyrightMessage}</copyrightMessage>
  <excludeSubProjects default-value="true">${rat.excludeSubprojects}</excludeSubProjects>
  <excludes>
    <exclude>BUILD.txt</exclude>
    <exclude>CHANGES.txt</exclude>
    <exclude>BIN-NOTICE.txt</exclude>
    <exclude>.idea/</exclude>
    <exclude>.git/</exclude>
  </excludes>
  <numUnapprovedLicenses default-value="0">${rat.numUnapprovedLicenses}</numUnapprovedLicenses>
  <project default-value="${project}"/>
  <reportFile default-value="${project.build.directory}/rat.txt">${rat.outputFile}</reportFile>
  <reportStyle default-value="plain">${rat.outputStyle}</reportStyle>
  <useDefaultExcludes default-value="true">${rat.useDefaultExcludes}</useDefaultExcludes>
  <useEclipseDefaultExcludes default-value="true">${rat.useEclipseDefaultExcludes}</useEclipseDefaultExcludes>
  <useIdeaDefaultExcludes default-value="true">${rat.useIdeaDefaultExcludes}</useIdeaDefaultExcludes>
  <useMavenDefaultExcludes default-value="true">${rat.useMavenDefaultExcludes}</useMavenDefaultExcludes>
</configuration>
[DEBUG] -----------------------------------------------------------------------
[DEBUG] Goal:          org.apache.maven.plugins:maven-dependency-plugin:2.5.1:analyze-only (default)
[DEBUG] Style:         Regular
[DEBUG] Configuration: <?xml version="1.0" encoding="UTF-8"?>
<configuration>
  <analyzer default-value="default">${analyzer}</analyzer>
  <baseDir default-value="${basedir}"/>
  <failOnWarning default-value="false">true</failOnWarning>
  <ignoreNonCompile default-value="false">true</ignoreNonCompile>
  <outputDirectory default-value="${project.build.directory}"/>
  <outputXML default-value="false">${outputXML}</outputXML>
  <scriptableFlag default-value="$$$%%%">${scriptableFlag}</scriptableFlag>
  <scriptableOutput default-value="false">${scriptableOutput}</scriptableOutput>
  <verbose default-value="false">${verbose}</verbose>
  <project default-value="${project}"/>
</configuration>
[DEBUG] -----------------------------------------------------------------------
[DEBUG] Goal:          org.apache.maven.plugins:maven-jar-plugin:2.4:jar (default-jar)
[DEBUG] Style:         Regular
[DEBUG] Configuration: <?xml version="1.0" encoding="UTF-8"?>
<configuration>
  <archive>
    <manifest>
      <addDefaultSpecificationEntries>true</addDefaultSpecificationEntries>
      <addDefaultImplementationEntries>true</addDefaultImplementationEntries>
    </manifest>
  </archive>
  <classesDirectory default-value="${project.build.outputDirectory}"/>
  <classifier>hadoop1</classifier>
  <defaultManifestFile default-value="${project.build.outputDirectory}/META-INF/MANIFEST.MF"/>
  <finalName default-value="${project.build.finalName}">${jar.finalName}</finalName>
  <forceCreation default-value="false">${jar.forceCreation}</forceCreation>
  <outputDirectory default-value="${project.build.directory}"/>
  <project default-value="${project}"/>
  <session default-value="${session}"/>
  <skipIfEmpty default-value="false">${jar.skipIfEmpty}</skipIfEmpty>
  <useDefaultManifestFile default-value="false">${jar.useDefaultManifestFile}</useDefaultManifestFile>
</configuration>
[DEBUG] -----------------------------------------------------------------------
[DEBUG] Goal:          org.apache.maven.plugins:maven-site-plugin:3.1:attach-descriptor (attach-descriptor)
[DEBUG] Style:         Regular
[DEBUG] Configuration: <?xml version="1.0" encoding="UTF-8"?>
<configuration>
  <basedir>${basedir}</basedir>
  <inputEncoding default-value="${project.build.sourceEncoding}">${encoding}</inputEncoding>
  <localRepository default-value="${localRepository}"/>
  <locales>${locales}</locales>
  <outputEncoding default-value="${project.reporting.outputEncoding}">${outputEncoding}</outputEncoding>
  <pomPackagingOnly default-value="true"/>
  <project default-value="${project}"/>
  <reactorProjects default-value="${reactorProjects}"/>
  <siteDirectory default-value="${basedir}/src/site"/>
</configuration>
[DEBUG] -----------------------------------------------------------------------
[DEBUG] Goal:          org.apache.maven.plugins:maven-javadoc-plugin:2.8.1:jar (default)
[DEBUG] Style:         Regular
[DEBUG] Configuration: <?xml version="1.0" encoding="UTF-8"?>
<configuration>
  <additionalJOption>${additionalJOption}</additionalJOption>
  <additionalparam>${additionalparam}</additionalparam>
  <aggregate default-value="false">${aggregate}</aggregate>
  <attach default-value="true">${attach}</attach>
  <author default-value="true">${author}</author>
  <bootclasspath>${bootclasspath}</bootclasspath>
  <bootclasspathArtifacts>${bootclasspathArtifacts}</bootclasspathArtifacts>
  <bottom default-value="Copyright &amp;#169; {inceptionYear}-{currentYear} {organizationName}. All Rights Reserved.">${bottom}</bottom>
  <breakiterator default-value="false">${breakiterator}</breakiterator>
  <charset>${charset}</charset>
  <debug default-value="false">${debug}</debug>
  <defaultManifestFile>${project.build.outputDirectory}/META-INF/MANIFEST.MF</defaultManifestFile>
  <destDir>${destDir}</destDir>
  <detectJavaApiLink default-value="true">${detectJavaApiLink}</detectJavaApiLink>
  <detectLinks default-value="false">${detectLinks}</detectLinks>
  <detectOfflineLinks default-value="true">${detectOfflineLinks}</detectOfflineLinks>
  <docencoding default-value="${project.reporting.outputEncoding}">${docencoding}</docencoding>
  <docfilessubdirs default-value="false">${docfilessubdirs}</docfilessubdirs>
  <doclet>${doclet}</doclet>
  <docletArtifact>${docletArtifact}</docletArtifact>
  <docletArtifacts>${docletArtifacts}</docletArtifacts>
  <docletPath>${docletPath}</docletPath>
  <doctitle default-value="${project.name} ${project.version} API">${doctitle}</doctitle>
  <encoding default-value="${project.build.sourceEncoding}">${encoding}</encoding>
  <excludePackageNames>*.internal</excludePackageNames>
  <excludedocfilessubdir>${excludedocfilessubdir}</excludedocfilessubdir>
  <extdirs>${extdirs}</extdirs>
  <failOnError default-value="true">${maven.javadoc.failOnError}</failOnError>
  <finalName>${project.build.finalName}</finalName>
  <footer>${footer}</footer>
  <groups>${groups}</groups>
  <header>${header}</header>
  <helpfile>${helpfile}</helpfile>
  <includeDependencySources default-value="false"/>
  <includeTransitiveDependencySources default-value="false"/>
  <isOffline default-value="${settings.offline}"/>
  <jarOutputDirectory>${project.build.directory}</jarOutputDirectory>
  <javaApiLinks>${javaApiLinks}</javaApiLinks>
  <javadocDirectory>${basedir}/src/main/javadoc</javadocDirectory>
  <javadocExecutable>${javadocExecutable}</javadocExecutable>
  <javadocOptionsDir default-value="${project.build.directory}/javadoc-bundle-options"/>
  <javadocVersion>${javadocVersion}</javadocVersion>
  <keywords default-value="false">${keywords}</keywords>
  <links>${links}</links>
  <linksource default-value="false">${linksource}</linksource>
  <localRepository>${localRepository}</localRepository>
  <locale>${locale}</locale>
  <maxmemory>${maxmemory}</maxmemory>
  <minmemory>${minmemory}</minmemory>
  <nocomment default-value="false">${nocomment}</nocomment>
  <nodeprecated default-value="false">${nodeprecated}</nodeprecated>
  <nodeprecatedlist default-value="false">${nodeprecatedlist}</nodeprecatedlist>
  <nohelp default-value="false">${nohelp}</nohelp>
  <noindex default-value="false">${noindex}</noindex>
  <nonavbar default-value="false">${nonavbar}</nonavbar>
  <nooverview default-value="false">${nooverview}</nooverview>
  <noqualifier>${noqualifier}</noqualifier>
  <nosince default-value="false">${nosince}</nosince>
  <notimestamp default-value="false">${notimestamp}</notimestamp>
  <notree default-value="false">${notree}</notree>
  <offlineLinks>${offlineLinks}</offlineLinks>
  <old default-value="false">${old}</old>
  <outputDirectory default-value="${project.build.directory}/apidocs">${destDir}</outputDirectory>
  <overview default-value="${basedir}/src/main/javadoc/overview.html">${overview}</overview>
  <packagesheader>${packagesheader}</packagesheader>
  <project>${project}</project>
  <proxyHost>${proxyHost}</proxyHost>
  <proxyPort>${proxyPort}</proxyPort>
  <quiet default-value="false">${quiet}</quiet>
  <reactorProjects>${reactorProjects}</reactorProjects>
  <remoteRepositories>${project.remoteArtifactRepositories}</remoteRepositories>
  <resourcesArtifacts>${resourcesArtifacts}</resourcesArtifacts>
  <serialwarn default-value="false">${serialwarn}</serialwarn>
  <session>${session}</session>
  <settings default-value="${settings}"/>
  <show default-value="protected">${show}</show>
  <skip default-value="false">${maven.javadoc.skip}</skip>
  <source>${source}</source>
  <sourceDependencyCacheDir default-value="${project.build.directory}/distro-javadoc-sources"/>
  <sourcepath>${sourcepath}</sourcepath>
  <sourcetab>${sourcetab}</sourcetab>
  <splitindex default-value="false">${splitindex}</splitindex>
  <stylesheet default-value="java">${stylesheet}</stylesheet>
  <stylesheetfile>${stylesheetfile}</stylesheetfile>
  <subpackages>${subpackages}</subpackages>
  <taglet>${taglet}</taglet>
  <tagletArtifact>${tagletArtifact}</tagletArtifact>
  <tagletArtifacts>${tagletArtifacts}</tagletArtifacts>
  <tagletpath>${tagletpath}</tagletpath>
  <taglets>${taglets}</taglets>
  <tags>${tags}</tags>
  <top>${top}</top>
  <use default-value="true">${use}</use>
  <useDefaultManifestFile default-value="false"/>
  <useStandardDocletOptions default-value="true">${useStandardDocletOptions}</useStandardDocletOptions>
  <validateLinks default-value="false">${validateLinks}</validateLinks>
  <verbose default-value="false">${verbose}</verbose>
  <version default-value="true">${version}</version>
  <windowtitle default-value="${project.name} ${project.version} API">${windowtitle}</windowtitle>
</configuration>
[DEBUG] -----------------------------------------------------------------------
[DEBUG] Goal:          org.apache.maven.plugins:maven-source-plugin:2.1.2:jar-no-fork (default)
[DEBUG] Style:         Regular
[DEBUG] Configuration: <?xml version="1.0" encoding="UTF-8"?>
<configuration>
  <attach default-value="true">${attach}</attach>
  <defaultManifestFile default-value="${project.build.outputDirectory}/META-INF/MANIFEST.MF"/>
  <excludeResources default-value="false">${source.excludeResources}</excludeResources>
  <finalName default-value="${project.build.finalName}"/>
  <forceCreation default-value="false">${source.forceCreation}</forceCreation>
  <includePom default-value="false">${source.includePom}</includePom>
  <outputDirectory default-value="${project.build.directory}"/>
  <project>${project}</project>
  <reactorProjects>${reactorProjects}</reactorProjects>
  <useDefaultExcludes default-value="true"/>
  <useDefaultManifestFile default-value="false"/>
</configuration>
[DEBUG] =======================================================================
[DEBUG] org.apache.mrunit:mrunit:jar:1.0.0-SNAPSHOT
[DEBUG]    junit:junit:jar:4.10:compile
[DEBUG]       org.hamcrest:hamcrest-core:jar:1.1:compile
[DEBUG]    commons-logging:commons-logging:jar:1.1.1:compile
[DEBUG]    org.mockito:mockito-all:jar:1.8.5:compile
[DEBUG]    org.apache.hadoop:hadoop-core:jar:1.0.3:provided
[DEBUG]       commons-cli:commons-cli:jar:1.2:provided
[DEBUG]       xmlenc:xmlenc:jar:0.52:provided
[DEBUG]       commons-httpclient:commons-httpclient:jar:3.0.1:provided
[DEBUG]       commons-codec:commons-codec:jar:1.4:provided
[DEBUG]       org.apache.commons:commons-math:jar:2.1:provided
[DEBUG]       commons-configuration:commons-configuration:jar:1.6:provided
[DEBUG]          commons-collections:commons-collections:jar:3.2.1:provided
[DEBUG]          commons-lang:commons-lang:jar:2.4:provided
[DEBUG]          commons-digester:commons-digester:jar:1.8:provided
[DEBUG]             commons-beanutils:commons-beanutils:jar:1.7.0:provided
[DEBUG]          commons-beanutils:commons-beanutils-core:jar:1.8.0:provided
[DEBUG]       commons-net:commons-net:jar:1.4.1:provided
[DEBUG]       org.mortbay.jetty:jetty:jar:6.1.26:provided
[DEBUG]          org.mortbay.jetty:servlet-api:jar:2.5-20081211:provided
[DEBUG]       org.mortbay.jetty:jetty-util:jar:6.1.26:provided
[DEBUG]       tomcat:jasper-runtime:jar:5.5.12:provided
[DEBUG]       tomcat:jasper-compiler:jar:5.5.12:provided
[DEBUG]       org.mortbay.jetty:jsp-api-2.1:jar:6.1.14:provided
[DEBUG]          org.mortbay.jetty:servlet-api-2.5:jar:6.1.14:provided
[DEBUG]       org.mortbay.jetty:jsp-2.1:jar:6.1.14:provided
[DEBUG]          ant:ant:jar:1.6.5:provided
[DEBUG]       commons-el:commons-el:jar:1.0:provided
[DEBUG]       net.java.dev.jets3t:jets3t:jar:0.7.1:provided
[DEBUG]       net.sf.kosmosfs:kfs:jar:0.3:provided
[DEBUG]       hsqldb:hsqldb:jar:1.8.0.10:provided
[DEBUG]       oro:oro:jar:2.0.8:provided
[DEBUG]       org.eclipse.jdt:core:jar:3.1.1:provided
[DEBUG]       org.codehaus.jackson:jackson-mapper-asl:jar:1.0.1:provided
[DEBUG]          org.codehaus.jackson:jackson-core-asl:jar:1.0.1:provided
[INFO] 
[INFO] --- maven-remote-resources-plugin:1.3:process (default) @ mrunit ---
[DEBUG] Created new class realm maven.api
[DEBUG] Importing foreign packages into class realm maven.api
[DEBUG]   Imported: org.apache.maven.wagon.events < plexus.core
[DEBUG]   Imported: org.sonatype.aether.transfer < plexus.core
[DEBUG]   Imported: org.apache.maven.exception < plexus.core
[DEBUG]   Imported: org.sonatype.aether.metadata < plexus.core
[DEBUG]   Imported: org.codehaus.plexus.util.xml.Xpp3Dom < plexus.core
[DEBUG]   Imported: org.sonatype.aether.collection < plexus.core
[DEBUG]   Imported: org.sonatype.aether.version < plexus.core
[DEBUG]   Imported: org.apache.maven.monitor < plexus.core
[DEBUG]   Imported: org.apache.maven.wagon.repository < plexus.core
[DEBUG]   Imported: org.apache.maven.repository < plexus.core
[DEBUG]   Imported: org.apache.maven.wagon.resource < plexus.core
[DEBUG]   Imported: org.codehaus.plexus.logging < plexus.core
[DEBUG]   Imported: org.apache.maven.profiles < plexus.core
[DEBUG]   Imported: org.sonatype.aether.repository < plexus.core
[DEBUG]   Imported: org.apache.maven.classrealm < plexus.core
[DEBUG]   Imported: org.apache.maven.execution < plexus.core
[DEBUG]   Imported: org.sonatype.aether.artifact < plexus.core
[DEBUG]   Imported: org.sonatype.aether.spi < plexus.core
[DEBUG]   Imported: org.apache.maven.reporting < plexus.core
[DEBUG]   Imported: org.apache.maven.usability < plexus.core
[DEBUG]   Imported: org.codehaus.plexus.container < plexus.core
[DEBUG]   Imported: org.codehaus.plexus.component < plexus.core
[DEBUG]   Imported: org.codehaus.plexus.util.xml.pull.XmlSerializer < plexus.core
[DEBUG]   Imported: org.apache.maven.wagon.authentication < plexus.core
[DEBUG]   Imported: org.apache.maven.lifecycle < plexus.core
[DEBUG]   Imported: org.codehaus.plexus.classworlds < plexus.core
[DEBUG]   Imported: org.sonatype.aether.graph < plexus.core
[DEBUG]   Imported: org.sonatype.aether.* < plexus.core
[DEBUG]   Imported: org.apache.maven.settings < plexus.core
[DEBUG]   Imported: org.codehaus.classworlds < plexus.core
[DEBUG]   Imported: org.sonatype.aether.impl < plexus.core
[DEBUG]   Imported: org.apache.maven.wagon.* < plexus.core
[DEBUG]   Imported: org.apache.maven.toolchain < plexus.core
[DEBUG]   Imported: org.sonatype.aether.deployment < plexus.core
[DEBUG]   Imported: org.apache.maven.wagon.observers < plexus.core
[DEBUG]   Imported: org.codehaus.plexus.util.xml.pull.XmlPullParserException < plexus.core
[DEBUG]   Imported: org.codehaus.plexus.util.xml.pull.XmlPullParser < plexus.core
[DEBUG]   Imported: org.apache.maven.configuration < plexus.core
[DEBUG]   Imported: org.apache.maven.cli < plexus.core
[DEBUG]   Imported: org.sonatype.aether.installation < plexus.core
[DEBUG]   Imported: org.codehaus.plexus.context < plexus.core
[DEBUG]   Imported: org.apache.maven.wagon.authorization < plexus.core
[DEBUG]   Imported: org.apache.maven.project < plexus.core
[DEBUG]   Imported: org.apache.maven.rtinfo < plexus.core
[DEBUG]   Imported: org.codehaus.plexus.lifecycle < plexus.core
[DEBUG]   Imported: org.codehaus.plexus.configuration < plexus.core
[DEBUG]   Imported: org.apache.maven.artifact < plexus.core
[DEBUG]   Imported: org.apache.maven.model < plexus.core
[DEBUG]   Imported: org.apache.maven.* < plexus.core
[DEBUG]   Imported: org.apache.maven.wagon.proxy < plexus.core
[DEBUG]   Imported: org.sonatype.aether.resolution < plexus.core
[DEBUG]   Imported: org.apache.maven.plugin < plexus.core
[DEBUG]   Imported: org.codehaus.plexus.* < plexus.core
[DEBUG]   Imported: org.codehaus.plexus.personality < plexus.core
[DEBUG] Populating class realm maven.api
[DEBUG] org.apache.maven.plugins:maven-remote-resources-plugin:jar:1.3:
[DEBUG]    org.apache.maven:maven-artifact:jar:2.0.6:compile
[DEBUG]    org.apache.maven:maven-core:jar:2.0.6:compile
[DEBUG]       org.apache.maven:maven-plugin-parameter-documenter:jar:2.0.6:compile
[DEBUG]       org.apache.maven.reporting:maven-reporting-api:jar:2.0.6:compile
[DEBUG]          org.apache.maven.doxia:doxia-sink-api:jar:1.0-alpha-7:compile
[DEBUG]       org.apache.maven:maven-profile:jar:2.0.6:compile
[DEBUG]       org.apache.maven:maven-repository-metadata:jar:2.0.6:compile
[DEBUG]       org.apache.maven:maven-error-diagnostics:jar:2.0.6:compile
[DEBUG]       commons-cli:commons-cli:jar:1.0:compile
[DEBUG]       org.apache.maven:maven-plugin-descriptor:jar:2.0.6:compile
[DEBUG]       org.codehaus.plexus:plexus-interactivity-api:jar:1.0-alpha-4:compile
[DEBUG]       org.apache.maven:maven-artifact-manager:jar:2.0.6:compile
[DEBUG]       classworlds:classworlds:jar:1.1:compile
[DEBUG]    org.apache.maven:maven-model:jar:2.0.6:compile
[DEBUG]    org.apache.maven:maven-monitor:jar:2.0.6:compile
[DEBUG]    org.apache.maven:maven-plugin-api:jar:2.0.6:compile
[DEBUG]    org.apache.maven:maven-project:jar:2.0.6:compile
[DEBUG]       org.apache.maven:maven-plugin-registry:jar:2.0.6:compile
[DEBUG]    org.apache.maven:maven-settings:jar:2.0.6:compile
[DEBUG]    org.apache.maven.shared:maven-artifact-resolver:jar:1.0:compile
[DEBUG]    org.apache.maven.shared:maven-common-artifact-filters:jar:1.0:compile
[DEBUG]       org.apache.maven.shared:maven-plugin-testing-harness:jar:1.1:compile
[DEBUG]          org.codehaus.plexus:plexus-archiver:jar:1.0-alpha-7:compile
[DEBUG]    org.apache.maven.shared:maven-filtering:jar:1.0:compile
[DEBUG]       org.sonatype.plexus:plexus-build-api:jar:0.0.4:compile
[DEBUG]    org.codehaus.plexus:plexus-container-default:jar:1.0-alpha-9:compile
[DEBUG]       junit:junit:jar:3.8.1:compile
[DEBUG]    org.codehaus.plexus:plexus-interpolation:jar:1.12:compile
[DEBUG]    org.codehaus.plexus:plexus-resources:jar:1.0-alpha-5:compile
[DEBUG]    org.codehaus.plexus:plexus-utils:jar:1.5.12:compile
[DEBUG]    org.codehaus.plexus:plexus-velocity:jar:1.1.8:compile
[DEBUG]       commons-collections:commons-collections:jar:3.1:compile
[DEBUG]    org.apache.velocity:velocity:jar:1.7:compile
[DEBUG]       commons-lang:commons-lang:jar:2.4:compile
[DEBUG] Created new class realm plugin>org.apache.maven.plugins:maven-remote-resources-plugin:1.3
[DEBUG] Importing foreign packages into class realm plugin>org.apache.maven.plugins:maven-remote-resources-plugin:1.3
[DEBUG]   Imported:  < maven.api
[DEBUG] Populating class realm plugin>org.apache.maven.plugins:maven-remote-resources-plugin:1.3
[DEBUG]   Included: org.apache.maven.plugins:maven-remote-resources-plugin:jar:1.3
[DEBUG]   Included: org.apache.maven.reporting:maven-reporting-api:jar:2.0.6
[DEBUG]   Included: org.apache.maven.doxia:doxia-sink-api:jar:1.0-alpha-7
[DEBUG]   Included: commons-cli:commons-cli:jar:1.0
[DEBUG]   Included: org.codehaus.plexus:plexus-interactivity-api:jar:1.0-alpha-4
[DEBUG]   Included: org.apache.maven.shared:maven-artifact-resolver:jar:1.0
[DEBUG]   Included: org.apache.maven.shared:maven-common-artifact-filters:jar:1.0
[DEBUG]   Included: org.apache.maven.shared:maven-plugin-testing-harness:jar:1.1
[DEBUG]   Included: org.codehaus.plexus:plexus-archiver:jar:1.0-alpha-7
[DEBUG]   Included: org.apache.maven.shared:maven-filtering:jar:1.0
[DEBUG]   Included: org.sonatype.plexus:plexus-build-api:jar:0.0.4
[DEBUG]   Included: junit:junit:jar:3.8.1
[DEBUG]   Included: org.codehaus.plexus:plexus-interpolation:jar:1.12
[DEBUG]   Included: org.codehaus.plexus:plexus-resources:jar:1.0-alpha-5
[DEBUG]   Included: org.codehaus.plexus:plexus-utils:jar:1.5.12
[DEBUG]   Included: org.codehaus.plexus:plexus-velocity:jar:1.1.8
[DEBUG]   Included: commons-collections:commons-collections:jar:3.1
[DEBUG]   Included: org.apache.velocity:velocity:jar:1.7
[DEBUG]   Included: commons-lang:commons-lang:jar:2.4
[DEBUG]   Excluded: org.apache.maven:maven-artifact:jar:2.0.6
[DEBUG]   Excluded: org.apache.maven:maven-core:jar:2.0.6
[DEBUG]   Excluded: org.apache.maven:maven-plugin-parameter-documenter:jar:2.0.6
[DEBUG]   Excluded: org.apache.maven:maven-profile:jar:2.0.6
[DEBUG]   Excluded: org.apache.maven:maven-repository-metadata:jar:2.0.6
[DEBUG]   Excluded: org.apache.maven:maven-error-diagnostics:jar:2.0.6
[DEBUG]   Excluded: org.apache.maven:maven-plugin-descriptor:jar:2.0.6
[DEBUG]   Excluded: org.apache.maven:maven-artifact-manager:jar:2.0.6
[DEBUG]   Excluded: classworlds:classworlds:jar:1.1
[DEBUG]   Excluded: org.apache.maven:maven-model:jar:2.0.6
[DEBUG]   Excluded: org.apache.maven:maven-monitor:jar:2.0.6
[DEBUG]   Excluded: org.apache.maven:maven-plugin-api:jar:2.0.6
[DEBUG]   Excluded: org.apache.maven:maven-project:jar:2.0.6
[DEBUG]   Excluded: org.apache.maven:maven-plugin-registry:jar:2.0.6
[DEBUG]   Excluded: org.apache.maven:maven-settings:jar:2.0.6
[DEBUG]   Excluded: org.codehaus.plexus:plexus-container-default:jar:1.0-alpha-9
[DEBUG] Configuring mojo org.apache.maven.plugins:maven-remote-resources-plugin:1.3:process from plugin realm ClassRealm[plugin>org.apache.maven.plugins:maven-remote-resources-plugin:1.3, parent: sun.misc.Launcher$AppClassLoader@5ad89e02]
[DEBUG] Setting property: classpath.resource.loader.class => 'org.codehaus.plexus.velocity.ContextClassLoaderResourceLoader'.
[DEBUG] Setting property: site.resource.loader.class => 'org.codehaus.plexus.velocity.SiteResourceLoader'.
[DEBUG] Setting property: velocimacro.messages.on => 'false'.
[DEBUG] Setting property: resource.loader => 'classpath,site'.
[DEBUG] Setting property: runtime.log.invalid.references => 'false'.
[DEBUG] Setting property: resource.manager.logwhenfound => 'false'.
[DEBUG] Initializing Velocity, Calling init()...
[DEBUG] *******************************************************************
[DEBUG] Starting Apache Velocity v1.7 (compiled: 2010-11-19 12:14:37)
[DEBUG] RuntimeInstance initializing.
[DEBUG] Default Properties File: org/apache/velocity/runtime/defaults/velocity.properties
[DEBUG] LogSystem has been deprecated. Please use a LogChute implementation.
[DEBUG] Default ResourceManager initializing. (class org.apache.velocity.runtime.resource.ResourceManagerImpl)
[DEBUG] ResourceLoader instantiated: org.codehaus.plexus.velocity.ContextClassLoaderResourceLoader
[DEBUG] ResourceLoader instantiated: org.codehaus.plexus.velocity.SiteResourceLoader
[DEBUG] ResourceCache: initialized (class org.apache.velocity.runtime.resource.ResourceCacheImpl) with class java.util.Collections$SynchronizedMap cache map.
[DEBUG] Default ResourceManager initialization complete.
[DEBUG] Loaded System Directive: org.apache.velocity.runtime.directive.Stop
[DEBUG] Loaded System Directive: org.apache.velocity.runtime.directive.Define
[DEBUG] Loaded System Directive: org.apache.velocity.runtime.directive.Break
[DEBUG] Loaded System Directive: org.apache.velocity.runtime.directive.Evaluate
[DEBUG] Loaded System Directive: org.apache.velocity.runtime.directive.Literal
[DEBUG] Loaded System Directive: org.apache.velocity.runtime.directive.Macro
[DEBUG] Loaded System Directive: org.apache.velocity.runtime.directive.Parse
[DEBUG] Loaded System Directive: org.apache.velocity.runtime.directive.Include
[DEBUG] Loaded System Directive: org.apache.velocity.runtime.directive.Foreach
[DEBUG] Created '20' parsers.
[DEBUG] Velocimacro : initialization starting.
[DEBUG] Velocimacro : allowInline = true : VMs can be defined inline in templates
[DEBUG] Velocimacro : allowInlineToOverride = false : VMs defined inline may NOT replace previous VM definitions
[DEBUG] Velocimacro : allowInlineLocal = false : VMs defined inline will be global in scope if allowed.
[DEBUG] Velocimacro : autoload off : VM system will not automatically reload global library macros
[DEBUG] Velocimacro : Velocimacro : initialization complete.
[DEBUG] RuntimeInstance successfully initialized.
[DEBUG] Configuring mojo 'org.apache.maven.plugins:maven-remote-resources-plugin:1.3:process' with basic configurator -->
[DEBUG]   (f) appendedResourcesDirectory = /Users/dan/Google Drive/proj/4/mahout/mrunit/src/main/appended-resources
[DEBUG]   (f) attached = true
[DEBUG]   (f) basedir = /Users/dan/Google Drive/proj/4/mahout/mrunit
[DEBUG]   (f) encoding = UTF-8
[DEBUG]   (f) excludeTransitive = false
[DEBUG]   (f) includeProjectProperties = false
[DEBUG]   (f) includeScope = runtime
[DEBUG]   (f) localRepository =        id: local
      url: file:///Users/dan/.m2/repository/
   layout: none

[DEBUG]   (f) mavenSession = org.apache.maven.execution.MavenSession@bb933cb
[DEBUG]   (f) outputDirectory = /Users/dan/Google Drive/proj/4/mahout/mrunit/target/maven-shared-archive-resources
[DEBUG]   (f) project = MavenProject: org.apache.mrunit:mrunit:1.0.0-SNAPSHOT @ /Users/dan/Google Drive/proj/4/mahout/mrunit/pom.xml
[DEBUG]   (f) remoteArtifactRepositories = [       id: apache.snapshots
      url: http://repository.apache.org/snapshots
   layout: default
snapshots: [enabled => true, update => daily]
 releases: [enabled => false, update => daily]
,        id: central
      url: http://repo1.maven.org/maven2
   layout: default
snapshots: [enabled => false, update => daily]
 releases: [enabled => true, update => daily]
]
[DEBUG]   (f) resourceBundles = [org.apache:apache-jar-resource-bundle:1.4]
[DEBUG]   (f) resources = [Resource {targetPath: null, filtering: false, FileSet {directory: /Users/dan/Google Drive/proj/4/mahout/mrunit/src/main/resources, PatternSet [includes: {}, excludes: {}]}}]
[DEBUG]   (f) runOnlyAtExecutionRoot = false
[DEBUG]   (f) skip = false
[DEBUG]   (f) useDefaultFilterDelimiters = true
[DEBUG] -- end configuration --
[DEBUG] Supplemental data models won't be loaded.  No models specified.
[DEBUG] inceptionYear not specified, defaulting to 2012
[DEBUG] org.apache.mrunit:mrunit:jar:1.0.0-SNAPSHOT (selected for null)
[DEBUG]   junit:junit:jar:4.10:compile (selected for compile)
[DEBUG]     org.hamcrest:hamcrest-core:jar:1.1:compile (selected for compile)
[DEBUG]   commons-logging:commons-logging:jar:1.1.1:compile (selected for compile)
[DEBUG]   org.mockito:mockito-all:jar:1.8.5:compile (selected for compile)
[DEBUG]   org.apache.hadoop:hadoop-core:jar:1.0.3:provided (selected for provided)
[DEBUG]     commons-cli:commons-cli:jar:1.2:provided (selected for provided)
[DEBUG]     xmlenc:xmlenc:jar:0.52:provided (selected for provided)
[DEBUG]     commons-httpclient:commons-httpclient:jar:3.0.1:provided (selected for provided)
[DEBUG]       junit:junit:jar:3.8.1:provided (removed - nearer found: 4.10)
[DEBUG]       commons-logging:commons-logging:jar:1.0.3:provided (removed - nearer found: 1.1.1)
[DEBUG]       commons-codec:commons-codec:jar:1.2:provided (selected for provided)
[DEBUG]     commons-codec:commons-codec:jar:1.2:provided (removed - nearer found: 1.4)
[DEBUG]     commons-codec:commons-codec:jar:1.4:provided (selected for provided)
[DEBUG]     org.apache.commons:commons-math:jar:2.1:provided (selected for provided)
[DEBUG]     commons-configuration:commons-configuration:jar:1.6:provided (selected for provided)
[DEBUG]       commons-collections:commons-collections:jar:3.2.1:provided (selected for provided)
[DEBUG]       commons-lang:commons-lang:jar:2.4:provided (selected for provided)
[DEBUG]       commons-digester:commons-digester:jar:1.8:provided (selected for provided)
[DEBUG]         commons-beanutils:commons-beanutils:jar:1.7.0:provided (selected for provided)
[DEBUG]           commons-logging:commons-logging:jar:1.0.3:provided (removed - nearer found: 1.1.1)
[DEBUG]         commons-logging:commons-logging:jar:1.1:provided (removed - nearer found: 1.1.1)
[DEBUG]       commons-beanutils:commons-beanutils-core:jar:1.8.0:provided (selected for provided)
[DEBUG]     commons-net:commons-net:jar:1.4.1:provided (selected for provided)
[DEBUG]       oro:oro:jar:2.0.8:provided (selected for provided)
[DEBUG]     org.mortbay.jetty:jetty:jar:6.1.26:provided (selected for provided)
[DEBUG]       org.mortbay.jetty:jetty-util:jar:6.1.26:provided (selected for provided)
[DEBUG]       org.mortbay.jetty:servlet-api:jar:2.5-20081211:provided (selected for provided)
[DEBUG]     org.mortbay.jetty:jetty-util:jar:6.1.26:provided (selected for provided)
[DEBUG]     tomcat:jasper-runtime:jar:5.5.12:provided (selected for provided)
[DEBUG]     tomcat:jasper-compiler:jar:5.5.12:provided (selected for provided)
[DEBUG]     org.mortbay.jetty:jsp-api-2.1:jar:6.1.14:provided (selected for provided)
[DEBUG]       org.mortbay.jetty:servlet-api-2.5:jar:6.1.14:provided (selected for provided)
[DEBUG]     org.mortbay.jetty:jsp-2.1:jar:6.1.14:provided (selected for provided)
[DEBUG]       org.eclipse.jdt:core:jar:3.1.1:provided (selected for provided)
[DEBUG]       ant:ant:jar:1.6.5:provided (selected for provided)
[DEBUG]     commons-el:commons-el:jar:1.0:provided (selected for provided)
[DEBUG]       commons-logging:commons-logging:jar:1.0.3:provided (removed - nearer found: 1.1.1)
[DEBUG]     net.java.dev.jets3t:jets3t:jar:0.7.1:provided (selected for provided)
[DEBUG]       commons-codec:commons-codec:jar:1.3:provided (removed - nearer found: 1.4)
[DEBUG]       commons-httpclient:commons-httpclient:jar:3.1:provided (removed - nearer found: 3.0.1)
[DEBUG]     net.sf.kosmosfs:kfs:jar:0.3:provided (selected for provided)
[DEBUG]     hsqldb:hsqldb:jar:1.8.0.10:provided (selected for provided)
[DEBUG]     oro:oro:jar:2.0.8:provided (selected for provided)
[DEBUG]     org.eclipse.jdt:core:jar:3.1.1:provided (selected for provided)
[DEBUG]     org.codehaus.jackson:jackson-mapper-asl:jar:1.0.1:provided (selected for provided)
[DEBUG]       org.codehaus.jackson:jackson-core-asl:jar:1.0.1:provided (selected for provided)
[DEBUG] Building project for junit:junit:jar:4.10:compile
[DEBUG] Adding project with groupId [junit]
[DEBUG] Building project for org.hamcrest:hamcrest-core:jar:1.1:compile
[DEBUG] Adding project with groupId [org.hamcrest]
[DEBUG] Building project for org.mockito:mockito-all:jar:1.8.5:compile
[DEBUG] Adding project with groupId [org.mockito]
[DEBUG] Building project for commons-logging:commons-logging:jar:1.1.1:compile
[DEBUG] Adding project with groupId [commons-logging]
[INFO] 
[INFO] --- maven-resources-plugin:2.5:resources (default-resources) @ mrunit ---
[DEBUG] org.apache.maven.plugins:maven-resources-plugin:jar:2.5:
[DEBUG]    org.apache.maven:maven-plugin-api:jar:2.0.6:compile
[DEBUG]    org.apache.maven:maven-project:jar:2.0.6:compile
[DEBUG]       org.apache.maven:maven-profile:jar:2.0.6:compile
[DEBUG]       org.apache.maven:maven-artifact-manager:jar:2.0.6:compile
[DEBUG]       org.apache.maven:maven-plugin-registry:jar:2.0.6:compile
[DEBUG]    org.apache.maven:maven-core:jar:2.0.6:compile
[DEBUG]       org.apache.maven:maven-plugin-parameter-documenter:jar:2.0.6:compile
[DEBUG]       org.apache.maven.reporting:maven-reporting-api:jar:2.0.6:compile
[DEBUG]          org.apache.maven.doxia:doxia-sink-api:jar:1.0-alpha-7:compile
[DEBUG]       org.apache.maven:maven-repository-metadata:jar:2.0.6:compile
[DEBUG]       org.apache.maven:maven-error-diagnostics:jar:2.0.6:compile
[DEBUG]       commons-cli:commons-cli:jar:1.0:compile
[DEBUG]       org.apache.maven:maven-plugin-descriptor:jar:2.0.6:compile
[DEBUG]       org.codehaus.plexus:plexus-interactivity-api:jar:1.0-alpha-4:compile
[DEBUG]       classworlds:classworlds:jar:1.1:compile
[DEBUG]    org.apache.maven:maven-artifact:jar:2.0.6:compile
[DEBUG]    org.apache.maven:maven-settings:jar:2.0.6:compile
[DEBUG]    org.apache.maven:maven-model:jar:2.0.6:compile
[DEBUG]    org.apache.maven:maven-monitor:jar:2.0.6:compile
[DEBUG]    org.codehaus.plexus:plexus-container-default:jar:1.0-alpha-9-stable-1:compile
[DEBUG]       junit:junit:jar:3.8.1:compile
[DEBUG]    org.codehaus.plexus:plexus-utils:jar:2.0.5:compile
[DEBUG]    org.apache.maven.shared:maven-filtering:jar:1.0:compile
[DEBUG]       org.sonatype.plexus:plexus-build-api:jar:0.0.4:compile
[DEBUG]    org.codehaus.plexus:plexus-interpolation:jar:1.13:compile
[DEBUG] Created new class realm plugin>org.apache.maven.plugins:maven-resources-plugin:2.5
[DEBUG] Importing foreign packages into class realm plugin>org.apache.maven.plugins:maven-resources-plugin:2.5
[DEBUG]   Imported:  < maven.api
[DEBUG] Populating class realm plugin>org.apache.maven.plugins:maven-resources-plugin:2.5
[DEBUG]   Included: org.apache.maven.plugins:maven-resources-plugin:jar:2.5
[DEBUG]   Included: org.apache.maven.reporting:maven-reporting-api:jar:2.0.6
[DEBUG]   Included: org.apache.maven.doxia:doxia-sink-api:jar:1.0-alpha-7
[DEBUG]   Included: commons-cli:commons-cli:jar:1.0
[DEBUG]   Included: org.codehaus.plexus:plexus-interactivity-api:jar:1.0-alpha-4
[DEBUG]   Included: junit:junit:jar:3.8.1
[DEBUG]   Included: org.codehaus.plexus:plexus-utils:jar:2.0.5
[DEBUG]   Included: org.apache.maven.shared:maven-filtering:jar:1.0
[DEBUG]   Included: org.sonatype.plexus:plexus-build-api:jar:0.0.4
[DEBUG]   Included: org.codehaus.plexus:plexus-interpolation:jar:1.13
[DEBUG]   Excluded: org.apache.maven:maven-plugin-api:jar:2.0.6
[DEBUG]   Excluded: org.apache.maven:maven-project:jar:2.0.6
[DEBUG]   Excluded: org.apache.maven:maven-profile:jar:2.0.6
[DEBUG]   Excluded: org.apache.maven:maven-artifact-manager:jar:2.0.6
[DEBUG]   Excluded: org.apache.maven:maven-plugin-registry:jar:2.0.6
[DEBUG]   Excluded: org.apache.maven:maven-core:jar:2.0.6
[DEBUG]   Excluded: org.apache.maven:maven-plugin-parameter-documenter:jar:2.0.6
[DEBUG]   Excluded: org.apache.maven:maven-repository-metadata:jar:2.0.6
[DEBUG]   Excluded: org.apache.maven:maven-error-diagnostics:jar:2.0.6
[DEBUG]   Excluded: org.apache.maven:maven-plugin-descriptor:jar:2.0.6
[DEBUG]   Excluded: classworlds:classworlds:jar:1.1
[DEBUG]   Excluded: org.apache.maven:maven-artifact:jar:2.0.6
[DEBUG]   Excluded: org.apache.maven:maven-settings:jar:2.0.6
[DEBUG]   Excluded: org.apache.maven:maven-model:jar:2.0.6
[DEBUG]   Excluded: org.apache.maven:maven-monitor:jar:2.0.6
[DEBUG]   Excluded: org.codehaus.plexus:plexus-container-default:jar:1.0-alpha-9-stable-1
[DEBUG] Configuring mojo org.apache.maven.plugins:maven-resources-plugin:2.5:resources from plugin realm ClassRealm[plugin>org.apache.maven.plugins:maven-resources-plugin:2.5, parent: sun.misc.Launcher$AppClassLoader@5ad89e02]
[debug] execute contextualize
[DEBUG] Configuring mojo 'org.apache.maven.plugins:maven-resources-plugin:2.5:resources' with basic configurator -->
[DEBUG]   (f) buildFilters = []
[DEBUG]   (f) encoding = UTF-8
[DEBUG]   (f) escapeWindowsPaths = true
[DEBUG]   (s) includeEmptyDirs = false
[DEBUG]   (s) outputDirectory = /Users/dan/Google Drive/proj/4/mahout/mrunit/target/classes
[DEBUG]   (s) overwrite = false
[DEBUG]   (f) project = MavenProject: org.apache.mrunit:mrunit:1.0.0-SNAPSHOT @ /Users/dan/Google Drive/proj/4/mahout/mrunit/pom.xml
[DEBUG]   (s) resources = [Resource {targetPath: null, filtering: false, FileSet {directory: /Users/dan/Google Drive/proj/4/mahout/mrunit/src/main/resources, PatternSet [includes: {}, excludes: {}]}}, Resource {targetPath: null, filtering: false, FileSet {directory: /Users/dan/Google Drive/proj/4/mahout/mrunit/target/maven-shared-archive-resources, PatternSet [includes: {}, excludes: {}]}}]
[DEBUG]   (f) session = org.apache.maven.execution.MavenSession@bb933cb
[DEBUG]   (f) supportMultiLineFiltering = false
[DEBUG]   (f) useBuildFilters = true
[DEBUG]   (s) useDefaultDelimiters = true
[DEBUG] -- end configuration --
[DEBUG] properties used {java.vendor=Oracle Corporation, sun.java.launcher=SUN_STANDARD, sun.management.compiler=HotSpot 64-Bit Tiered Compilers, env.GREP_OPTIONS=--color=auto, envClassifier=hadoop1, env.TMUX_PANE=%5, env.rvm_silent_flag=, env.COLORFGBG=11;15, env.GEM_HOME=/Users/dan/.rvm/gems/ruby-1.9.2-p318, os.name=Mac OS X, env.rvm_gemstone_package_file=, env.rvm_install_on_use_flag=, env.rvm_quiet_flag=, sun.boot.class.path=/Library/Java/JavaVirtualMachines/jdk1.7.0_10.jdk/Contents/Home/jre/lib/resources.jar:/Library/Java/JavaVirtualMachines/jdk1.7.0_10.jdk/Contents/Home/jre/lib/rt.jar:/Library/Java/JavaVirtualMachines/jdk1.7.0_10.jdk/Contents/Home/jre/lib/sunrsasign.jar:/Library/Java/JavaVirtualMachines/jdk1.7.0_10.jdk/Contents/Home/jre/lib/jsse.jar:/Library/Java/JavaVirtualMachines/jdk1.7.0_10.jdk/Contents/Home/jre/lib/jce.jar:/Library/Java/JavaVirtualMachines/jdk1.7.0_10.jdk/Contents/Home/jre/lib/charsets.jar:/Library/Java/JavaVirtualMachines/jdk1.7.0_10.jdk/Contents/Home/jre/lib/jfr.jar:/Library/Java/JavaVirtualMachines/jdk1.7.0_10.jdk/Contents/Home/jre/lib/JObjC.jar:/Library/Java/JavaVirtualMachines/jdk1.7.0_10.jdk/Contents/Home/jre/classes, env.TMPDIR=/var/folders/mg/jm6zmcnd1sg7w34790t70_0w0000gn/T/, env.Apple_Ubiquity_Message=/tmp/launch-j3MbXo/Apple_Ubiquity_Message, env.PWD=/Users/dan/proj/4/mahout/mrunit, env.rvm_ruby_make=, env.rvm_ruby_make_install=, env.rvm_proxy=, env.LANG=en_US.UTF-8, java.vm.specification.vendor=Oracle Corporation, java.runtime.version=1.7.0_10-ea-b09, env.MY_RUBY_HOME=/Users/dan/.rvm/rubies/ruby-1.9.2-p318, env.Apple_PubSub_Socket_Render=/tmp/launch-0x9mUv/Render, project.build.sourceEncoding=UTF-8, env.DISPLAY=/tmp/launch-6MwwYO/org.macosforge.xquartz:0, env.rvm_version=1.11.3, user.name=dan, env.escape_flag=1, env.USER=dan, env.SHELL=/bin/zsh, sourceReleaseAssemblyDescriptor=source-release, env.__CF_USER_TEXT_ENCODING=0x1F5:0:0, env.PATH=/Users/dan/.rvm/gems/ruby-1.9.2-p318/bin:/Users/dan/.rvm/gems/ruby-1.9.2-p318@global/bin:/Users/dan/.rvm/rubies/ruby-1.9.2-p318/bin:/Users/dan/.rvm/bin:/System/Library/Java/JavaVirtualMachines/1.6.0.jdk/Contents/Home/bin:/Users/dan/bin:/usr/local/sbin:/usr/local/bin:/System/Library/Java/JavaVirtualMachines/1.6.0.jdk/Contents/Home/bin:/Users/dan/bin:/usr/local/sbin:/usr/local/bin:/usr/bin:/bin:/usr/sbin:/sbin:/usr/local/bin:/usr/X11/bin:/usr/texbin:/opt/local/bin:/Users/dan/.rvm/bin:/usr/local/hadoop/bin, user.language=en, env.rvm_prefix=/Users/dan, sun.boot.library.path=/Library/Java/JavaVirtualMachines/jdk1.7.0_10.jdk/Contents/Home/jre/lib, classworlds.conf=/usr/share/maven/bin/m2.conf, env.rvm_docs_type=, env.rvm_path=/Users/dan/.rvm, env.LC_CTYPE=en_US.UTF-8, env.RUBY_VERSION=ruby-1.9.2-p318, java.version=1.7.0_10-ea, user.timezone=Europe/Bucharest, organization.logo=http://www.apache.org/images/asf_logo_wide.gif, env._first=1, sun.arch.data.model=64, env.SSH_AGENT_PID=32232, http.nonProxyHosts=local|*.local|169.254/16|*.169.254/16, java.endorsed.dirs=/Library/Java/JavaVirtualMachines/jdk1.7.0_10.jdk/Contents/Home/jre/lib/endorsed, sun.cpu.isalist=, sun.jnu.encoding=UTF-8, env.ITERM_SESSION_ID=w0t0p0, env.rvm_bin_path=/Users/dan/.rvm/bin, file.encoding.pkg=sun.io, env.SHLVL=3, env.rvm_alias_expanded=, file.separator=/, java.specification.name=Java Platform API Specification, java.class.version=51.0, user.country=US, env.rvm_sdk=, java.home=/Library/Java/JavaVirtualMachines/jdk1.7.0_10.jdk/Contents/Home/jre, java.vm.info=mixed mode, env.LOGNAME=dan, os.version=10.8.2, env.rvm_hook=, env.HADOOP_HOME=/usr/local/hadoop, path.separator=:, java.vm.version=23.6-b03, gpg.useagent=true, env._second=2, env.rvm_ruby_file=, env.IRBRC=/Users/dan/.rvm/rubies/ruby-1.9.2-p318/.irbrc, env.JAVA_HOME=/Library/Java/JavaVirtualMachines/jdk1.7.0_10.jdk/Contents/Home, java.awt.printerjob=sun.lwawt.macosx.CPrinterJob, env.TERM=screen-256color, sun.io.unicode.encoding=UnicodeBig, awt.toolkit=sun.lwawt.macosx.LWCToolkit, env.rvm_nightly_flag=, socksNonProxyHosts=local|*.local|169.254/16|*.169.254/16, ftp.nonProxyHosts=local|*.local|169.254/16|*.169.254/16, env.LSCOLORS=Gxfxcxdxbxegedabagacad, env.GREP_COLOR=1;32, env.GEM_PATH=/Users/dan/.rvm/gems/ruby-1.9.2-p318:/Users/dan/.rvm/gems/ruby-1.9.2-p318@global, user.home=/Users/dan, env.OLDPWD=/Users/dan/proj/4/mahout/mrunit, java.specification.vendor=Oracle Corporation, env.TERM_PROGRAM=iTerm.app, env.PAGER=less -R, java.library.path=/Users/dan/Library/Java/Extensions:/Library/Java/Extensions:/Network/Library/Java/Extensions:/System/Library/Java/Extensions:/usr/lib/java:., java.vendor.url=http://java.oracle.com/, distMgmtSnapshotsName=Apache Development Snapshot Repository, java.vm.vendor=Oracle Corporation, gopherProxySet=false, maven.home=/usr/share/maven, java.runtime.name=Java(TM) SE Runtime Environment, sun.java.command=org.codehaus.plexus.classworlds.launcher.Launcher -X package, java.class.path=/usr/share/maven/boot/plexus-classworlds-2.4.jar, java.vm.specification.name=Java Virtual Machine Specification, env.TMUX=/private/var/folders/mg/jm6zmcnd1sg7w34790t70_0w0000gn/T/tmux-501/default,72192,0, java.vm.specification.version=1.7, sun.cpu.endian=little, sun.os.patch.level=unknown, env.HOME=/Users/dan, java.io.tmpdir=/var/folders/mg/jm6zmcnd1sg7w34790t70_0w0000gn/T/, java.vendor.url.bug=http://bugreport.sun.com/bugreport/, distMgmtSnapshotsUrl=https://repository.apache.org/content/repositories/snapshots, env.SSH_AUTH_SOCK=/var/folders/mg/jm6zmcnd1sg7w34790t70_0w0000gn/T//ssh-ogkxxmxwGW9j/agent.32230, env.COMMAND_MODE=unix2003, env.rvm_ruby_mode=, env.rvm_script_name=, env.rvm_wrapper_name=, os.arch=x86_64, java.awt.graphicsenv=sun.awt.CGraphicsEnvironment, env.__array_start=1, java.ext.dirs=/Users/dan/Library/Java/Extensions:/Library/Java/JavaVirtualMachines/jdk1.7.0_10.jdk/Contents/Home/jre/lib/ext:/Library/Java/Extensions:/Network/Library/Java/Extensions:/System/Library/Java/Extensions:/usr/lib/java, user.dir=/Users/dan/Google Drive/proj/4/mahout/mrunit, line.separator=
, java.vm.name=Java HotSpot(TM) 64-Bit Server VM, env.ITERM_PROFILE=Default, file.encoding=UTF-8, env.JAVA_MAIN_CLASS_24997=org.codehaus.plexus.classworlds.launcher.Launcher, java.specification.version=1.7, env.rvm_niceness=, env.rvm_gemstone_url=}
[INFO] Using 'UTF-8' encoding to copy filtered resources.
[DEBUG] resource with targetPath null
directory /Users/dan/Google Drive/proj/4/mahout/mrunit/src/main/resources
excludes []
includes []
[INFO] skip non existing resourceDirectory /Users/dan/Google Drive/proj/4/mahout/mrunit/src/main/resources
[DEBUG] resource with targetPath null
directory /Users/dan/Google Drive/proj/4/mahout/mrunit/target/maven-shared-archive-resources
excludes []
includes []
[DEBUG] ignoreDelta true
[INFO] Copying 3 resources
[DEBUG] file DEPENDENCIES has a filtered file extension
[DEBUG] copy /Users/dan/Google Drive/proj/4/mahout/mrunit/target/maven-shared-archive-resources/META-INF/DEPENDENCIES to /Users/dan/Google Drive/proj/4/mahout/mrunit/target/classes/META-INF/DEPENDENCIES
[DEBUG] file LICENSE has a filtered file extension
[DEBUG] copy /Users/dan/Google Drive/proj/4/mahout/mrunit/target/maven-shared-archive-resources/META-INF/LICENSE to /Users/dan/Google Drive/proj/4/mahout/mrunit/target/classes/META-INF/LICENSE
[DEBUG] file NOTICE has a filtered file extension
[DEBUG] copy /Users/dan/Google Drive/proj/4/mahout/mrunit/target/maven-shared-archive-resources/META-INF/NOTICE to /Users/dan/Google Drive/proj/4/mahout/mrunit/target/classes/META-INF/NOTICE
[DEBUG] no use filter components
[INFO] 
[INFO] --- maven-compiler-plugin:2.3.2:compile (default-compile) @ mrunit ---
[DEBUG] org.apache.maven.plugins:maven-compiler-plugin:jar:2.3.2:
[DEBUG]    org.apache.maven:maven-plugin-api:jar:2.0.6:compile
[DEBUG]    org.apache.maven:maven-artifact:jar:2.0.6:compile
[DEBUG]    org.apache.maven:maven-core:jar:2.0.6:compile
[DEBUG]       org.apache.maven:maven-settings:jar:2.0.6:compile
[DEBUG]       org.apache.maven:maven-plugin-parameter-documenter:jar:2.0.6:compile
[DEBUG]       org.apache.maven:maven-profile:jar:2.0.6:compile
[DEBUG]       org.apache.maven:maven-model:jar:2.0.6:compile
[DEBUG]       org.apache.maven:maven-repository-metadata:jar:2.0.6:compile
[DEBUG]       org.apache.maven:maven-error-diagnostics:jar:2.0.6:compile
[DEBUG]       org.apache.maven:maven-project:jar:2.0.6:compile
[DEBUG]          org.apache.maven:maven-plugin-registry:jar:2.0.6:compile
[DEBUG]       org.apache.maven:maven-plugin-descriptor:jar:2.0.6:compile
[DEBUG]       org.apache.maven:maven-artifact-manager:jar:2.0.6:compile
[DEBUG]       org.apache.maven:maven-monitor:jar:2.0.6:compile
[DEBUG]    org.apache.maven:maven-toolchain:jar:1.0:compile
[DEBUG]    org.codehaus.plexus:plexus-utils:jar:2.0.5:compile
[DEBUG]    org.codehaus.plexus:plexus-compiler-api:jar:1.8.1:compile
[DEBUG]    org.codehaus.plexus:plexus-compiler-manager:jar:1.8.1:compile
[DEBUG]    org.codehaus.plexus:plexus-compiler-javac:jar:1.8.1:runtime
[DEBUG] Created new class realm plugin>org.apache.maven.plugins:maven-compiler-plugin:2.3.2
[DEBUG] Importing foreign packages into class realm plugin>org.apache.maven.plugins:maven-compiler-plugin:2.3.2
[DEBUG]   Imported:  < maven.api
[DEBUG] Populating class realm plugin>org.apache.maven.plugins:maven-compiler-plugin:2.3.2
[DEBUG]   Included: org.apache.maven.plugins:maven-compiler-plugin:jar:2.3.2
[DEBUG]   Included: org.codehaus.plexus:plexus-utils:jar:2.0.5
[DEBUG]   Included: org.codehaus.plexus:plexus-compiler-api:jar:1.8.1
[DEBUG]   Included: org.codehaus.plexus:plexus-compiler-manager:jar:1.8.1
[DEBUG]   Included: org.codehaus.plexus:plexus-compiler-javac:jar:1.8.1
[DEBUG]   Excluded: org.apache.maven:maven-plugin-api:jar:2.0.6
[DEBUG]   Excluded: org.apache.maven:maven-artifact:jar:2.0.6
[DEBUG]   Excluded: org.apache.maven:maven-core:jar:2.0.6
[DEBUG]   Excluded: org.apache.maven:maven-settings:jar:2.0.6
[DEBUG]   Excluded: org.apache.maven:maven-plugin-parameter-documenter:jar:2.0.6
[DEBUG]   Excluded: org.apache.maven:maven-profile:jar:2.0.6
[DEBUG]   Excluded: org.apache.maven:maven-model:jar:2.0.6
[DEBUG]   Excluded: org.apache.maven:maven-repository-metadata:jar:2.0.6
[DEBUG]   Excluded: org.apache.maven:maven-error-diagnostics:jar:2.0.6
[DEBUG]   Excluded: org.apache.maven:maven-project:jar:2.0.6
[DEBUG]   Excluded: org.apache.maven:maven-plugin-registry:jar:2.0.6
[DEBUG]   Excluded: org.apache.maven:maven-plugin-descriptor:jar:2.0.6
[DEBUG]   Excluded: org.apache.maven:maven-artifact-manager:jar:2.0.6
[DEBUG]   Excluded: org.apache.maven:maven-monitor:jar:2.0.6
[DEBUG]   Excluded: org.apache.maven:maven-toolchain:jar:1.0
[DEBUG] Configuring mojo org.apache.maven.plugins:maven-compiler-plugin:2.3.2:compile from plugin realm ClassRealm[plugin>org.apache.maven.plugins:maven-compiler-plugin:2.3.2, parent: sun.misc.Launcher$AppClassLoader@5ad89e02]
[DEBUG] Configuring mojo 'org.apache.maven.plugins:maven-compiler-plugin:2.3.2:compile' with basic configurator -->
[DEBUG]   (f) basedir = /Users/dan/Google Drive/proj/4/mahout/mrunit
[DEBUG]   (f) buildDirectory = /Users/dan/Google Drive/proj/4/mahout/mrunit/target
[DEBUG]   (f) classpathElements = [/Users/dan/Google Drive/proj/4/mahout/mrunit/target/classes, /Users/dan/.m2/repository/junit/junit/4.10/junit-4.10.jar, /Users/dan/.m2/repository/org/hamcrest/hamcrest-core/1.1/hamcrest-core-1.1.jar, /Users/dan/.m2/repository/commons-logging/commons-logging/1.1.1/commons-logging-1.1.1.jar, /Users/dan/.m2/repository/org/mockito/mockito-all/1.8.5/mockito-all-1.8.5.jar, /Users/dan/.m2/repository/org/apache/hadoop/hadoop-core/1.0.3/hadoop-core-1.0.3.jar, /Users/dan/.m2/repository/commons-cli/commons-cli/1.2/commons-cli-1.2.jar, /Users/dan/.m2/repository/xmlenc/xmlenc/0.52/xmlenc-0.52.jar, /Users/dan/.m2/repository/commons-httpclient/commons-httpclient/3.0.1/commons-httpclient-3.0.1.jar, /Users/dan/.m2/repository/commons-codec/commons-codec/1.4/commons-codec-1.4.jar, /Users/dan/.m2/repository/org/apache/commons/commons-math/2.1/commons-math-2.1.jar, /Users/dan/.m2/repository/commons-configuration/commons-configuration/1.6/commons-configuration-1.6.jar, /Users/dan/.m2/repository/commons-collections/commons-collections/3.2.1/commons-collections-3.2.1.jar, /Users/dan/.m2/repository/commons-lang/commons-lang/2.4/commons-lang-2.4.jar, /Users/dan/.m2/repository/commons-digester/commons-digester/1.8/commons-digester-1.8.jar, /Users/dan/.m2/repository/commons-beanutils/commons-beanutils/1.7.0/commons-beanutils-1.7.0.jar, /Users/dan/.m2/repository/commons-beanutils/commons-beanutils-core/1.8.0/commons-beanutils-core-1.8.0.jar, /Users/dan/.m2/repository/commons-net/commons-net/1.4.1/commons-net-1.4.1.jar, /Users/dan/.m2/repository/org/mortbay/jetty/jetty/6.1.26/jetty-6.1.26.jar, /Users/dan/.m2/repository/org/mortbay/jetty/servlet-api/2.5-20081211/servlet-api-2.5-20081211.jar, /Users/dan/.m2/repository/org/mortbay/jetty/jetty-util/6.1.26/jetty-util-6.1.26.jar, /Users/dan/.m2/repository/tomcat/jasper-runtime/5.5.12/jasper-runtime-5.5.12.jar, /Users/dan/.m2/repository/tomcat/jasper-compiler/5.5.12/jasper-compiler-5.5.12.jar, /Users/dan/.m2/repository/org/mortbay/jetty/jsp-api-2.1/6.1.14/jsp-api-2.1-6.1.14.jar, /Users/dan/.m2/repository/org/mortbay/jetty/servlet-api-2.5/6.1.14/servlet-api-2.5-6.1.14.jar, /Users/dan/.m2/repository/org/mortbay/jetty/jsp-2.1/6.1.14/jsp-2.1-6.1.14.jar, /Users/dan/.m2/repository/ant/ant/1.6.5/ant-1.6.5.jar, /Users/dan/.m2/repository/commons-el/commons-el/1.0/commons-el-1.0.jar, /Users/dan/.m2/repository/net/java/dev/jets3t/jets3t/0.7.1/jets3t-0.7.1.jar, /Users/dan/.m2/repository/net/sf/kosmosfs/kfs/0.3/kfs-0.3.jar, /Users/dan/.m2/repository/hsqldb/hsqldb/1.8.0.10/hsqldb-1.8.0.10.jar, /Users/dan/.m2/repository/oro/oro/2.0.8/oro-2.0.8.jar, /Users/dan/.m2/repository/org/eclipse/jdt/core/3.1.1/core-3.1.1.jar, /Users/dan/.m2/repository/org/codehaus/jackson/jackson-mapper-asl/1.0.1/jackson-mapper-asl-1.0.1.jar, /Users/dan/.m2/repository/org/codehaus/jackson/jackson-core-asl/1.0.1/jackson-core-asl-1.0.1.jar]
[DEBUG]   (f) compileSourceRoots = [/Users/dan/Google Drive/proj/4/mahout/mrunit/src/main/java]
[DEBUG]   (f) compilerId = javac
[DEBUG]   (f) debug = true
[DEBUG]   (f) encoding = UTF-8
[DEBUG]   (f) failOnError = true
[DEBUG]   (f) fork = false
[DEBUG]   (f) generatedSourcesDirectory = /Users/dan/Google Drive/proj/4/mahout/mrunit/target/generated-sources/annotations
[DEBUG]   (f) optimize = false
[DEBUG]   (f) outputDirectory = /Users/dan/Google Drive/proj/4/mahout/mrunit/target/classes
[DEBUG]   (f) outputFileName = mrunit-1.0.0-SNAPSHOT
[DEBUG]   (f) projectArtifact = org.apache.mrunit:mrunit:jar:1.0.0-SNAPSHOT
[DEBUG]   (f) session = org.apache.maven.execution.MavenSession@bb933cb
[DEBUG]   (f) showDeprecation = false
[DEBUG]   (f) showWarnings = false
[DEBUG]   (f) source = 1.6
[DEBUG]   (f) staleMillis = 0
[DEBUG]   (f) target = 1.6
[DEBUG]   (f) verbose = false
[DEBUG] -- end configuration --
[DEBUG] Using compiler 'javac'.
[DEBUG] Source directories: [/Users/dan/Google Drive/proj/4/mahout/mrunit/src/main/java]
[DEBUG] Classpath: [/Users/dan/Google Drive/proj/4/mahout/mrunit/target/classes
 /Users/dan/.m2/repository/junit/junit/4.10/junit-4.10.jar
 /Users/dan/.m2/repository/org/hamcrest/hamcrest-core/1.1/hamcrest-core-1.1.jar
 /Users/dan/.m2/repository/commons-logging/commons-logging/1.1.1/commons-logging-1.1.1.jar
 /Users/dan/.m2/repository/org/mockito/mockito-all/1.8.5/mockito-all-1.8.5.jar
 /Users/dan/.m2/repository/org/apache/hadoop/hadoop-core/1.0.3/hadoop-core-1.0.3.jar
 /Users/dan/.m2/repository/commons-cli/commons-cli/1.2/commons-cli-1.2.jar
 /Users/dan/.m2/repository/xmlenc/xmlenc/0.52/xmlenc-0.52.jar
 /Users/dan/.m2/repository/commons-httpclient/commons-httpclient/3.0.1/commons-httpclient-3.0.1.jar
 /Users/dan/.m2/repository/commons-codec/commons-codec/1.4/commons-codec-1.4.jar
 /Users/dan/.m2/repository/org/apache/commons/commons-math/2.1/commons-math-2.1.jar
 /Users/dan/.m2/repository/commons-configuration/commons-configuration/1.6/commons-configuration-1.6.jar
 /Users/dan/.m2/repository/commons-collections/commons-collections/3.2.1/commons-collections-3.2.1.jar
 /Users/dan/.m2/repository/commons-lang/commons-lang/2.4/commons-lang-2.4.jar
 /Users/dan/.m2/repository/commons-digester/commons-digester/1.8/commons-digester-1.8.jar
 /Users/dan/.m2/repository/commons-beanutils/commons-beanutils/1.7.0/commons-beanutils-1.7.0.jar
 /Users/dan/.m2/repository/commons-beanutils/commons-beanutils-core/1.8.0/commons-beanutils-core-1.8.0.jar
 /Users/dan/.m2/repository/commons-net/commons-net/1.4.1/commons-net-1.4.1.jar
 /Users/dan/.m2/repository/org/mortbay/jetty/jetty/6.1.26/jetty-6.1.26.jar
 /Users/dan/.m2/repository/org/mortbay/jetty/servlet-api/2.5-20081211/servlet-api-2.5-20081211.jar
 /Users/dan/.m2/repository/org/mortbay/jetty/jetty-util/6.1.26/jetty-util-6.1.26.jar
 /Users/dan/.m2/repository/tomcat/jasper-runtime/5.5.12/jasper-runtime-5.5.12.jar
 /Users/dan/.m2/repository/tomcat/jasper-compiler/5.5.12/jasper-compiler-5.5.12.jar
 /Users/dan/.m2/repository/org/mortbay/jetty/jsp-api-2.1/6.1.14/jsp-api-2.1-6.1.14.jar
 /Users/dan/.m2/repository/org/mortbay/jetty/servlet-api-2.5/6.1.14/servlet-api-2.5-6.1.14.jar
 /Users/dan/.m2/repository/org/mortbay/jetty/jsp-2.1/6.1.14/jsp-2.1-6.1.14.jar
 /Users/dan/.m2/repository/ant/ant/1.6.5/ant-1.6.5.jar
 /Users/dan/.m2/repository/commons-el/commons-el/1.0/commons-el-1.0.jar
 /Users/dan/.m2/repository/net/java/dev/jets3t/jets3t/0.7.1/jets3t-0.7.1.jar
 /Users/dan/.m2/repository/net/sf/kosmosfs/kfs/0.3/kfs-0.3.jar
 /Users/dan/.m2/repository/hsqldb/hsqldb/1.8.0.10/hsqldb-1.8.0.10.jar
 /Users/dan/.m2/repository/oro/oro/2.0.8/oro-2.0.8.jar
 /Users/dan/.m2/repository/org/eclipse/jdt/core/3.1.1/core-3.1.1.jar
 /Users/dan/.m2/repository/org/codehaus/jackson/jackson-mapper-asl/1.0.1/jackson-mapper-asl-1.0.1.jar
 /Users/dan/.m2/repository/org/codehaus/jackson/jackson-core-asl/1.0.1/jackson-core-asl-1.0.1.jar]
[DEBUG] Output directory: /Users/dan/Google Drive/proj/4/mahout/mrunit/target/classes
[INFO] Nothing to compile - all classes are up to date
[INFO] 
[INFO] --- maven-resources-plugin:2.5:testResources (default-testResources) @ mrunit ---
[DEBUG] Configuring mojo org.apache.maven.plugins:maven-resources-plugin:2.5:testResources from plugin realm ClassRealm[plugin>org.apache.maven.plugins:maven-resources-plugin:2.5, parent: sun.misc.Launcher$AppClassLoader@5ad89e02]
[debug] execute contextualize
[DEBUG] Configuring mojo 'org.apache.maven.plugins:maven-resources-plugin:2.5:testResources' with basic configurator -->
[DEBUG]   (f) buildFilters = []
[DEBUG]   (f) encoding = UTF-8
[DEBUG]   (f) escapeWindowsPaths = true
[DEBUG]   (s) includeEmptyDirs = false
[DEBUG]   (s) outputDirectory = /Users/dan/Google Drive/proj/4/mahout/mrunit/target/test-classes
[DEBUG]   (s) overwrite = false
[DEBUG]   (f) project = MavenProject: org.apache.mrunit:mrunit:1.0.0-SNAPSHOT @ /Users/dan/Google Drive/proj/4/mahout/mrunit/pom.xml
[DEBUG]   (s) resources = [Resource {targetPath: null, filtering: false, FileSet {directory: /Users/dan/Google Drive/proj/4/mahout/mrunit/src/test/resources, PatternSet [includes: {}, excludes: {}]}}, Resource {targetPath: null, filtering: false, FileSet {directory: /Users/dan/Google Drive/proj/4/mahout/mrunit/target/maven-shared-archive-resources, PatternSet [includes: {}, excludes: {}]}}]
[DEBUG]   (f) session = org.apache.maven.execution.MavenSession@bb933cb
[DEBUG]   (f) supportMultiLineFiltering = false
[DEBUG]   (f) useBuildFilters = true
[DEBUG]   (s) useDefaultDelimiters = true
[DEBUG] -- end configuration --
[DEBUG] properties used {java.vendor=Oracle Corporation, sun.java.launcher=SUN_STANDARD, sun.management.compiler=HotSpot 64-Bit Tiered Compilers, env.GREP_OPTIONS=--color=auto, envClassifier=hadoop1, env.TMUX_PANE=%5, env.rvm_silent_flag=, env.COLORFGBG=11;15, env.GEM_HOME=/Users/dan/.rvm/gems/ruby-1.9.2-p318, os.name=Mac OS X, env.rvm_gemstone_package_file=, env.rvm_install_on_use_flag=, env.rvm_quiet_flag=, sun.boot.class.path=/Library/Java/JavaVirtualMachines/jdk1.7.0_10.jdk/Contents/Home/jre/lib/resources.jar:/Library/Java/JavaVirtualMachines/jdk1.7.0_10.jdk/Contents/Home/jre/lib/rt.jar:/Library/Java/JavaVirtualMachines/jdk1.7.0_10.jdk/Contents/Home/jre/lib/sunrsasign.jar:/Library/Java/JavaVirtualMachines/jdk1.7.0_10.jdk/Contents/Home/jre/lib/jsse.jar:/Library/Java/JavaVirtualMachines/jdk1.7.0_10.jdk/Contents/Home/jre/lib/jce.jar:/Library/Java/JavaVirtualMachines/jdk1.7.0_10.jdk/Contents/Home/jre/lib/charsets.jar:/Library/Java/JavaVirtualMachines/jdk1.7.0_10.jdk/Contents/Home/jre/lib/jfr.jar:/Library/Java/JavaVirtualMachines/jdk1.7.0_10.jdk/Contents/Home/jre/lib/JObjC.jar:/Library/Java/JavaVirtualMachines/jdk1.7.0_10.jdk/Contents/Home/jre/classes, env.TMPDIR=/var/folders/mg/jm6zmcnd1sg7w34790t70_0w0000gn/T/, env.Apple_Ubiquity_Message=/tmp/launch-j3MbXo/Apple_Ubiquity_Message, env.PWD=/Users/dan/proj/4/mahout/mrunit, env.rvm_ruby_make=, env.rvm_ruby_make_install=, env.rvm_proxy=, env.LANG=en_US.UTF-8, java.vm.specification.vendor=Oracle Corporation, java.runtime.version=1.7.0_10-ea-b09, env.MY_RUBY_HOME=/Users/dan/.rvm/rubies/ruby-1.9.2-p318, env.Apple_PubSub_Socket_Render=/tmp/launch-0x9mUv/Render, project.build.sourceEncoding=UTF-8, env.DISPLAY=/tmp/launch-6MwwYO/org.macosforge.xquartz:0, env.rvm_version=1.11.3, user.name=dan, env.escape_flag=1, env.USER=dan, env.SHELL=/bin/zsh, sourceReleaseAssemblyDescriptor=source-release, env.__CF_USER_TEXT_ENCODING=0x1F5:0:0, env.PATH=/Users/dan/.rvm/gems/ruby-1.9.2-p318/bin:/Users/dan/.rvm/gems/ruby-1.9.2-p318@global/bin:/Users/dan/.rvm/rubies/ruby-1.9.2-p318/bin:/Users/dan/.rvm/bin:/System/Library/Java/JavaVirtualMachines/1.6.0.jdk/Contents/Home/bin:/Users/dan/bin:/usr/local/sbin:/usr/local/bin:/System/Library/Java/JavaVirtualMachines/1.6.0.jdk/Contents/Home/bin:/Users/dan/bin:/usr/local/sbin:/usr/local/bin:/usr/bin:/bin:/usr/sbin:/sbin:/usr/local/bin:/usr/X11/bin:/usr/texbin:/opt/local/bin:/Users/dan/.rvm/bin:/usr/local/hadoop/bin, user.language=en, env.rvm_prefix=/Users/dan, sun.boot.library.path=/Library/Java/JavaVirtualMachines/jdk1.7.0_10.jdk/Contents/Home/jre/lib, classworlds.conf=/usr/share/maven/bin/m2.conf, env.rvm_docs_type=, env.rvm_path=/Users/dan/.rvm, env.LC_CTYPE=en_US.UTF-8, env.RUBY_VERSION=ruby-1.9.2-p318, java.version=1.7.0_10-ea, user.timezone=Europe/Bucharest, organization.logo=http://www.apache.org/images/asf_logo_wide.gif, env._first=1, sun.arch.data.model=64, env.SSH_AGENT_PID=32232, http.nonProxyHosts=local|*.local|169.254/16|*.169.254/16, java.endorsed.dirs=/Library/Java/JavaVirtualMachines/jdk1.7.0_10.jdk/Contents/Home/jre/lib/endorsed, sun.cpu.isalist=, sun.jnu.encoding=UTF-8, env.ITERM_SESSION_ID=w0t0p0, env.rvm_bin_path=/Users/dan/.rvm/bin, file.encoding.pkg=sun.io, env.SHLVL=3, env.rvm_alias_expanded=, file.separator=/, java.specification.name=Java Platform API Specification, java.class.version=51.0, user.country=US, env.rvm_sdk=, java.home=/Library/Java/JavaVirtualMachines/jdk1.7.0_10.jdk/Contents/Home/jre, java.vm.info=mixed mode, env.LOGNAME=dan, os.version=10.8.2, env.rvm_hook=, env.HADOOP_HOME=/usr/local/hadoop, path.separator=:, java.vm.version=23.6-b03, gpg.useagent=true, env._second=2, env.rvm_ruby_file=, env.IRBRC=/Users/dan/.rvm/rubies/ruby-1.9.2-p318/.irbrc, env.JAVA_HOME=/Library/Java/JavaVirtualMachines/jdk1.7.0_10.jdk/Contents/Home, java.awt.printerjob=sun.lwawt.macosx.CPrinterJob, env.TERM=screen-256color, sun.io.unicode.encoding=UnicodeBig, awt.toolkit=sun.lwawt.macosx.LWCToolkit, env.rvm_nightly_flag=, socksNonProxyHosts=local|*.local|169.254/16|*.169.254/16, ftp.nonProxyHosts=local|*.local|169.254/16|*.169.254/16, env.LSCOLORS=Gxfxcxdxbxegedabagacad, env.GREP_COLOR=1;32, env.GEM_PATH=/Users/dan/.rvm/gems/ruby-1.9.2-p318:/Users/dan/.rvm/gems/ruby-1.9.2-p318@global, user.home=/Users/dan, env.OLDPWD=/Users/dan/proj/4/mahout/mrunit, java.specification.vendor=Oracle Corporation, env.TERM_PROGRAM=iTerm.app, env.PAGER=less -R, java.library.path=/Users/dan/Library/Java/Extensions:/Library/Java/Extensions:/Network/Library/Java/Extensions:/System/Library/Java/Extensions:/usr/lib/java:., java.vendor.url=http://java.oracle.com/, distMgmtSnapshotsName=Apache Development Snapshot Repository, java.vm.vendor=Oracle Corporation, gopherProxySet=false, maven.home=/usr/share/maven, java.runtime.name=Java(TM) SE Runtime Environment, sun.java.command=org.codehaus.plexus.classworlds.launcher.Launcher -X package, java.class.path=/usr/share/maven/boot/plexus-classworlds-2.4.jar, java.vm.specification.name=Java Virtual Machine Specification, env.TMUX=/private/var/folders/mg/jm6zmcnd1sg7w34790t70_0w0000gn/T/tmux-501/default,72192,0, java.vm.specification.version=1.7, sun.cpu.endian=little, sun.os.patch.level=unknown, env.HOME=/Users/dan, java.io.tmpdir=/var/folders/mg/jm6zmcnd1sg7w34790t70_0w0000gn/T/, java.vendor.url.bug=http://bugreport.sun.com/bugreport/, distMgmtSnapshotsUrl=https://repository.apache.org/content/repositories/snapshots, env.SSH_AUTH_SOCK=/var/folders/mg/jm6zmcnd1sg7w34790t70_0w0000gn/T//ssh-ogkxxmxwGW9j/agent.32230, env.COMMAND_MODE=unix2003, env.rvm_ruby_mode=, env.rvm_script_name=, env.rvm_wrapper_name=, os.arch=x86_64, java.awt.graphicsenv=sun.awt.CGraphicsEnvironment, env.__array_start=1, java.ext.dirs=/Users/dan/Library/Java/Extensions:/Library/Java/JavaVirtualMachines/jdk1.7.0_10.jdk/Contents/Home/jre/lib/ext:/Library/Java/Extensions:/Network/Library/Java/Extensions:/System/Library/Java/Extensions:/usr/lib/java, user.dir=/Users/dan/Google Drive/proj/4/mahout/mrunit, line.separator=
, java.vm.name=Java HotSpot(TM) 64-Bit Server VM, env.ITERM_PROFILE=Default, file.encoding=UTF-8, env.JAVA_MAIN_CLASS_24997=org.codehaus.plexus.classworlds.launcher.Launcher, java.specification.version=1.7, env.rvm_niceness=, env.rvm_gemstone_url=}
[INFO] Using 'UTF-8' encoding to copy filtered resources.
[DEBUG] resource with targetPath null
directory /Users/dan/Google Drive/proj/4/mahout/mrunit/src/test/resources
excludes []
includes []
[DEBUG] ignoreDelta true
[INFO] Copying 3 resources
[DEBUG] file testarchive.tar has a filtered file extension
[DEBUG] copy /Users/dan/Google Drive/proj/4/mahout/mrunit/src/test/resources/testarchive.tar to /Users/dan/Google Drive/proj/4/mahout/mrunit/target/test-classes/testarchive.tar
[DEBUG] file testarchive.tar.abc has a filtered file extension
[DEBUG] copy /Users/dan/Google Drive/proj/4/mahout/mrunit/src/test/resources/testarchive.tar.abc to /Users/dan/Google Drive/proj/4/mahout/mrunit/target/test-classes/testarchive.tar.abc
[DEBUG] file testfile has a filtered file extension
[DEBUG] copy /Users/dan/Google Drive/proj/4/mahout/mrunit/src/test/resources/testfile to /Users/dan/Google Drive/proj/4/mahout/mrunit/target/test-classes/testfile
[DEBUG] resource with targetPath null
directory /Users/dan/Google Drive/proj/4/mahout/mrunit/target/maven-shared-archive-resources
excludes []
includes []
[DEBUG] ignoreDelta true
[INFO] Copying 3 resources
[DEBUG] file DEPENDENCIES has a filtered file extension
[DEBUG] copy /Users/dan/Google Drive/proj/4/mahout/mrunit/target/maven-shared-archive-resources/META-INF/DEPENDENCIES to /Users/dan/Google Drive/proj/4/mahout/mrunit/target/test-classes/META-INF/DEPENDENCIES
[DEBUG] file LICENSE has a filtered file extension
[DEBUG] copy /Users/dan/Google Drive/proj/4/mahout/mrunit/target/maven-shared-archive-resources/META-INF/LICENSE to /Users/dan/Google Drive/proj/4/mahout/mrunit/target/test-classes/META-INF/LICENSE
[DEBUG] file NOTICE has a filtered file extension
[DEBUG] copy /Users/dan/Google Drive/proj/4/mahout/mrunit/target/maven-shared-archive-resources/META-INF/NOTICE to /Users/dan/Google Drive/proj/4/mahout/mrunit/target/test-classes/META-INF/NOTICE
[DEBUG] no use filter components
[INFO] 
[INFO] --- maven-compiler-plugin:2.3.2:testCompile (default-testCompile) @ mrunit ---
[DEBUG] Configuring mojo org.apache.maven.plugins:maven-compiler-plugin:2.3.2:testCompile from plugin realm ClassRealm[plugin>org.apache.maven.plugins:maven-compiler-plugin:2.3.2, parent: sun.misc.Launcher$AppClassLoader@5ad89e02]
[DEBUG] Configuring mojo 'org.apache.maven.plugins:maven-compiler-plugin:2.3.2:testCompile' with basic configurator -->
[DEBUG]   (f) basedir = /Users/dan/Google Drive/proj/4/mahout/mrunit
[DEBUG]   (f) buildDirectory = /Users/dan/Google Drive/proj/4/mahout/mrunit/target
[DEBUG]   (f) classpathElements = [/Users/dan/Google Drive/proj/4/mahout/mrunit/target/test-classes, /Users/dan/Google Drive/proj/4/mahout/mrunit/target/classes, /Users/dan/.m2/repository/junit/junit/4.10/junit-4.10.jar, /Users/dan/.m2/repository/org/hamcrest/hamcrest-core/1.1/hamcrest-core-1.1.jar, /Users/dan/.m2/repository/commons-logging/commons-logging/1.1.1/commons-logging-1.1.1.jar, /Users/dan/.m2/repository/org/mockito/mockito-all/1.8.5/mockito-all-1.8.5.jar, /Users/dan/.m2/repository/org/apache/hadoop/hadoop-core/1.0.3/hadoop-core-1.0.3.jar, /Users/dan/.m2/repository/commons-cli/commons-cli/1.2/commons-cli-1.2.jar, /Users/dan/.m2/repository/xmlenc/xmlenc/0.52/xmlenc-0.52.jar, /Users/dan/.m2/repository/commons-httpclient/commons-httpclient/3.0.1/commons-httpclient-3.0.1.jar, /Users/dan/.m2/repository/commons-codec/commons-codec/1.4/commons-codec-1.4.jar, /Users/dan/.m2/repository/org/apache/commons/commons-math/2.1/commons-math-2.1.jar, /Users/dan/.m2/repository/commons-configuration/commons-configuration/1.6/commons-configuration-1.6.jar, /Users/dan/.m2/repository/commons-collections/commons-collections/3.2.1/commons-collections-3.2.1.jar, /Users/dan/.m2/repository/commons-lang/commons-lang/2.4/commons-lang-2.4.jar, /Users/dan/.m2/repository/commons-digester/commons-digester/1.8/commons-digester-1.8.jar, /Users/dan/.m2/repository/commons-beanutils/commons-beanutils/1.7.0/commons-beanutils-1.7.0.jar, /Users/dan/.m2/repository/commons-beanutils/commons-beanutils-core/1.8.0/commons-beanutils-core-1.8.0.jar, /Users/dan/.m2/repository/commons-net/commons-net/1.4.1/commons-net-1.4.1.jar, /Users/dan/.m2/repository/org/mortbay/jetty/jetty/6.1.26/jetty-6.1.26.jar, /Users/dan/.m2/repository/org/mortbay/jetty/servlet-api/2.5-20081211/servlet-api-2.5-20081211.jar, /Users/dan/.m2/repository/org/mortbay/jetty/jetty-util/6.1.26/jetty-util-6.1.26.jar, /Users/dan/.m2/repository/tomcat/jasper-runtime/5.5.12/jasper-runtime-5.5.12.jar, /Users/dan/.m2/repository/tomcat/jasper-compiler/5.5.12/jasper-compiler-5.5.12.jar, /Users/dan/.m2/repository/org/mortbay/jetty/jsp-api-2.1/6.1.14/jsp-api-2.1-6.1.14.jar, /Users/dan/.m2/repository/org/mortbay/jetty/servlet-api-2.5/6.1.14/servlet-api-2.5-6.1.14.jar, /Users/dan/.m2/repository/org/mortbay/jetty/jsp-2.1/6.1.14/jsp-2.1-6.1.14.jar, /Users/dan/.m2/repository/ant/ant/1.6.5/ant-1.6.5.jar, /Users/dan/.m2/repository/commons-el/commons-el/1.0/commons-el-1.0.jar, /Users/dan/.m2/repository/net/java/dev/jets3t/jets3t/0.7.1/jets3t-0.7.1.jar, /Users/dan/.m2/repository/net/sf/kosmosfs/kfs/0.3/kfs-0.3.jar, /Users/dan/.m2/repository/hsqldb/hsqldb/1.8.0.10/hsqldb-1.8.0.10.jar, /Users/dan/.m2/repository/oro/oro/2.0.8/oro-2.0.8.jar, /Users/dan/.m2/repository/org/eclipse/jdt/core/3.1.1/core-3.1.1.jar, /Users/dan/.m2/repository/org/codehaus/jackson/jackson-mapper-asl/1.0.1/jackson-mapper-asl-1.0.1.jar, /Users/dan/.m2/repository/org/codehaus/jackson/jackson-core-asl/1.0.1/jackson-core-asl-1.0.1.jar]
[DEBUG]   (f) compileSourceRoots = [/Users/dan/Google Drive/proj/4/mahout/mrunit/src/test/java]
[DEBUG]   (f) compilerId = javac
[DEBUG]   (f) debug = true
[DEBUG]   (f) encoding = UTF-8
[DEBUG]   (f) failOnError = true
[DEBUG]   (f) fork = false
[DEBUG]   (f) generatedTestSourcesDirectory = /Users/dan/Google Drive/proj/4/mahout/mrunit/target/generated-sources/test-annotations
[DEBUG]   (f) optimize = false
[DEBUG]   (f) outputDirectory = /Users/dan/Google Drive/proj/4/mahout/mrunit/target/test-classes
[DEBUG]   (f) outputFileName = mrunit-1.0.0-SNAPSHOT
[DEBUG]   (f) session = org.apache.maven.execution.MavenSession@bb933cb
[DEBUG]   (f) showDeprecation = false
[DEBUG]   (f) showWarnings = false
[DEBUG]   (f) source = 1.6
[DEBUG]   (f) staleMillis = 0
[DEBUG]   (f) target = 1.6
[DEBUG]   (f) verbose = false
[DEBUG] -- end configuration --
[DEBUG] Using compiler 'javac'.
[DEBUG] Source directories: [/Users/dan/Google Drive/proj/4/mahout/mrunit/src/test/java]
[DEBUG] Classpath: [/Users/dan/Google Drive/proj/4/mahout/mrunit/target/test-classes
 /Users/dan/Google Drive/proj/4/mahout/mrunit/target/classes
 /Users/dan/.m2/repository/junit/junit/4.10/junit-4.10.jar
 /Users/dan/.m2/repository/org/hamcrest/hamcrest-core/1.1/hamcrest-core-1.1.jar
 /Users/dan/.m2/repository/commons-logging/commons-logging/1.1.1/commons-logging-1.1.1.jar
 /Users/dan/.m2/repository/org/mockito/mockito-all/1.8.5/mockito-all-1.8.5.jar
 /Users/dan/.m2/repository/org/apache/hadoop/hadoop-core/1.0.3/hadoop-core-1.0.3.jar
 /Users/dan/.m2/repository/commons-cli/commons-cli/1.2/commons-cli-1.2.jar
 /Users/dan/.m2/repository/xmlenc/xmlenc/0.52/xmlenc-0.52.jar
 /Users/dan/.m2/repository/commons-httpclient/commons-httpclient/3.0.1/commons-httpclient-3.0.1.jar
 /Users/dan/.m2/repository/commons-codec/commons-codec/1.4/commons-codec-1.4.jar
 /Users/dan/.m2/repository/org/apache/commons/commons-math/2.1/commons-math-2.1.jar
 /Users/dan/.m2/repository/commons-configuration/commons-configuration/1.6/commons-configuration-1.6.jar
 /Users/dan/.m2/repository/commons-collections/commons-collections/3.2.1/commons-collections-3.2.1.jar
 /Users/dan/.m2/repository/commons-lang/commons-lang/2.4/commons-lang-2.4.jar
 /Users/dan/.m2/repository/commons-digester/commons-digester/1.8/commons-digester-1.8.jar
 /Users/dan/.m2/repository/commons-beanutils/commons-beanutils/1.7.0/commons-beanutils-1.7.0.jar
 /Users/dan/.m2/repository/commons-beanutils/commons-beanutils-core/1.8.0/commons-beanutils-core-1.8.0.jar
 /Users/dan/.m2/repository/commons-net/commons-net/1.4.1/commons-net-1.4.1.jar
 /Users/dan/.m2/repository/org/mortbay/jetty/jetty/6.1.26/jetty-6.1.26.jar
 /Users/dan/.m2/repository/org/mortbay/jetty/servlet-api/2.5-20081211/servlet-api-2.5-20081211.jar
 /Users/dan/.m2/repository/org/mortbay/jetty/jetty-util/6.1.26/jetty-util-6.1.26.jar
 /Users/dan/.m2/repository/tomcat/jasper-runtime/5.5.12/jasper-runtime-5.5.12.jar
 /Users/dan/.m2/repository/tomcat/jasper-compiler/5.5.12/jasper-compiler-5.5.12.jar
 /Users/dan/.m2/repository/org/mortbay/jetty/jsp-api-2.1/6.1.14/jsp-api-2.1-6.1.14.jar
 /Users/dan/.m2/repository/org/mortbay/jetty/servlet-api-2.5/6.1.14/servlet-api-2.5-6.1.14.jar
 /Users/dan/.m2/repository/org/mortbay/jetty/jsp-2.1/6.1.14/jsp-2.1-6.1.14.jar
 /Users/dan/.m2/repository/ant/ant/1.6.5/ant-1.6.5.jar
 /Users/dan/.m2/repository/commons-el/commons-el/1.0/commons-el-1.0.jar
 /Users/dan/.m2/repository/net/java/dev/jets3t/jets3t/0.7.1/jets3t-0.7.1.jar
 /Users/dan/.m2/repository/net/sf/kosmosfs/kfs/0.3/kfs-0.3.jar
 /Users/dan/.m2/repository/hsqldb/hsqldb/1.8.0.10/hsqldb-1.8.0.10.jar
 /Users/dan/.m2/repository/oro/oro/2.0.8/oro-2.0.8.jar
 /Users/dan/.m2/repository/org/eclipse/jdt/core/3.1.1/core-3.1.1.jar
 /Users/dan/.m2/repository/org/codehaus/jackson/jackson-mapper-asl/1.0.1/jackson-mapper-asl-1.0.1.jar
 /Users/dan/.m2/repository/org/codehaus/jackson/jackson-core-asl/1.0.1/jackson-core-asl-1.0.1.jar]
[DEBUG] Output directory: /Users/dan/Google Drive/proj/4/mahout/mrunit/target/test-classes
[INFO] Nothing to compile - all classes are up to date
[INFO] 
[INFO] --- maven-surefire-plugin:2.8.1:test (default-test) @ mrunit ---
[DEBUG] org.apache.maven.plugins:maven-surefire-plugin:jar:2.8.1:
[DEBUG]    org.apache.maven:maven-plugin-api:jar:2.0.9:compile
[DEBUG]    org.apache.maven.surefire:surefire-booter:jar:2.8.1:compile
[DEBUG]       org.apache.maven.surefire:surefire-api:jar:2.8.1:compile
[DEBUG]    org.apache.maven.surefire:maven-surefire-common:jar:2.8.1:compile
[DEBUG]       org.apache.maven.shared:maven-common-artifact-filters:jar:1.3:compile
[DEBUG]    org.codehaus.plexus:plexus-utils:jar:2.0.7:compile
[DEBUG]    org.apache.maven:maven-artifact:jar:2.0.9:compile
[DEBUG]    org.apache.maven:maven-project:jar:2.0.9:compile
[DEBUG]       org.apache.maven:maven-settings:jar:2.0.9:compile
[DEBUG]       org.apache.maven:maven-profile:jar:2.0.9:compile
[DEBUG]       org.apache.maven:maven-model:jar:2.0.9:compile
[DEBUG]       org.apache.maven:maven-artifact-manager:jar:2.0.9:compile
[DEBUG]       org.apache.maven:maven-plugin-registry:jar:2.0.9:compile
[DEBUG]       org.codehaus.plexus:plexus-container-default:jar:1.0-alpha-9-stable-1:compile
[DEBUG]          junit:junit:jar:3.8.1:test (scope managed from compile)
[DEBUG]    org.apache.maven:maven-core:jar:2.0.9:compile
[DEBUG]       org.apache.maven:maven-plugin-parameter-documenter:jar:2.0.9:compile
[DEBUG]       org.apache.maven.reporting:maven-reporting-api:jar:2.0.9:compile
[DEBUG]       org.apache.maven:maven-repository-metadata:jar:2.0.9:compile
[DEBUG]       org.apache.maven:maven-error-diagnostics:jar:2.0.9:compile
[DEBUG]       org.apache.maven:maven-plugin-descriptor:jar:2.0.9:compile
[DEBUG]       org.apache.maven:maven-monitor:jar:2.0.9:compile
[DEBUG]       classworlds:classworlds:jar:1.1:compile
[DEBUG]    org.apache.maven:maven-toolchain:jar:2.0.9:compile
[DEBUG] Created new class realm plugin>org.apache.maven.plugins:maven-surefire-plugin:2.8.1
[DEBUG] Importing foreign packages into class realm plugin>org.apache.maven.plugins:maven-surefire-plugin:2.8.1
[DEBUG]   Imported:  < maven.api
[DEBUG] Populating class realm plugin>org.apache.maven.plugins:maven-surefire-plugin:2.8.1
[DEBUG]   Included: org.apache.maven.plugins:maven-surefire-plugin:jar:2.8.1
[DEBUG]   Included: org.apache.maven.surefire:surefire-booter:jar:2.8.1
[DEBUG]   Included: org.apache.maven.surefire:surefire-api:jar:2.8.1
[DEBUG]   Included: org.apache.maven.surefire:maven-surefire-common:jar:2.8.1
[DEBUG]   Included: org.apache.maven.shared:maven-common-artifact-filters:jar:1.3
[DEBUG]   Included: org.codehaus.plexus:plexus-utils:jar:2.0.7
[DEBUG]   Included: org.apache.maven.reporting:maven-reporting-api:jar:2.0.9
[DEBUG]   Excluded: org.apache.maven:maven-plugin-api:jar:2.0.9
[DEBUG]   Excluded: org.apache.maven:maven-artifact:jar:2.0.9
[DEBUG]   Excluded: org.apache.maven:maven-project:jar:2.0.9
[DEBUG]   Excluded: org.apache.maven:maven-settings:jar:2.0.9
[DEBUG]   Excluded: org.apache.maven:maven-profile:jar:2.0.9
[DEBUG]   Excluded: org.apache.maven:maven-model:jar:2.0.9
[DEBUG]   Excluded: org.apache.maven:maven-artifact-manager:jar:2.0.9
[DEBUG]   Excluded: org.apache.maven:maven-plugin-registry:jar:2.0.9
[DEBUG]   Excluded: org.codehaus.plexus:plexus-container-default:jar:1.0-alpha-9-stable-1
[DEBUG]   Excluded: junit:junit:jar:3.8.1
[DEBUG]   Excluded: org.apache.maven:maven-core:jar:2.0.9
[DEBUG]   Excluded: org.apache.maven:maven-plugin-parameter-documenter:jar:2.0.9
[DEBUG]   Excluded: org.apache.maven:maven-repository-metadata:jar:2.0.9
[DEBUG]   Excluded: org.apache.maven:maven-error-diagnostics:jar:2.0.9
[DEBUG]   Excluded: org.apache.maven:maven-plugin-descriptor:jar:2.0.9
[DEBUG]   Excluded: org.apache.maven:maven-monitor:jar:2.0.9
[DEBUG]   Excluded: classworlds:classworlds:jar:1.1
[DEBUG]   Excluded: org.apache.maven:maven-toolchain:jar:2.0.9
[DEBUG] Configuring mojo org.apache.maven.plugins:maven-surefire-plugin:2.8.1:test from plugin realm ClassRealm[plugin>org.apache.maven.plugins:maven-surefire-plugin:2.8.1, parent: sun.misc.Launcher$AppClassLoader@5ad89e02]
[DEBUG] Configuring mojo 'org.apache.maven.plugins:maven-surefire-plugin:2.8.1:test' with basic configurator -->
[DEBUG]   (s) basedir = /Users/dan/Google Drive/proj/4/mahout/mrunit
[DEBUG]   (s) childDelegation = false
[DEBUG]   (s) classesDirectory = /Users/dan/Google Drive/proj/4/mahout/mrunit/target/classes
[DEBUG]   (s) disableXmlReport = false
[DEBUG]   (s) enableAssertions = true
[DEBUG]   (s) forkMode = once
[DEBUG]   (s) junitArtifactName = junit:junit
[DEBUG]   (s) localRepository =        id: local
      url: file:///Users/dan/.m2/repository/
   layout: none

[DEBUG]   (f) parallelMavenExecution = false
[DEBUG]   (s) perCoreThreadCount = true
[DEBUG]   (s) pluginArtifactMap = {org.apache.maven.plugins:maven-surefire-plugin=org.apache.maven.plugins:maven-surefire-plugin:maven-plugin:2.8.1:, org.apache.maven.surefire:surefire-booter=org.apache.maven.surefire:surefire-booter:jar:2.8.1:compile, org.apache.maven.surefire:surefire-api=org.apache.maven.surefire:surefire-api:jar:2.8.1:compile, org.apache.maven.surefire:maven-surefire-common=org.apache.maven.surefire:maven-surefire-common:jar:2.8.1:compile, org.apache.maven.shared:maven-common-artifact-filters=org.apache.maven.shared:maven-common-artifact-filters:jar:1.3:compile, org.codehaus.plexus:plexus-utils=org.codehaus.plexus:plexus-utils:jar:2.0.7:compile, org.apache.maven.reporting:maven-reporting-api=org.apache.maven.reporting:maven-reporting-api:jar:2.0.9:compile}
[DEBUG]   (s) printSummary = true
[DEBUG]   (s) project = MavenProject: org.apache.mrunit:mrunit:1.0.0-SNAPSHOT @ /Users/dan/Google Drive/proj/4/mahout/mrunit/pom.xml
[DEBUG]   (s) projectArtifactMap = {junit:junit=junit:junit:jar:4.10:compile, org.hamcrest:hamcrest-core=org.hamcrest:hamcrest-core:jar:1.1:compile, commons-logging:commons-logging=commons-logging:commons-logging:jar:1.1.1:compile, org.mockito:mockito-all=org.mockito:mockito-all:jar:1.8.5:compile, org.apache.hadoop:hadoop-core=org.apache.hadoop:hadoop-core:jar:1.0.3:provided, commons-cli:commons-cli=commons-cli:commons-cli:jar:1.2:provided, xmlenc:xmlenc=xmlenc:xmlenc:jar:0.52:provided, commons-httpclient:commons-httpclient=commons-httpclient:commons-httpclient:jar:3.0.1:provided, commons-codec:commons-codec=commons-codec:commons-codec:jar:1.4:provided, org.apache.commons:commons-math=org.apache.commons:commons-math:jar:2.1:provided, commons-configuration:commons-configuration=commons-configuration:commons-configuration:jar:1.6:provided, commons-collections:commons-collections=commons-collections:commons-collections:jar:3.2.1:provided, commons-lang:commons-lang=commons-lang:commons-lang:jar:2.4:provided, commons-digester:commons-digester=commons-digester:commons-digester:jar:1.8:provided, commons-beanutils:commons-beanutils=commons-beanutils:commons-beanutils:jar:1.7.0:provided, commons-beanutils:commons-beanutils-core=commons-beanutils:commons-beanutils-core:jar:1.8.0:provided, commons-net:commons-net=commons-net:commons-net:jar:1.4.1:provided, org.mortbay.jetty:jetty=org.mortbay.jetty:jetty:jar:6.1.26:provided, org.mortbay.jetty:servlet-api=org.mortbay.jetty:servlet-api:jar:2.5-20081211:provided, org.mortbay.jetty:jetty-util=org.mortbay.jetty:jetty-util:jar:6.1.26:provided, tomcat:jasper-runtime=tomcat:jasper-runtime:jar:5.5.12:provided, tomcat:jasper-compiler=tomcat:jasper-compiler:jar:5.5.12:provided, org.mortbay.jetty:jsp-api-2.1=org.mortbay.jetty:jsp-api-2.1:jar:6.1.14:provided, org.mortbay.jetty:servlet-api-2.5=org.mortbay.jetty:servlet-api-2.5:jar:6.1.14:provided, org.mortbay.jetty:jsp-2.1=org.mortbay.jetty:jsp-2.1:jar:6.1.14:provided, ant:ant=ant:ant:jar:1.6.5:provided, commons-el:commons-el=commons-el:commons-el:jar:1.0:provided, net.java.dev.jets3t:jets3t=net.java.dev.jets3t:jets3t:jar:0.7.1:provided, net.sf.kosmosfs:kfs=net.sf.kosmosfs:kfs:jar:0.3:provided, hsqldb:hsqldb=hsqldb:hsqldb:jar:1.8.0.10:provided, oro:oro=oro:oro:jar:2.0.8:provided, org.eclipse.jdt:core=org.eclipse.jdt:core:jar:3.1.1:provided, org.codehaus.jackson:jackson-mapper-asl=org.codehaus.jackson:jackson-mapper-asl:jar:1.0.1:provided, org.codehaus.jackson:jackson-core-asl=org.codehaus.jackson:jackson-core-asl:jar:1.0.1:provided}
[DEBUG]   (s) redirectTestOutputToFile = true
[DEBUG]   (s) remoteRepositories = [       id: central
      url: http://repo1.maven.org/maven2
   layout: default
snapshots: [enabled => false, update => daily]
 releases: [enabled => true, update => never]
]
[DEBUG]   (s) reportFormat = brief
[DEBUG]   (s) reportsDirectory = /Users/dan/Google Drive/proj/4/mahout/mrunit/target/surefire-reports
[DEBUG]   (s) runOrder = filesystem
[DEBUG]   (s) session = org.apache.maven.execution.MavenSession@bb933cb
[DEBUG]   (s) skip = false
[DEBUG]   (s) skipTests = false
[DEBUG]   (s) testClassesDirectory = /Users/dan/Google Drive/proj/4/mahout/mrunit/target/test-classes
[DEBUG]   (s) testFailureIgnore = false
[DEBUG]   (s) testNGArtifactName = org.testng:testng
[DEBUG]   (s) testSourceDirectory = /Users/dan/Google Drive/proj/4/mahout/mrunit/src/test/java
[DEBUG]   (s) trimStackTrace = true
[DEBUG]   (s) useFile = true
[DEBUG]   (s) useManifestOnlyJar = true
[DEBUG]   (s) useSystemClassLoader = true
[DEBUG]   (s) useUnlimitedThreads = false
[DEBUG]   (s) workingDirectory = /Users/dan/Google Drive/proj/4/mahout/mrunit
[DEBUG] -- end configuration --
[INFO] Surefire report directory: /Users/dan/Google Drive/proj/4/mahout/mrunit/target/surefire-reports
[DEBUG] dummy:dummy:jar:1.0 (selected for null)
[DEBUG]   org.apache.maven.surefire:surefire-booter:jar:2.8.1:compile (selected for compile)
[DEBUG]     org.apache.maven.surefire:surefire-api:jar:2.8.1:compile (selected for compile)
[DEBUG] Adding to surefire booter test classpath: /Users/dan/.m2/repository/org/apache/maven/surefire/surefire-booter/2.8.1/surefire-booter-2.8.1.jar Scope: compile
[DEBUG] Adding to surefire booter test classpath: /Users/dan/.m2/repository/org/apache/maven/surefire/surefire-api/2.8.1/surefire-api-2.8.1.jar Scope: compile
[DEBUG] Setting system property [user.dir]=[/Users/dan/Google Drive/proj/4/mahout/mrunit]
[DEBUG] Setting system property [localRepository]=[/Users/dan/.m2/repository]
[DEBUG] Setting system property [basedir]=[/Users/dan/Google Drive/proj/4/mahout/mrunit]
[DEBUG] Using JVM: /Library/Java/JavaVirtualMachines/jdk1.7.0_10.jdk/Contents/Home/jre/bin/java
[DEBUG] dummy:dummy:jar:1.0 (selected for null)
[DEBUG]   org.apache.maven.surefire:surefire-junit4:jar:2.8.1:test (selected for test)
[DEBUG]     org.apache.maven.surefire:surefire-api:jar:2.8.1:test (selected for test)
[DEBUG] Adding to surefire test classpath: /Users/dan/.m2/repository/org/apache/maven/surefire/surefire-junit4/2.8.1/surefire-junit4-2.8.1.jar Scope: test
[DEBUG] Adding to surefire test classpath: /Users/dan/.m2/repository/org/apache/maven/surefire/surefire-api/2.8.1/surefire-api-2.8.1.jar Scope: test
[DEBUG] test classpath classpath:
[DEBUG]   /Users/dan/Google Drive/proj/4/mahout/mrunit/target/test-classes
[DEBUG]   /Users/dan/Google Drive/proj/4/mahout/mrunit/target/classes
[DEBUG]   /Users/dan/.m2/repository/junit/junit/4.10/junit-4.10.jar
[DEBUG]   /Users/dan/.m2/repository/org/hamcrest/hamcrest-core/1.1/hamcrest-core-1.1.jar
[DEBUG]   /Users/dan/.m2/repository/commons-logging/commons-logging/1.1.1/commons-logging-1.1.1.jar
[DEBUG]   /Users/dan/.m2/repository/org/mockito/mockito-all/1.8.5/mockito-all-1.8.5.jar
[DEBUG]   /Users/dan/.m2/repository/org/apache/hadoop/hadoop-core/1.0.3/hadoop-core-1.0.3.jar
[DEBUG]   /Users/dan/.m2/repository/commons-cli/commons-cli/1.2/commons-cli-1.2.jar
[DEBUG]   /Users/dan/.m2/repository/xmlenc/xmlenc/0.52/xmlenc-0.52.jar
[DEBUG]   /Users/dan/.m2/repository/commons-httpclient/commons-httpclient/3.0.1/commons-httpclient-3.0.1.jar
[DEBUG]   /Users/dan/.m2/repository/commons-codec/commons-codec/1.4/commons-codec-1.4.jar
[DEBUG]   /Users/dan/.m2/repository/org/apache/commons/commons-math/2.1/commons-math-2.1.jar
[DEBUG]   /Users/dan/.m2/repository/commons-configuration/commons-configuration/1.6/commons-configuration-1.6.jar
[DEBUG]   /Users/dan/.m2/repository/commons-collections/commons-collections/3.2.1/commons-collections-3.2.1.jar
[DEBUG]   /Users/dan/.m2/repository/commons-lang/commons-lang/2.4/commons-lang-2.4.jar
[DEBUG]   /Users/dan/.m2/repository/commons-digester/commons-digester/1.8/commons-digester-1.8.jar
[DEBUG]   /Users/dan/.m2/repository/commons-beanutils/commons-beanutils/1.7.0/commons-beanutils-1.7.0.jar
[DEBUG]   /Users/dan/.m2/repository/commons-beanutils/commons-beanutils-core/1.8.0/commons-beanutils-core-1.8.0.jar
[DEBUG]   /Users/dan/.m2/repository/commons-net/commons-net/1.4.1/commons-net-1.4.1.jar
[DEBUG]   /Users/dan/.m2/repository/org/mortbay/jetty/jetty/6.1.26/jetty-6.1.26.jar
[DEBUG]   /Users/dan/.m2/repository/org/mortbay/jetty/servlet-api/2.5-20081211/servlet-api-2.5-20081211.jar
[DEBUG]   /Users/dan/.m2/repository/org/mortbay/jetty/jetty-util/6.1.26/jetty-util-6.1.26.jar
[DEBUG]   /Users/dan/.m2/repository/tomcat/jasper-runtime/5.5.12/jasper-runtime-5.5.12.jar
[DEBUG]   /Users/dan/.m2/repository/tomcat/jasper-compiler/5.5.12/jasper-compiler-5.5.12.jar
[DEBUG]   /Users/dan/.m2/repository/org/mortbay/jetty/jsp-api-2.1/6.1.14/jsp-api-2.1-6.1.14.jar
[DEBUG]   /Users/dan/.m2/repository/org/mortbay/jetty/servlet-api-2.5/6.1.14/servlet-api-2.5-6.1.14.jar
[DEBUG]   /Users/dan/.m2/repository/org/mortbay/jetty/jsp-2.1/6.1.14/jsp-2.1-6.1.14.jar
[DEBUG]   /Users/dan/.m2/repository/ant/ant/1.6.5/ant-1.6.5.jar
[DEBUG]   /Users/dan/.m2/repository/commons-el/commons-el/1.0/commons-el-1.0.jar
[DEBUG]   /Users/dan/.m2/repository/net/java/dev/jets3t/jets3t/0.7.1/jets3t-0.7.1.jar
[DEBUG]   /Users/dan/.m2/repository/net/sf/kosmosfs/kfs/0.3/kfs-0.3.jar
[DEBUG]   /Users/dan/.m2/repository/hsqldb/hsqldb/1.8.0.10/hsqldb-1.8.0.10.jar
[DEBUG]   /Users/dan/.m2/repository/oro/oro/2.0.8/oro-2.0.8.jar
[DEBUG]   /Users/dan/.m2/repository/org/eclipse/jdt/core/3.1.1/core-3.1.1.jar
[DEBUG]   /Users/dan/.m2/repository/org/codehaus/jackson/jackson-mapper-asl/1.0.1/jackson-mapper-asl-1.0.1.jar
[DEBUG]   /Users/dan/.m2/repository/org/codehaus/jackson/jackson-core-asl/1.0.1/jackson-core-asl-1.0.1.jar
[DEBUG] provider classpath classpath:
[DEBUG]   /Users/dan/Google Drive/proj/4/mahout/mrunit/target/test-classes
[DEBUG]   /Users/dan/Google Drive/proj/4/mahout/mrunit/target/classes
[DEBUG]   /Users/dan/.m2/repository/junit/junit/4.10/junit-4.10.jar
[DEBUG]   /Users/dan/.m2/repository/org/hamcrest/hamcrest-core/1.1/hamcrest-core-1.1.jar
[DEBUG]   /Users/dan/.m2/repository/commons-logging/commons-logging/1.1.1/commons-logging-1.1.1.jar
[DEBUG]   /Users/dan/.m2/repository/org/mockito/mockito-all/1.8.5/mockito-all-1.8.5.jar
[DEBUG]   /Users/dan/.m2/repository/org/apache/hadoop/hadoop-core/1.0.3/hadoop-core-1.0.3.jar
[DEBUG]   /Users/dan/.m2/repository/commons-cli/commons-cli/1.2/commons-cli-1.2.jar
[DEBUG]   /Users/dan/.m2/repository/xmlenc/xmlenc/0.52/xmlenc-0.52.jar
[DEBUG]   /Users/dan/.m2/repository/commons-httpclient/commons-httpclient/3.0.1/commons-httpclient-3.0.1.jar
[DEBUG]   /Users/dan/.m2/repository/commons-codec/commons-codec/1.4/commons-codec-1.4.jar
[DEBUG]   /Users/dan/.m2/repository/org/apache/commons/commons-math/2.1/commons-math-2.1.jar
[DEBUG]   /Users/dan/.m2/repository/commons-configuration/commons-configuration/1.6/commons-configuration-1.6.jar
[DEBUG]   /Users/dan/.m2/repository/commons-collections/commons-collections/3.2.1/commons-collections-3.2.1.jar
[DEBUG]   /Users/dan/.m2/repository/commons-lang/commons-lang/2.4/commons-lang-2.4.jar
[DEBUG]   /Users/dan/.m2/repository/commons-digester/commons-digester/1.8/commons-digester-1.8.jar
[DEBUG]   /Users/dan/.m2/repository/commons-beanutils/commons-beanutils/1.7.0/commons-beanutils-1.7.0.jar
[DEBUG]   /Users/dan/.m2/repository/commons-beanutils/commons-beanutils-core/1.8.0/commons-beanutils-core-1.8.0.jar
[DEBUG]   /Users/dan/.m2/repository/commons-net/commons-net/1.4.1/commons-net-1.4.1.jar
[DEBUG]   /Users/dan/.m2/repository/org/mortbay/jetty/jetty/6.1.26/jetty-6.1.26.jar
[DEBUG]   /Users/dan/.m2/repository/org/mortbay/jetty/servlet-api/2.5-20081211/servlet-api-2.5-20081211.jar
[DEBUG]   /Users/dan/.m2/repository/org/mortbay/jetty/jetty-util/6.1.26/jetty-util-6.1.26.jar
[DEBUG]   /Users/dan/.m2/repository/tomcat/jasper-runtime/5.5.12/jasper-runtime-5.5.12.jar
[DEBUG]   /Users/dan/.m2/repository/tomcat/jasper-compiler/5.5.12/jasper-compiler-5.5.12.jar
[DEBUG]   /Users/dan/.m2/repository/org/mortbay/jetty/jsp-api-2.1/6.1.14/jsp-api-2.1-6.1.14.jar
[DEBUG]   /Users/dan/.m2/repository/org/mortbay/jetty/servlet-api-2.5/6.1.14/servlet-api-2.5-6.1.14.jar
[DEBUG]   /Users/dan/.m2/repository/org/mortbay/jetty/jsp-2.1/6.1.14/jsp-2.1-6.1.14.jar
[DEBUG]   /Users/dan/.m2/repository/ant/ant/1.6.5/ant-1.6.5.jar
[DEBUG]   /Users/dan/.m2/repository/commons-el/commons-el/1.0/commons-el-1.0.jar
[DEBUG]   /Users/dan/.m2/repository/net/java/dev/jets3t/jets3t/0.7.1/jets3t-0.7.1.jar
[DEBUG]   /Users/dan/.m2/repository/net/sf/kosmosfs/kfs/0.3/kfs-0.3.jar
[DEBUG]   /Users/dan/.m2/repository/hsqldb/hsqldb/1.8.0.10/hsqldb-1.8.0.10.jar
[DEBUG]   /Users/dan/.m2/repository/oro/oro/2.0.8/oro-2.0.8.jar
[DEBUG]   /Users/dan/.m2/repository/org/eclipse/jdt/core/3.1.1/core-3.1.1.jar
[DEBUG]   /Users/dan/.m2/repository/org/codehaus/jackson/jackson-mapper-asl/1.0.1/jackson-mapper-asl-1.0.1.jar
[DEBUG]   /Users/dan/.m2/repository/org/codehaus/jackson/jackson-core-asl/1.0.1/jackson-core-asl-1.0.1.jar
Forking command line: /bin/sh -c cd "/Users/dan/Google Drive/proj/4/mahout/mrunit" && /Library/Java/JavaVirtualMachines/jdk1.7.0_10.jdk/Contents/Home/jre/bin/java -jar '/Users/dan/Google Drive/proj/4/mahout/mrunit/target/surefire/surefirebooter209457673865645600.jar' '/Users/dan/Google Drive/proj/4/mahout/mrunit/target/surefire/surefire4802512002101863293tmp' '/Users/dan/Google Drive/proj/4/mahout/mrunit/target/surefire/surefire5821769775638062148tmp'

-------------------------------------------------------
 T E S T S
-------------------------------------------------------
Running org.apache.hadoop.mrunit.internal.io.TestSerialization
Tests run: 3, Failures: 0, Errors: 0, Skipped: 0, Time elapsed: 0.352 sec
Running org.apache.hadoop.mrunit.internal.mapred.TestMockOutputCollector
Tests run: 1, Failures: 0, Errors: 0, Skipped: 0, Time elapsed: 0.17 sec
Running org.apache.hadoop.mrunit.internal.mapred.TestMockReporter
Tests run: 2, Failures: 0, Errors: 0, Skipped: 0, Time elapsed: 0.041 sec
Running org.apache.hadoop.mrunit.mapreduce.TestCounters
Tests run: 3, Failures: 0, Errors: 0, Skipped: 0, Time elapsed: 0.606 sec
Running org.apache.hadoop.mrunit.mapreduce.TestDistributedCache
Tests run: 9, Failures: 0, Errors: 4, Skipped: 0, Time elapsed: 1.435 sec <<< FAILURE!
Running org.apache.hadoop.mrunit.mapreduce.TestMapDriver
Tests run: 30, Failures: 0, Errors: 0, Skipped: 0, Time elapsed: 0.952 sec
Running org.apache.hadoop.mrunit.mapreduce.TestMapReduceDriver
Tests run: 31, Failures: 0, Errors: 0, Skipped: 0, Time elapsed: 1.454 sec
Running org.apache.hadoop.mrunit.mapreduce.TestReduceDriver
Tests run: 30, Failures: 0, Errors: 0, Skipped: 0, Time elapsed: 0.551 sec
Running org.apache.hadoop.mrunit.mapreduce.TestReducerInputValueReuse
Tests run: 1, Failures: 0, Errors: 0, Skipped: 0, Time elapsed: 0.013 sec
Running org.apache.hadoop.mrunit.mapreduce.TestWordCount
Tests run: 3, Failures: 0, Errors: 0, Skipped: 0, Time elapsed: 0.102 sec
Running org.apache.hadoop.mrunit.TestConfigureClose
Tests run: 2, Failures: 0, Errors: 0, Skipped: 0, Time elapsed: 0.02 sec
Running org.apache.hadoop.mrunit.TestCounters
Tests run: 4, Failures: 0, Errors: 0, Skipped: 0, Time elapsed: 0.083 sec
Running org.apache.hadoop.mrunit.TestDistributedCache
Tests run: 9, Failures: 0, Errors: 4, Skipped: 0, Time elapsed: 0.291 sec <<< FAILURE!
Running org.apache.hadoop.mrunit.TestExample
Tests run: 1, Failures: 0, Errors: 0, Skipped: 0, Time elapsed: 0.012 sec
Running org.apache.hadoop.mrunit.TestMapDriver
Tests run: 39, Failures: 0, Errors: 0, Skipped: 0, Time elapsed: 0.568 sec
Running org.apache.hadoop.mrunit.TestMapReduceDriver
Tests run: 33, Failures: 0, Errors: 0, Skipped: 0, Time elapsed: 0.88 sec
Running org.apache.hadoop.mrunit.TestPipelineMapReduceDriver
Tests run: 17, Failures: 0, Errors: 0, Skipped: 0, Time elapsed: 0.665 sec
Running org.apache.hadoop.mrunit.TestReduceDriver
Tests run: 30, Failures: 0, Errors: 0, Skipped: 0, Time elapsed: 0.296 sec
Running org.apache.hadoop.mrunit.TestTestDriver
Tests run: 19, Failures: 0, Errors: 0, Skipped: 0, Time elapsed: 0.01 sec
Running org.apache.hadoop.mrunit.types.TestPair
Tests run: 13, Failures: 0, Errors: 0, Skipped: 0, Time elapsed: 0.006 sec

Results :

Tests in error: 
  testAddCacheArchiveToMapperUsingDriverMethod(org.apache.hadoop.mrunit.mapreduce.TestDistributedCache): tar: Unrecognized archive format
  testAddCacheArchiveToReducerUsingDriverMethod(org.apache.hadoop.mrunit.mapreduce.TestDistributedCache): tar: Unrecognized archive format
  testAddCacheArchiveToMapReduceUsingDriverMethod(org.apache.hadoop.mrunit.mapreduce.TestDistributedCache): tar: Unrecognized archive format
  testAddCacheArchiveToMapReduceUsingDriverMethod2(org.apache.hadoop.mrunit.mapreduce.TestDistributedCache): tar: Unrecognized archive format
  testAddCacheArchiveToMapperUsingDriverMethod(org.apache.hadoop.mrunit.TestDistributedCache): tar: Unrecognized archive format
  testAddCacheArchiveToReducerUsingDriverMethod(org.apache.hadoop.mrunit.TestDistributedCache): tar: Unrecognized archive format
  testAddCacheArchiveToMapReduceUsingDriverMethod(org.apache.hadoop.mrunit.TestDistributedCache): tar: Unrecognized archive format
  testAddCacheArchiveToMapReduceUsingDriverMethod2(org.apache.hadoop.mrunit.TestDistributedCache): tar: Unrecognized archive format

Tests run: 280, Failures: 0, Errors: 8, Skipped: 0

[INFO] ------------------------------------------------------------------------
[INFO] BUILD FAILURE
[INFO] ------------------------------------------------------------------------
[INFO] Total time: 14.211s
[INFO] Finished at: Sat Nov 10 11:57:37 EET 2012
[INFO] Final Memory: 17M/229M
[INFO] ------------------------------------------------------------------------
[ERROR] Failed to execute goal org.apache.maven.plugins:maven-surefire-plugin:2.8.1:test (default-test) on project mrunit: There are test failures.
[ERROR] 
[ERROR] Please refer to /Users/dan/Google Drive/proj/4/mahout/mrunit/target/surefire-reports for the individual test results.
[ERROR] -> [Help 1]
org.apache.maven.lifecycle.LifecycleExecutionException: Failed to execute goal org.apache.maven.plugins:maven-surefire-plugin:2.8.1:test (default-test) on project mrunit: There are test failures.

Please refer to /Users/dan/Google Drive/proj/4/mahout/mrunit/target/surefire-reports for the individual test results.
	at org.apache.maven.lifecycle.internal.MojoExecutor.execute(MojoExecutor.java:213)
	at org.apache.maven.lifecycle.internal.MojoExecutor.execute(MojoExecutor.java:153)
	at org.apache.maven.lifecycle.internal.MojoExecutor.execute(MojoExecutor.java:145)
	at org.apache.maven.lifecycle.internal.LifecycleModuleBuilder.buildProject(LifecycleModuleBuilder.java:84)
	at org.apache.maven.lifecycle.internal.LifecycleModuleBuilder.buildProject(LifecycleModuleBuilder.java:59)
	at org.apache.maven.lifecycle.internal.LifecycleStarter.singleThreadedBuild(LifecycleStarter.java:183)
	at org.apache.maven.lifecycle.internal.LifecycleStarter.execute(LifecycleStarter.java:161)
	at org.apache.maven.DefaultMaven.doExecute(DefaultMaven.java:319)
	at org.apache.maven.DefaultMaven.execute(DefaultMaven.java:156)
	at org.apache.maven.cli.MavenCli.execute(MavenCli.java:537)
	at org.apache.maven.cli.MavenCli.doMain(MavenCli.java:196)
	at org.apache.maven.cli.MavenCli.main(MavenCli.java:141)
	at sun.reflect.NativeMethodAccessorImpl.invoke0(Native Method)
	at sun.reflect.NativeMethodAccessorImpl.invoke(NativeMethodAccessorImpl.java:57)
	at sun.reflect.DelegatingMethodAccessorImpl.invoke(DelegatingMethodAccessorImpl.java:43)
	at java.lang.reflect.Method.invoke(Method.java:601)
	at org.codehaus.plexus.classworlds.launcher.Launcher.launchEnhanced(Launcher.java:290)
	at org.codehaus.plexus.classworlds.launcher.Launcher.launch(Launcher.java:230)
	at org.codehaus.plexus.classworlds.launcher.Launcher.mainWithExitCode(Launcher.java:409)
	at org.codehaus.plexus.classworlds.launcher.Launcher.main(Launcher.java:352)
Caused by: org.apache.maven.plugin.MojoFailureException: There are test failures.

Please refer to /Users/dan/Google Drive/proj/4/mahout/mrunit/target/surefire-reports for the individual test results.
	at org.apache.maven.plugin.surefire.SurefireHelper.reportExecution(SurefireHelper.java:74)
	at org.apache.maven.plugin.surefire.SurefirePlugin.writeSummary(SurefirePlugin.java:644)
	at org.apache.maven.plugin.surefire.SurefirePlugin.executeAfterPreconditionsChecked(SurefirePlugin.java:640)
	at org.apache.maven.plugin.surefire.AbstractSurefireMojo.execute(AbstractSurefireMojo.java:102)
	at org.apache.maven.plugin.DefaultBuildPluginManager.executeMojo(DefaultBuildPluginManager.java:101)
	at org.apache.maven.lifecycle.internal.MojoExecutor.execute(MojoExecutor.java:209)
	... 19 more
[ERROR] 
[ERROR] 
[ERROR] For more information about the errors and possible solutions, please read the following articles:
[ERROR] [Help 1] http://cwiki.apache.org/confluence/display/MAVEN/MojoFailureException


    
> mvn package fails on Mac OS X 10.8.2
> ------------------------------------
>
>                 Key: MRUNIT-160
>                 URL: https://issues.apache.org/jira/browse/MRUNIT-160
>             Project: MRUnit
>          Issue Type: Bug
>    Affects Versions: 1.0.0
>         Environment: Mac OS X 10.8.2
> MacBook Pro 5,5
> java version "1.7.0_10-ea"
> Java(TM) SE Runtime Environment (build 1.7.0_10-ea-b09)
> Java HotSpot(TM) 64-Bit Server VM (build 23.6-b03, mixed mode)
>            Reporter: Dan Filimon
>         Attachments: MRUNIT-160.log
>
>
> After cloning the repo and trying to build the jars by running "mvn package", the command fails. The log is below.
> I've finally been able to build it by running "mvn package -DskipTests -fn" and commenting out the Rat dependency in pom.xml.
> (log attached)

--
This message is automatically generated by JIRA.
If you think it was sent incorrectly, please contact your JIRA administrators
For more information on JIRA, see: http://www.atlassian.com/software/jira

Mime
View raw message