mrunit-dev mailing list archives

Site index · List index
Message view « Date » · « Thread »
Top « Date » · « Thread »
From Apache Jenkins Server <jenk...@builds.apache.org>
Subject Build failed in Jenkins: mrunit-trunk #1119
Date Tue, 06 May 2014 21:56:51 GMT
See <https://builds.apache.org/job/mrunit-trunk/1119/changes>

Changes:

[brock] MRUNIT-193 - Serialization.copy throws NPE instead of ISE (missing serilization impl)
for Hadoop 2.x (Cosmin Lehen via Brock Noland)

[brock] MRUNIT-198 - Serialization is missing in MockMultipleOutputs (Lars Grote via Brock)

[brock] MRUNIT-199 - Mapper.Context and Reducer.Context are not fully mocked (Lukas Nalezenec
via Brock)

[brock] Update release notes for 1.1 release

[brock] Preparing for the 1.1 release

[bdechoux] MRUNIT-202

[bdechoux] MRUNIT-202 : Fix javadoc warnings when generating documentation

[brock] MRUNIT-192 - MRUNIT-180 requires values be comparable (Bertrand via Brock)

[brock] commit

[brock] MRUNIT-190 - Use mvn enforcer plugin to ensure that a non-vulnerable version of java
is used for javadoc generation

[brock] MRUNIT-203 - tarballs should extract to dirs with the same name as tarball

[dechouxb] MRUNIT-201 : update list of committers for maven ie pom.xml

[brock] MRUNIT-205 - Add support for MultipleInputs (Jason E Tedor via Brock)

[brock] Preparing for 1.1.0 release - updating release notes

[dbeech] MRUNIT-208: mrunit unnecessarily depends on mockito-all (Alexandre Normand via Dave
Beech)

[dbeech] MRUNIT-209: Can't use the maven dependency plugin with maven 3 on mrunit (Alexandre
Normand via Dave Beech)

------------------------------------------
Started by an SCM change
Building remotely on ubuntu2 (Ubuntu ubuntu) in workspace <https://builds.apache.org/job/mrunit-trunk/ws/>
 > git rev-parse --is-inside-work-tree
Fetching changes from the remote Git repository
 > git config remote.origin.url https://git-wip-us.apache.org/repos/asf/mrunit.git
Fetching upstream changes from https://git-wip-us.apache.org/repos/asf/mrunit.git
 > git --version
 > git fetch --tags --progress https://git-wip-us.apache.org/repos/asf/mrunit.git +refs/heads/*:refs/remotes/origin/*
 > git rev-parse origin/trunk^{commit}
Checking out Revision 0fa2496c5e57540efdfd6c7e25c8e4b6dc907dba (origin/trunk)
 > git config core.sparsecheckout
 > git checkout -f 0fa2496c5e57540efdfd6c7e25c8e4b6dc907dba
 > git rev-list 2c24ab2af152bc7b41c4d52cba4883aacba40764
 > git tag -a -f -m Jenkins Build #1119 jenkins-mrunit-trunk-1119
Parsing POMs
Modules changed, recalculating dependency graph
maven3-agent.jar already up to date
maven3-interceptor.jar already up to date
maven3-interceptor-commons.jar already up to date
[mrunit-trunk] $ /home/hudson/tools/java/latest1.6/bin/java -cp /home/jenkins/jenkins-slave/maven3-agent.jar:/home/hudson/tools/maven/apache-maven-3.0.4/boot/plexus-classworlds-2.4.jar
org.jvnet.hudson.maven3.agent.Maven3Main /home/hudson/tools/maven/apache-maven-3.0.4 /home/hudson/jenkins-slave/slave.jar
/home/jenkins/jenkins-slave/maven3-interceptor.jar /home/jenkins/jenkins-slave/maven3-interceptor-commons.jar
37135
<===[JENKINS REMOTING CAPACITY]===>   channel started
Executing Maven:  -B -f <https://builds.apache.org/job/mrunit-trunk/ws/pom.xml> -Dmaven.repo.local=/home/jenkins/jenkins-slave/maven-repositories/0
clean package -Dhadoop.version=2
[INFO] Scanning for projects...
[INFO]                                                                         
[INFO] ------------------------------------------------------------------------
[INFO] Building MRUnit 1.2.0-SNAPSHOT
[INFO] ------------------------------------------------------------------------
Downloading: http://repo.maven.apache.org/maven2/org/apache/hadoop/hadoop-common/2.3.0/hadoop-common-2.3.0.pom
Downloaded: http://repo.maven.apache.org/maven2/org/apache/hadoop/hadoop-common/2.3.0/hadoop-common-2.3.0.pom
(27 KB at 157.5 KB/sec)
Downloading: http://repo.maven.apache.org/maven2/org/apache/hadoop/hadoop-project-dist/2.3.0/hadoop-project-dist-2.3.0.pom
Downloaded: http://repo.maven.apache.org/maven2/org/apache/hadoop/hadoop-project-dist/2.3.0/hadoop-project-dist-2.3.0.pom
(18 KB at 539.9 KB/sec)
Downloading: http://repo.maven.apache.org/maven2/org/apache/hadoop/hadoop-project/2.3.0/hadoop-project-2.3.0.pom
Downloaded: http://repo.maven.apache.org/maven2/org/apache/hadoop/hadoop-project/2.3.0/hadoop-project-2.3.0.pom
(38 KB at 895.7 KB/sec)
Downloading: http://repo.maven.apache.org/maven2/org/apache/hadoop/hadoop-main/2.3.0/hadoop-main-2.3.0.pom
Downloaded: http://repo.maven.apache.org/maven2/org/apache/hadoop/hadoop-main/2.3.0/hadoop-main-2.3.0.pom
(18 KB at 550.7 KB/sec)
Downloading: http://repo.maven.apache.org/maven2/org/apache/hadoop/hadoop-annotations/2.3.0/hadoop-annotations-2.3.0.pom
Downloaded: http://repo.maven.apache.org/maven2/org/apache/hadoop/hadoop-annotations/2.3.0/hadoop-annotations-2.3.0.pom
(3 KB at 77.7 KB/sec)
Downloading: http://repo.maven.apache.org/maven2/org/apache/commons/commons-math3/3.1.1/commons-math3-3.1.1.pom
Downloaded: http://repo.maven.apache.org/maven2/org/apache/commons/commons-math3/3.1.1/commons-math3-3.1.1.pom
(14 KB at 456.2 KB/sec)
Downloading: http://repo.maven.apache.org/maven2/net/java/dev/jets3t/jets3t/0.9.0/jets3t-0.9.0.pom
Downloaded: http://repo.maven.apache.org/maven2/net/java/dev/jets3t/jets3t/0.9.0/jets3t-0.9.0.pom
(3 KB at 70.0 KB/sec)
Downloading: http://repo.maven.apache.org/maven2/org/apache/hadoop/hadoop-auth/2.3.0/hadoop-auth-2.3.0.pom
Downloaded: http://repo.maven.apache.org/maven2/org/apache/hadoop/hadoop-auth/2.3.0/hadoop-auth-2.3.0.pom
(6 KB at 170.8 KB/sec)
Downloading: http://repo.maven.apache.org/maven2/org/apache/hadoop/hadoop-mapreduce-client-core/2.3.0/hadoop-mapreduce-client-core-2.3.0.pom
Downloaded: http://repo.maven.apache.org/maven2/org/apache/hadoop/hadoop-mapreduce-client-core/2.3.0/hadoop-mapreduce-client-core-2.3.0.pom
(4 KB at 103.9 KB/sec)
Downloading: http://repo.maven.apache.org/maven2/org/apache/hadoop/hadoop-mapreduce-client/2.3.0/hadoop-mapreduce-client-2.3.0.pom
Downloaded: http://repo.maven.apache.org/maven2/org/apache/hadoop/hadoop-mapreduce-client/2.3.0/hadoop-mapreduce-client-2.3.0.pom
(7 KB at 225.9 KB/sec)
Downloading: http://repo.maven.apache.org/maven2/org/apache/hadoop/hadoop-yarn-common/2.3.0/hadoop-yarn-common-2.3.0.pom
Downloaded: http://repo.maven.apache.org/maven2/org/apache/hadoop/hadoop-yarn-common/2.3.0/hadoop-yarn-common-2.3.0.pom
(9 KB at 296.3 KB/sec)
Downloading: http://repo.maven.apache.org/maven2/org/apache/hadoop/hadoop-yarn/2.3.0/hadoop-yarn-2.3.0.pom
Downloaded: http://repo.maven.apache.org/maven2/org/apache/hadoop/hadoop-yarn/2.3.0/hadoop-yarn-2.3.0.pom
(4 KB at 115.1 KB/sec)
Downloading: http://repo.maven.apache.org/maven2/org/apache/hadoop/hadoop-yarn-api/2.3.0/hadoop-yarn-api-2.3.0.pom
Downloaded: http://repo.maven.apache.org/maven2/org/apache/hadoop/hadoop-yarn-api/2.3.0/hadoop-yarn-api-2.3.0.pom
(5 KB at 150.4 KB/sec)
Downloading: http://repo.maven.apache.org/maven2/org/apache/hadoop/hadoop-common/2.3.0/hadoop-common-2.3.0.jar
Downloading: http://repo.maven.apache.org/maven2/org/apache/hadoop/hadoop-annotations/2.3.0/hadoop-annotations-2.3.0.jar
Downloading: http://repo.maven.apache.org/maven2/org/apache/commons/commons-math3/3.1.1/commons-math3-3.1.1.jar
Downloading: http://repo.maven.apache.org/maven2/org/apache/hadoop/hadoop-auth/2.3.0/hadoop-auth-2.3.0.jar
Downloading: http://repo.maven.apache.org/maven2/net/java/dev/jets3t/jets3t/0.9.0/jets3t-0.9.0.jar
Downloaded: http://repo.maven.apache.org/maven2/org/apache/hadoop/hadoop-annotations/2.3.0/hadoop-annotations-2.3.0.jar
(17 KB at 260.1 KB/sec)
Downloading: http://repo.maven.apache.org/maven2/org/apache/hadoop/hadoop-mapreduce-client-core/2.3.0/hadoop-mapreduce-client-core-2.3.0.jar
Downloaded: http://repo.maven.apache.org/maven2/org/apache/hadoop/hadoop-auth/2.3.0/hadoop-auth-2.3.0.jar
(49 KB at 677.1 KB/sec)
Downloading: http://repo.maven.apache.org/maven2/org/apache/hadoop/hadoop-yarn-common/2.3.0/hadoop-yarn-common-2.3.0.jar
Downloaded: http://repo.maven.apache.org/maven2/net/java/dev/jets3t/jets3t/0.9.0/jets3t-0.9.0.jar
(528 KB at 3273.8 KB/sec)
Downloading: http://repo.maven.apache.org/maven2/org/apache/hadoop/hadoop-yarn-api/2.3.0/hadoop-yarn-api-2.3.0.jar
Downloaded: http://repo.maven.apache.org/maven2/org/apache/hadoop/hadoop-yarn-common/2.3.0/hadoop-yarn-common-2.3.0.jar
(1306 KB at 8423.8 KB/sec)
Downloaded: http://repo.maven.apache.org/maven2/org/apache/commons/commons-math3/3.1.1/commons-math3-3.1.1.jar
(1563 KB at 5619.2 KB/sec)
Downloaded: http://repo.maven.apache.org/maven2/org/apache/hadoop/hadoop-yarn-api/2.3.0/hadoop-yarn-api-2.3.0.jar
(1264 KB at 5400.2 KB/sec)
Downloaded: http://repo.maven.apache.org/maven2/org/apache/hadoop/hadoop-common/2.3.0/hadoop-common-2.3.0.jar
(2765 KB at 5551.9 KB/sec)
Downloaded: http://repo.maven.apache.org/maven2/org/apache/hadoop/hadoop-mapreduce-client-core/2.3.0/hadoop-mapreduce-client-core-2.3.0.jar
(1440 KB at 2955.5 KB/sec)
[INFO] 
[INFO] --- maven-clean-plugin:2.4.1:clean (default-clean) @ mrunit ---
[INFO] Deleting <https://builds.apache.org/job/mrunit-trunk/ws/target> (includes = [],
excludes = [*hadoop?.jar])
[INFO] 
[INFO] --- maven-enforcer-plugin:1.3.1:enforce (enforce-java) @ mrunit ---
[WARNING] Rule 0: org.apache.maven.plugins.enforcer.RequireJavaVersion failed with message:
Detected JDK Version: 1.6.0-45 is not in the allowed range [1.7.0-22,).
[INFO] ------------------------------------------------------------------------
[INFO] BUILD FAILURE
[INFO] ------------------------------------------------------------------------
[INFO] Total time: 13.192s
[INFO] Finished at: Tue May 06 21:56:39 UTC 2014
[INFO] Final Memory: 12M/68M
[INFO] ------------------------------------------------------------------------
Waiting for Jenkins to finish collecting data
[ERROR] Failed to execute goal org.apache.maven.plugins:maven-enforcer-plugin:1.3.1:enforce
(enforce-java) on project mrunit: Some Enforcer rules have failed. Look above for specific
messages explaining why the rule failed. -> [Help 1]
[ERROR] 
[ERROR] To see the full stack trace of the errors, re-run Maven with the -e switch.
[ERROR] Re-run Maven using the -X switch to enable full debug logging.
[ERROR] 
[ERROR] For more information about the errors and possible solutions, please read the following
articles:
[ERROR] [Help 1] http://cwiki.apache.org/confluence/display/MAVEN/MojoExecutionException
[JENKINS] Archiving <https://builds.apache.org/job/mrunit-trunk/ws/pom.xml> to org.apache.mrunit/mrunit/1.2.0-SNAPSHOT/mrunit-1.2.0-SNAPSHOT.pom
Sending e-mails to: dev@mrunit.apache.org brock@apache.org dbeech@apache.org bdechoux@apache.org
dechouxb@apache.org
channel stopped
[WARNINGS] Skipping publisher since build result is FAILURE
Updating MRUNIT-205
Updating MRUNIT-203
Updating MRUNIT-202
Updating MRUNIT-193
Updating MRUNIT-209
Updating MRUNIT-192
Updating MRUNIT-208
Updating MRUNIT-180
Updating MRUNIT-190
Updating MRUNIT-201
Updating MRUNIT-199
Updating MRUNIT-198

Mime
View raw message