mrunit-dev mailing list archives

Site index · List index
Message view « Date » · « Thread »
Top « Date » · « Thread »
From Apache Jenkins Server <jenk...@builds.apache.org>
Subject Build failed in Jenkins: mrunit-trunk #1123
Date Sun, 22 Jun 2014 19:03:51 GMT
See <https://builds.apache.org/job/mrunit-trunk/1123/changes>

Changes:

[dechouxb] Let rat ignore DOAP file

------------------------------------------
Started by an SCM change
Building remotely on ubuntu3 (Ubuntu ubuntu) in workspace <https://builds.apache.org/job/mrunit-trunk/ws/>
 > git rev-parse --is-inside-work-tree
Fetching changes from the remote Git repository
 > git config remote.origin.url https://git-wip-us.apache.org/repos/asf/mrunit.git
Fetching upstream changes from https://git-wip-us.apache.org/repos/asf/mrunit.git
 > git --version
 > git fetch --tags --progress https://git-wip-us.apache.org/repos/asf/mrunit.git +refs/heads/*:refs/remotes/origin/*
 > git rev-parse origin/trunk^{commit}
Checking out Revision cb7694e710af2f20875d4b890258494ebedbbe90 (origin/trunk)
 > git config core.sparsecheckout
 > git checkout -f cb7694e710af2f20875d4b890258494ebedbbe90
 > git rev-list 73b166d8cf978e72832b547d45556ee26a5a7723
 > git tag -a -f -m Jenkins Build #1123 jenkins-mrunit-trunk-1123
Parsing POMs
maven3-agent.jar already up to date
maven3-interceptor.jar already up to date
maven3-interceptor-commons.jar already up to date
[mrunit-trunk] $ /home/hudson/tools/java/latest1.6/bin/java -cp /home/jenkins/jenkins-slave/maven3-agent.jar:/home/hudson/tools/maven/apache-maven-3.0.4/boot/plexus-classworlds-2.4.jar
org.jvnet.hudson.maven3.agent.Maven3Main /home/hudson/tools/maven/apache-maven-3.0.4 /x1/jenkins/jenkins-slave/slave.jar
/home/jenkins/jenkins-slave/maven3-interceptor.jar /home/jenkins/jenkins-slave/maven3-interceptor-commons.jar
41185
<===[JENKINS REMOTING CAPACITY]===>   channel started
log4j:WARN No appenders could be found for logger (org.apache.commons.beanutils.converters.BooleanConverter).
log4j:WARN Please initialize the log4j system properly.
Executing Maven:  -B -f <https://builds.apache.org/job/mrunit-trunk/ws/pom.xml> -Dmaven.repo.local=/home/jenkins/jenkins-slave/maven-repositories/0
clean package -Dhadoop.version=2
[INFO] Scanning for projects...
[INFO]                                                                         
[INFO] ------------------------------------------------------------------------
[INFO] Building Apache MRUnit 1.2.0-SNAPSHOT
[INFO] ------------------------------------------------------------------------
[INFO] 
[INFO] --- maven-clean-plugin:2.4.1:clean (default-clean) @ mrunit ---
[INFO] 
[INFO] --- maven-enforcer-plugin:1.3.1:enforce (enforce-java) @ mrunit ---
[WARNING] Rule 0: org.apache.maven.plugins.enforcer.RequireJavaVersion failed with message:
Detected JDK Version: 1.6.0-45 is not in the allowed range [1.7.0-22,).
[INFO] ------------------------------------------------------------------------
[INFO] BUILD FAILURE
[INFO] ------------------------------------------------------------------------
[INFO] Total time: 8.910s
[INFO] Finished at: Sun Jun 22 19:02:55 UTC 2014
[INFO] Final Memory: 11M/109M
[INFO] ------------------------------------------------------------------------
Waiting for Jenkins to finish collecting data
[ERROR] Failed to execute goal org.apache.maven.plugins:maven-enforcer-plugin:1.3.1:enforce
(enforce-java) on project mrunit: Some Enforcer rules have failed. Look above for specific
messages explaining why the rule failed. -> [Help 1]
[ERROR] 
[ERROR] To see the full stack trace of the errors, re-run Maven with the -e switch.
[ERROR] Re-run Maven using the -X switch to enable full debug logging.
[ERROR] 
[ERROR] For more information about the errors and possible solutions, please read the following
articles:
[ERROR] [Help 1] http://cwiki.apache.org/confluence/display/MAVEN/MojoExecutionException
[JENKINS] Archiving <https://builds.apache.org/job/mrunit-trunk/ws/pom.xml> to org.apache.mrunit/mrunit/1.2.0-SNAPSHOT/mrunit-1.2.0-SNAPSHOT.pom
Sending artifact delta relative to mrunit-trunk ? Apache MRUnit #1118
Archived 1 artifacts
Archive block size is 32768
Received 0 blocks and 14984 bytes
Compression is 0.0%
Took 86 ms
Sending e-mails to: dev@mrunit.apache.org dechouxb@apache.org
channel stopped
[WARNINGS] Skipping publisher since build result is FAILURE

Mime
View raw message