myfaces-commits mailing list archives

Site index · List index
Message view « Date » · « Thread »
Top « Date » · « Thread »
From "" <>
Subject [continuum] BUILD FAILURE: MyFaces Site
Date Sat, 11 Feb 2006 19:40:32 GMT
Online report :
Build statistics:
  State: Failed
  Previous State: Failed
  Started at: Sat, 11 Feb 2006 19:40:22 +0000
  Finished at: Sat, 11 Feb 2006 19:40:32 +0000
  Total time: 9s
  Build Trigger: Forced
  Exit code: 1
  Building machine hostname:
  Operating system : SunOS(unknown)
  Java version : 1.5.0_06(Sun Microsystems Inc.)

      No files changed
[INFO] Scanning for projects...
[INFO] ----------------------------------------------------------------------------
[INFO] Building MyFaces Site
[INFO]    task-segment: [site-deploy]
[INFO] ----------------------------------------------------------------------------
[INFO] Setting property: classpath.resource.loader.class => 'org.codehaus.plexus.velocity.ContextClassLoaderResourceLoader'.
[INFO] Setting property: velocimacro.messages.on => 'false'.
[INFO] Setting property: resource.loader => 'classpath'.
[INFO] Setting property: resource.manager.logwhenfound => 'false'.
[INFO] ************************************************************** 
[INFO] Starting Jakarta Velocity v1.4
[INFO] RuntimeInstance initializing.
[INFO] Default Properties File: org/apache/velocity/runtime/defaults/
[INFO] Default ResourceManager initializing. (class org.apache.velocity.runtime.resource.ResourceManagerImpl)
[INFO] Resource Loader Instantiated: org.codehaus.plexus.velocity.ContextClassLoaderResourceLoader
[INFO] ClasspathResourceLoader : initialization starting.
[INFO] ClasspathResourceLoader : initialization complete.
[INFO] ResourceCache : initialized. (class org.apache.velocity.runtime.resource.ResourceCacheImpl)
[INFO] Default ResourceManager initialization complete.
[INFO] Loaded System Directive: org.apache.velocity.runtime.directive.Literal
[INFO] Loaded System Directive: org.apache.velocity.runtime.directive.Macro
[INFO] Loaded System Directive: org.apache.velocity.runtime.directive.Parse
[INFO] Loaded System Directive: org.apache.velocity.runtime.directive.Include
[INFO] Loaded System Directive: org.apache.velocity.runtime.directive.Foreach
[INFO] Created: 20 parsers.
[INFO] Velocimacro : initialization starting.
[INFO] Velocimacro : adding VMs from VM library template : VM_global_library.vm
[ERROR] ResourceManager : unable to find resource 'VM_global_library.vm' in any resource loader.
[INFO] Velocimacro : error using  VM library template VM_global_library.vm : org.apache.velocity.exception.ResourceNotFoundException:
Unable to find resource 'VM_global_library.vm'
[INFO] Velocimacro :  VM library template macro registration complete.
[INFO] Velocimacro : allowInline = true : VMs can be defined inline in templates
[INFO] Velocimacro : allowInlineToOverride = false : VMs defined inline may NOT replace previous
VM definitions
[INFO] Velocimacro : allowInlineLocal = false : VMs defined inline will be  global in scope
if allowed.
[INFO] Velocimacro : initialization complete.
[INFO] Velocity successfully started.
[INFO] [site:site]
[INFO] Generate "Continuous Integration" report.
[ERROR] VM #displayTree: error : too few arguments to macro. Wanted 2 got 0
[ERROR] VM #menuItem: error : too few arguments to macro. Wanted 1 got 0
[INFO] Generate "Dependencies" report.
[INFO] Generate "Issue Tracking" report.
[INFO] Generate "Project License" report.
[INFO] Generate "Mailing Lists" report.
[INFO] Generate "Source Repository" report.
[INFO] Generate "Project Team" report.
[INFO] Ignoring the index file generation for the English version.
[INFO] [site:deploy]
Using private key: /export/home/mrmaven/.m2/identity
scpexe:// - Session: Opened  
Uploading: ./ to scpexe://

scpexe:// - Session: Disconnecting  
scpexe:// - Session: Disconnected
[INFO] ----------------------------------------------------------------------------
[INFO] ----------------------------------------------------------------------------
[INFO] Error uploading site

Embedded error: Exit code: 1 - scp: /www/./ Permission denied

[INFO] ----------------------------------------------------------------------------
[INFO] For more information, run Maven with the -e switch
[INFO] ----------------------------------------------------------------------------
[INFO] Total time: 8 seconds
[INFO] Finished at: Sat Feb 11 19:40:31 GMT+00:00 2006
[INFO] Final Memory: 9M/330M
[INFO] ----------------------------------------------------------------------------


View raw message