myfaces-commits mailing list archives

Site index · List index
Message view « Date » · « Thread »
Top « Date » · « Thread »
From "Continuum@myfaces.zones.apache.org" <mrma...@myfaces.zones.apache.org>
Subject [continuum] BUILD FAILURE: Tomahawk Core
Date Thu, 22 Jun 2006 20:08:13 GMT
Online report : http://myfaces.zones.apache.org:8080/continuum/servlet/continuum/target/ProjectBuild.vm/view/ProjectBuild/id/16/buildId/2378
Build statistics:
  State: Failed
  Previous State: Failed
  Started at: Thu, 22 Jun 2006 20:07:47 +0000
  Finished at: Thu, 22 Jun 2006 20:08:13 +0000
  Total time: 26s
  Build Trigger: Schedule
  Exit code: 1
  Building machine hostname: myfaces.zones.apache.org
  Operating system : SunOS(unknown)
  Java version : 1.5.0_06(Sun Microsystems Inc.)

Changes
         imario          fixed calendar do not popup when using forceId
fixed IE mixed content (http/https) warning
             /myfaces/tomahawk/trunk/core/src/main/java/org/apache/myfaces/component/html/util/HtmlComponentUtils.java
            /myfaces/tomahawk/trunk/core/src/main/java/org/apache/myfaces/custom/calendar/HtmlCalendarRenderer.java
            /myfaces/tomahawk/trunk/core/src/main/resources/org/apache/myfaces/custom/calendar/resource/popcalendar.js
           imario          TOMAHAWK-176 now copy the forceId attribute too
             /myfaces/shared/trunk/core/src/main/java/org/apache/myfaces/shared/renderkit/RendererUtils.java
            /myfaces/tomahawk/trunk/core/src/main/java/org/apache/myfaces/component/html/util/HtmlComponentUtils.java
            /myfaces/tomahawk/trunk/core/src/main/java/org/apache/myfaces/custom/calendar/HtmlCalendarRenderer.java
        
****************************************************************************
Output:
****************************************************************************
[INFO] Scanning for projects...
[INFO] ----------------------------------------------------------------------------
[INFO] Building Tomahawk Core
[INFO]    task-segment: [clean, install, deploy, site-deploy]
[INFO] ----------------------------------------------------------------------------
[INFO] [clean:clean]
[INFO] Deleting directory /local/continuum-1.0.3-SNAPSHOT/apps/continuum/working-directory/16/target
[INFO] Deleting directory /local/continuum-1.0.3-SNAPSHOT/apps/continuum/working-directory/16/target/classes
[INFO] Deleting directory /local/continuum-1.0.3-SNAPSHOT/apps/continuum/working-directory/16/target/test-classes
[INFO] [xslt:transform {execution: default}]
[INFO] # of XML files: 1
[INFO] transform, srcFile: /local/continuum-1.0.3-SNAPSHOT/apps/continuum/working-directory/16/src/main/tld/tomahawk.tld,
destFile: /local/continuum-1.0.3-SNAPSHOT/apps/continuum/working-directory/16/target/classes/META-INF/tomahawk.tld
[INFO] [xslt:transform {execution: generate-tld-for-jar}]
[INFO] # of XML files: 1
[INFO] file up-to-date: /local/continuum-1.0.3-SNAPSHOT/apps/continuum/working-directory/16/target/classes/META-INF/tomahawk.tld
[INFO] [xslt:transform {execution: generate-tld-for-tlddoc}]
[INFO] # of XML files: 1
[INFO] transform, srcFile: /local/continuum-1.0.3-SNAPSHOT/apps/continuum/working-directory/16/src/main/tld/tomahawk.tld,
destFile: /local/continuum-1.0.3-SNAPSHOT/apps/continuum/working-directory/16/target/tlddoc-site/tomahawk.tld
[INFO] [resources:resources]
[INFO] Using default encoding to copy filtered resources.
[INFO] [compiler:compile]
Compiling 314 source files to /local/continuum-1.0.3-SNAPSHOT/apps/continuum/working-directory/16/target/classes
[INFO] ------------------------------------------------------------------------
[ERROR] BUILD FAILURE
[INFO] ------------------------------------------------------------------------
[INFO] Compilation failure

/local/continuum-1.0.3-SNAPSHOT/apps/continuum/working-directory/16/src/main/java/org/apache/myfaces/component/html/util/HtmlComponentUtils.java:[63,39]
getBooleanValue(javax.faces.component.UIComponent) in org.apache.myfaces.shared_tomahawk.renderkit.RendererUtils
cannot be applied to (java.lang.String,java.lang.Object,boolean)

/local/continuum-1.0.3-SNAPSHOT/apps/continuum/working-directory/16/src/main/java/org/apache/myfaces/component/html/util/HtmlComponentUtils.java:[79,56]
getBooleanValue(javax.faces.component.UIComponent) in org.apache.myfaces.shared_tomahawk.renderkit.RendererUtils
cannot be applied to (java.lang.String,java.lang.Object,boolean)


[INFO] ------------------------------------------------------------------------
[INFO] For more information, run Maven with the -e switch
[INFO] ------------------------------------------------------------------------
[INFO] Total time: 25 seconds
[INFO] Finished at: Thu Jun 22 20:08:13 GMT+00:00 2006
[INFO] Final Memory: 19M/317M
[INFO] ------------------------------------------------------------------------

****************************************************************************



Mime
View raw message