myfaces-commits mailing list archives

Site index · List index
Message view « Date » · « Thread »
Top « Date » · « Thread »
From "Continuum@myfaces.zones.apache.org" <mrma...@myfaces.zones.apache.org>
Subject [continuum] BUILD FAILURE: Impl
Date Mon, 18 Dec 2006 00:11:36 GMT
Online report : http://myfaces.zones.apache.org:8080/continuum/servlet/continuum/target/ProjectBuild.vm/view/ProjectBuild/id/64/buildId/7398
Build statistics:
  State: Failed
  Previous State: Failed
  Started at: Mon, 18 Dec 2006 00:10:14 +0000
  Finished at: Mon, 18 Dec 2006 00:11:35 +0000
  Total time: 1m 21s
  Build Trigger: Schedule
  Exit code: 1
  Building machine hostname: myfaces.zones.apache.org
  Operating system : SunOS(unknown)
  Java version : 1.5.0_09(Sun Microsystems Inc.)

Changes
         baranda          - Created XML files to autogenerate the render-kit section in the
XML (although at this moment, several repeated render-kits appear, no clue why)
- Validators defined in the XML file
- Application and Factory sections for the faces-config.xml file in an xml as well 
- Fixed issue with startup
- Some fixes in UIComponentClassicTagBase to allow the view to be created and rendered (still
not fully working, though)
             /myfaces/core/branches/jsf12/api/pom.xml
            /myfaces/core/branches/jsf12/api/src/main/java/javax/faces/webapp/UIComponentClassicTagBase.java
            /myfaces/core/branches/jsf12/api/src/main/java/javax/faces/webapp/UIComponentELTag.java
            /myfaces/core/branches/jsf12/build/src/main/resources/META-INF/maven-faces-plugin/config
            /myfaces/core/branches/jsf12/build/src/main/resources/META-INF/maven-faces-plugin/config/myfaces
            /myfaces/core/branches/jsf12/build/src/main/resources/META-INF/maven-faces-plugin/config/myfaces/faces-config.xml
            /myfaces/core/branches/jsf12/build/src/main/resources/META-INF/maven-faces-plugin/renderers/javax
            /myfaces/core/branches/jsf12/build/src/main/resources/META-INF/maven-faces-plugin/renderers/javax/faces
            /myfaces/core/branches/jsf12/build/src/main/resources/META-INF/maven-faces-plugin/renderers/javax/faces/html
            /myfaces/core/branches/jsf12/build/src/main/resources/META-INF/maven-faces-plugin/renderers/javax/faces/html/HtmlCommandButton.xml
            /myfaces/core/branches/jsf12/build/src/main/resources/META-INF/maven-faces-plugin/renderers/javax/faces/html/HtmlCommandLink.xml
            /myfaces/core/branches/jsf12/build/src/main/resources/META-INF/maven-faces-plugin/renderers/javax/faces/html/HtmlDataTable.xml
            /myfaces/core/branches/jsf12/build/src/main/resources/META-INF/maven-faces-plugin/renderers/javax/faces/html/HtmlForm.xml
            /myfaces/core/branches/jsf12/build/src/main/resources/META-INF/maven-faces-plugin/renderers/javax/faces/html/HtmlGraphicImage.xml
            /myfaces/core/branches/jsf12/build/src/main/resources/META-INF/maven-faces-plugin/renderers/javax/faces/html/HtmlGrid.xml
            /myfaces/core/branches/jsf12/build/src/main/resources/META-INF/maven-faces-plugin/renderers/javax/faces/html/HtmlGroup.xml
            /myfaces/core/branches/jsf12/build/src/main/resources/META-INF/maven-faces-plugin/renderers/javax/faces/html/HtmlHidden.xml
            /myfaces/core/branches/jsf12/build/src/main/resources/META-INF/maven-faces-plugin/renderers/javax/faces/html/HtmlInputSecret.xml
            /myfaces/core/branches/jsf12/build/src/main/resources/META-INF/maven-faces-plugin/renderers/javax/faces/html/HtmlInputText.xml
            /myfaces/core/branches/jsf12/build/src/main/resources/META-INF/maven-faces-plugin/renderers/javax/faces/html/HtmlInputTextarea.xml
            /myfaces/core/branches/jsf12/build/src/main/resources/META-INF/maven-faces-plugin/renderers/javax/faces/html/HtmlMessage.xml
            /myfaces/core/branches/jsf12/build/src/main/resources/META-INF/maven-faces-plugin/renderers/javax/faces/html/HtmlMessages.xml
            /myfaces/core/branches/jsf12/build/src/main/resources/META-INF/maven-faces-plugin/renderers/javax/faces/html/HtmlOutputFormat.xml
            /myfaces/core/branches/jsf12/build/src/main/resources/META-INF/maven-faces-plugin/renderers/javax/faces/html/HtmlOutputLabel.xml
            /myfaces/core/branches/jsf12/build/src/main/resources/META-INF/maven-faces-plugin/renderers/javax/faces/html/HtmlOutputLink.xml
            /myfaces/core/branches/jsf12/build/src/main/resources/META-INF/maven-faces-plugin/renderers/javax/faces/html/HtmlOutputText.xml
            /myfaces/core/branches/jsf12/build/src/main/resources/META-INF/maven-faces-plugin/renderers/javax/faces/html/HtmlSelectBooleanCheckbox.xml
            /myfaces/core/branches/jsf12/build/src/main/resources/META-INF/maven-faces-plugin/renderers/javax/faces/html/HtmlSelectManyCheckbox.xml
            /myfaces/core/branches/jsf12/build/src/main/resources/META-INF/maven-faces-plugin/renderers/javax/faces/html/HtmlSelectManyListbox.xml
            /myfaces/core/branches/jsf12/build/src/main/resources/META-INF/maven-faces-plugin/renderers/javax/faces/html/HtmlSelectManyMenu.xml
            /myfaces/core/branches/jsf12/build/src/main/resources/META-INF/maven-faces-plugin/renderers/javax/faces/html/HtmlSelectOneListbox.xml
            /myfaces/core/branches/jsf12/build/src/main/resources/META-INF/maven-faces-plugin/renderers/javax/faces/html/HtmlSelectOneMenu.xml
            /myfaces/core/branches/jsf12/build/src/main/resources/META-INF/maven-faces-plugin/renderers/javax/faces/html/HtmlSelectOneRadio.xml
            /myfaces/core/branches/jsf12/build/src/main/resources/META-INF/maven-faces-plugin/renderkits/javax
            /myfaces/core/branches/jsf12/build/src/main/resources/META-INF/maven-faces-plugin/renderkits/javax/faces
            /myfaces/core/branches/jsf12/build/src/main/resources/META-INF/maven-faces-plugin/renderkits/javax/faces/html_basic.xml
            /myfaces/core/branches/jsf12/build/src/main/resources/META-INF/maven-faces-plugin/validators/javax
            /myfaces/core/branches/jsf12/build/src/main/resources/META-INF/maven-faces-plugin/validators/javax/faces
            /myfaces/core/branches/jsf12/build/src/main/resources/META-INF/maven-faces-plugin/validators/javax/faces/DoubleRange.xml
            /myfaces/core/branches/jsf12/build/src/main/resources/META-INF/maven-faces-plugin/validators/javax/faces/Length.xml
            /myfaces/core/branches/jsf12/build/src/main/resources/META-INF/maven-faces-plugin/validators/javax/faces/LongRange.xml
            /myfaces/core/branches/jsf12/impl/pom.xml
            /myfaces/core/branches/jsf12/impl/src/main/java/org/apache/myfaces/application/ApplicationImpl.java
            /myfaces/core/branches/jsf12/impl/src/main/java/org/apache/myfaces/config/FacesConfigurator.java
            /myfaces/core/branches/jsf12/impl/src/main/java/org/apache/myfaces/config/impl/digester/DigesterFacesConfigUnmarshallerImpl.java
            /myfaces/core/branches/jsf12/impl/src/main/java/org/apache/myfaces/context/servlet/ServletExternalContextImpl.java
            /myfaces/core/branches/jsf12/impl/src/main/java/org/apache/myfaces/taglib/core/ViewTag.java
            /myfaces/core/branches/jsf12/impl/src/main/resources/META-INF
            /myfaces/core/branches/jsf12/impl/src/main/resources/META-INF/legacy_myfaces_core.tld
        
****************************************************************************
Output:
****************************************************************************
[INFO] Scanning for projects...
[INFO] snapshot org.apache.myfaces.maven:myfaces-master:1.0.5-SNAPSHOT: checking for updates
from java.net
[INFO] snapshot org.apache.myfaces.maven:myfaces-master:1.0.5-SNAPSHOT: checking for updates
from apache.snapshots
[INFO] snapshot org.apache.myfaces.maven:build-tools:1.0.5-SNAPSHOT: checking for updates
from java.net
[INFO] snapshot org.apache.myfaces.maven:build-tools:1.0.5-SNAPSHOT: checking for updates
from apache.snapshots
[INFO] ----------------------------------------------------------------------------
[INFO] Building Impl
[INFO]    task-segment: [clean, deploy]
[INFO] ----------------------------------------------------------------------------
[INFO] artifact org.apache.maven.plugins:maven-clean-plugin: checking for updates from baranda-repo
[INFO] artifact org.apache.maven.plugins:maven-compiler-plugin: checking for updates from
baranda-repo
[INFO] snapshot org.apache.myfaces.trinidadbuild:maven-faces-plugin:incubator-1.2-m1-SNAPSHOT:
checking for updates from baranda-repo
[INFO] snapshot org.apache.myfaces.trinidadbuild:maven-faces-plugin:incubator-1.2-m1-SNAPSHOT:
checking for updates from java.net
[INFO] snapshot org.apache.myfaces.trinidadbuild:maven-faces-plugin:incubator-1.2-m1-SNAPSHOT:
checking for updates from apache.snapshots
[INFO] snapshot org.apache.myfaces.trinidadbuild:maven-plugin-parent:incubator-m1-SNAPSHOT:
checking for updates from baranda-repo
[INFO] snapshot org.apache.myfaces.trinidadbuild:maven-plugin-parent:incubator-m1-SNAPSHOT:
checking for updates from java.net
[INFO] snapshot org.apache.myfaces.trinidadbuild:maven-plugin-parent:incubator-m1-SNAPSHOT:
checking for updates from apache.snapshots
[INFO] artifact org.codehaus.mojo:dependency-maven-plugin: checking for updates from baranda-repo
[INFO] [clean:clean]
[INFO] Deleting directory /local/continuum-1.0.3-SNAPSHOT/apps/continuum/working-directory/64/target
[INFO] Deleting directory /local/continuum-1.0.3-SNAPSHOT/apps/continuum/working-directory/64/target/classes
[INFO] Deleting directory /local/continuum-1.0.3-SNAPSHOT/apps/continuum/working-directory/64/target/test-classes
[INFO] artifact org.apache.maven.plugins:maven-resources-plugin: checking for updates from
baranda-repo
[INFO] artifact org.apache.maven.plugins:maven-surefire-plugin: checking for updates from
baranda-repo
[INFO] artifact org.apache.maven.plugins:maven-jar-plugin: checking for updates from baranda-repo
[INFO] artifact org.apache.maven.plugins:maven-install-plugin: checking for updates from baranda-repo
[INFO] artifact org.apache.maven.plugins:maven-deploy-plugin: checking for updates from baranda-repo
[INFO] snapshot org.apache.shale:shale-test:1.0.4-SNAPSHOT: checking for updates from java.net
[INFO] snapshot org.apache.shale:shale-test:1.0.4-SNAPSHOT: checking for updates from apache.snapshots
[INFO] snapshot org.apache.shale:shale-parent:1.0.4-SNAPSHOT: checking for updates from java.net
[INFO] snapshot org.apache.shale:shale-parent:1.0.4-SNAPSHOT: checking for updates from apache.snapshots
[INFO] snapshot org.apache.shale:shale-master:2-SNAPSHOT: checking for updates from apache.snapshots
[INFO] snapshot org.apache.shale:shale-master:2-SNAPSHOT: checking for updates from java.net
[INFO] snapshot org.apache.myfaces.shared:myfaces-shared-impl:3.0.0-SNAPSHOT: checking for
updates from java.net
[INFO] snapshot org.apache.myfaces.shared:myfaces-shared-impl:3.0.0-SNAPSHOT: checking for
updates from apache.snapshots
[INFO] snapshot org.apache.myfaces.shared:myfaces-shared-project:3.0.0-SNAPSHOT: checking
for updates from java.net
[INFO] snapshot org.apache.myfaces.shared:myfaces-shared-project:3.0.0-SNAPSHOT: checking
for updates from apache.snapshots
[INFO] snapshot org.apache.tomcat:jasper-el:6.0.1-SNAPSHOT: checking for updates from java.net
[INFO] snapshot org.apache.tomcat:jasper-el:6.0.1-SNAPSHOT: checking for updates from apache.snapshots
[INFO] snapshot org.apache.tomcat:el-api:6.0.1-SNAPSHOT: checking for updates from java.net
[INFO] snapshot org.apache.tomcat:el-api:6.0.1-SNAPSHOT: checking for updates from apache.snapshots
[INFO] snapshot org.apache.myfaces.core:myfaces-api:1.2.0-SNAPSHOT: checking for updates from
java.net
[INFO] snapshot org.apache.myfaces.core:myfaces-api:1.2.0-SNAPSHOT: checking for updates from
apache.snapshots
[INFO] [faces:generate-jsp-taglibs {execution: default}]
[WARNING] Master faces-config.xml not found
[INFO] Nothing to generate - no components found
[INFO] [faces:generate-faces-config {execution: default}]
[WARNING] Master faces-config.xml not found
[INFO] [resources:resources]
[INFO] Using default encoding to copy filtered resources.
[INFO] [compiler:compile]
Compiling 169 source files to /local/continuum-1.0.3-SNAPSHOT/apps/continuum/working-directory/64/target/classes
[INFO] ------------------------------------------------------------------------
[ERROR] BUILD FAILURE
[INFO] ------------------------------------------------------------------------
[INFO] Compilation failure

/local/continuum-1.0.3-SNAPSHOT/apps/continuum/working-directory/64/src/main/java/org/apache/myfaces/taglib/core/ConvertNumberTag.java:[19,45]
cannot find symbol
symbol  : class UIComponentELTagUtils
location: package org.apache.myfaces.shared_impl.taglib

/local/continuum-1.0.3-SNAPSHOT/apps/continuum/working-directory/64/src/main/java/org/apache/myfaces/taglib/core/VerbatimTag.java:[19,45]
cannot find symbol
symbol  : class UIComponentELTagBase
location: package org.apache.myfaces.shared_impl.taglib

/local/continuum-1.0.3-SNAPSHOT/apps/continuum/working-directory/64/src/main/java/org/apache/myfaces/taglib/core/VerbatimTag.java:[32,16]
cannot find symbol
symbol: class UIComponentELTagBase
        extends UIComponentELTagBase

/local/continuum-1.0.3-SNAPSHOT/apps/continuum/working-directory/64/src/main/java/org/apache/myfaces/taglib/core/ParamTag.java:[18,45]
cannot find symbol
symbol  : class UIComponentELTagBase
location: package org.apache.myfaces.shared_impl.taglib

/local/continuum-1.0.3-SNAPSHOT/apps/continuum/working-directory/64/src/main/java/org/apache/myfaces/taglib/core/ParamTag.java:[30,12]
cannot find symbol
symbol: class UIComponentELTagBase
    extends UIComponentELTagBase

/local/continuum-1.0.3-SNAPSHOT/apps/continuum/working-directory/64/src/main/java/org/apache/myfaces/taglib/core/ConvertNumberTag.java:[124,29]
cannot find symbol
symbol  : variable UIComponentELTagUtils
location: class org.apache.myfaces.taglib.core.ConvertNumberTag

/local/continuum-1.0.3-SNAPSHOT/apps/continuum/working-directory/64/src/main/java/org/apache/myfaces/taglib/core/ConvertNumberTag.java:[129,29]
cannot find symbol
symbol  : variable UIComponentELTagUtils
location: class org.apache.myfaces.taglib.core.ConvertNumberTag

/local/continuum-1.0.3-SNAPSHOT/apps/continuum/working-directory/64/src/main/java/org/apache/myfaces/taglib/core/ConvertNumberTag.java:[133,38]
cannot find symbol
symbol  : variable UIComponentELTagUtils
location: class org.apache.myfaces.taglib.core.ConvertNumberTag

/local/continuum-1.0.3-SNAPSHOT/apps/continuum/working-directory/64/src/main/java/org/apache/myfaces/taglib/core/ConvertNumberTag.java:[140,37]
cannot find symbol
symbol  : variable UIComponentELTagUtils
location: class org.apache.myfaces.taglib.core.ConvertNumberTag

/local/continuum-1.0.3-SNAPSHOT/apps/continuum/working-directory/64/src/main/java/org/apache/myfaces/taglib/core/ConvertNumberTag.java:[163,43]
cannot find symbol
symbol  : variable UIComponentELTagUtils
location: class org.apache.myfaces.taglib.core.ConvertNumberTag

/local/continuum-1.0.3-SNAPSHOT/apps/continuum/working-directory/64/src/main/java/org/apache/myfaces/taglib/core/ConvertNumberTag.java:[167,42]
cannot find symbol
symbol  : variable UIComponentELTagUtils
location: class org.apache.myfaces.taglib.core.ConvertNumberTag

/local/continuum-1.0.3-SNAPSHOT/apps/continuum/working-directory/64/src/main/java/org/apache/myfaces/taglib/core/ConvertNumberTag.java:[171,43]
cannot find symbol
symbol  : variable UIComponentELTagUtils
location: class org.apache.myfaces.taglib.core.ConvertNumberTag

/local/continuum-1.0.3-SNAPSHOT/apps/continuum/working-directory/64/src/main/java/org/apache/myfaces/taglib/core/ConvertNumberTag.java:[175,42]
cannot find symbol
symbol  : variable UIComponentELTagUtils
location: class org.apache.myfaces.taglib.core.ConvertNumberTag

/local/continuum-1.0.3-SNAPSHOT/apps/continuum/working-directory/64/src/main/java/org/apache/myfaces/taglib/core/ConvertNumberTag.java:[179,42]
cannot find symbol
symbol  : variable UIComponentELTagUtils
location: class org.apache.myfaces.taglib.core.ConvertNumberTag

/local/continuum-1.0.3-SNAPSHOT/apps/continuum/working-directory/64/src/main/java/org/apache/myfaces/taglib/core/ConvertNumberTag.java:[183,39]
cannot find symbol
symbol  : variable UIComponentELTagUtils
location: class org.apache.myfaces.taglib.core.ConvertNumberTag

/local/continuum-1.0.3-SNAPSHOT/apps/continuum/working-directory/64/src/main/java/org/apache/myfaces/taglib/core/VerbatimTag.java:[52,8]
cannot find symbol
symbol  : variable super
location: class org.apache.myfaces.taglib.core.VerbatimTag

/local/continuum-1.0.3-SNAPSHOT/apps/continuum/working-directory/64/src/main/java/org/apache/myfaces/taglib/core/VerbatimTag.java:[54,8]
cannot find symbol
symbol  : method setBooleanProperty(javax.faces.component.UIComponent,java.lang.String,javax.el.ValueExpression,java.lang.Boolean)
location: class org.apache.myfaces.taglib.core.VerbatimTag

/local/continuum-1.0.3-SNAPSHOT/apps/continuum/working-directory/64/src/main/java/org/apache/myfaces/taglib/core/VerbatimTag.java:[55,45]
cannot find symbol
symbol  : variable RENDERED
location: interface org.apache.myfaces.shared_impl.renderkit.JSFAttr

/local/continuum-1.0.3-SNAPSHOT/apps/continuum/working-directory/64/src/main/java/org/apache/myfaces/taglib/core/VerbatimTag.java:[73,34]
cannot find symbol
symbol  : method getBodyContent()
location: class org.apache.myfaces.taglib.core.VerbatimTag

/local/continuum-1.0.3-SNAPSHOT/apps/continuum/working-directory/64/src/main/java/org/apache/myfaces/taglib/core/VerbatimTag.java:[76,43]
cannot find symbol
symbol  : method getComponentInstance()
location: class org.apache.myfaces.taglib.core.VerbatimTag

/local/continuum-1.0.3-SNAPSHOT/apps/continuum/working-directory/64/src/main/java/org/apache/myfaces/taglib/core/VerbatimTag.java:[80,15]
cannot find symbol
symbol  : variable super
location: class org.apache.myfaces.taglib.core.VerbatimTag

/local/continuum-1.0.3-SNAPSHOT/apps/continuum/working-directory/64/src/main/java/org/apache/myfaces/taglib/core/ParamTag.java:[49,8]
cannot find symbol
symbol  : variable super
location: class org.apache.myfaces.taglib.core.ParamTag

/local/continuum-1.0.3-SNAPSHOT/apps/continuum/working-directory/64/src/main/java/org/apache/myfaces/taglib/core/ParamTag.java:[51,8]
cannot find symbol
symbol  : method setStringProperty(javax.faces.component.UIComponent,java.lang.String,javax.el.ValueExpression)
location: class org.apache.myfaces.taglib.core.ParamTag


[INFO] ------------------------------------------------------------------------
[INFO] For more information, run Maven with the -e switch
[INFO] ------------------------------------------------------------------------
[INFO] Total time: 1 minute 11 seconds
[INFO] Finished at: Mon Dec 18 00:11:35 GMT+00:00 2006
[INFO] Final Memory: 9M/257M
[INFO] ------------------------------------------------------------------------

****************************************************************************



Mime
View raw message