myfaces-commits mailing list archives

Site index · List index
Message view « Date » · « Thread »
Top « Date » · « Thread »
From "Continuum@myfaces.zones.apache.org" <mrma...@myfaces.zones.apache.org>
Subject [continuum] BUILD SUCCESSFUL: Tobago Core
Date Sun, 17 Dec 2006 14:25:36 GMT
Online report : http://myfaces.zones.apache.org:8080/continuum/servlet/continuum/target/ProjectBuild.vm/view/ProjectBuild/id/34/buildId/7362
Build statistics:
  State: Ok
  Previous State: Failed
  Started at: Sun, 17 Dec 2006 14:24:55 +0000
  Finished at: Sun, 17 Dec 2006 14:25:36 +0000
  Total time: 41s
  Build Trigger: Forced
  Exit code: 0
  Building machine hostname: myfaces.zones.apache.org
  Operating system : SunOS(unknown)
  Java version : 1.5.0_09(Sun Microsystems Inc.)

Changes
         bommel          reable all snapshot dependencies
             /myfaces/tobago/trunk/core/src/site/site.xml
            /myfaces/tobago/trunk/example/addressbook/pom.xml
            /myfaces/tobago/trunk/example/blank/pom.xml
            /myfaces/tobago/trunk/example/demo/pom.xml
            /myfaces/tobago/trunk/example/facelets/pom.xml
            /myfaces/tobago/trunk/example/foreach/pom.xml
            /myfaces/tobago/trunk/example/nonfacesrequest/pom.xml
            /myfaces/tobago/trunk/example/sandbox/pom.xml
            /myfaces/tobago/trunk/example/security/pom.xml
            /myfaces/tobago/trunk/example/test/pom.xml
            /myfaces/tobago/trunk/pom.xml
            /myfaces/tobago/trunk/src/site/site.xml
            /myfaces/tobago/trunk/tobago-tool/gendoc/pom.xml
        
****************************************************************************
Output:
****************************************************************************
[INFO] Scanning for projects...
[INFO] Searching repository for plugin with prefix: 'checkstyle'.
[INFO] ----------------------------------------------------------------------------
[INFO] Building Tobago Core
[INFO]    task-segment: [clean, install, checkstyle:check]
[INFO] ----------------------------------------------------------------------------
[INFO] [clean:clean]
[INFO] Deleting directory /local/continuum-1.0.3-SNAPSHOT/apps/continuum/working-directory/34/target
[INFO] Deleting directory /local/continuum-1.0.3-SNAPSHOT/apps/continuum/working-directory/34/target/classes
[INFO] Deleting directory /local/continuum-1.0.3-SNAPSHOT/apps/continuum/working-directory/34/target/test-classes
[INFO] [cobertura:clean {execution: clean}]
[INFO] [apt:execute {execution: tobago-tlds}]
Note: /local/continuum-1.0.3-SNAPSHOT/apps/continuum/working-directory/34/src/main/java/org/apache/myfaces/tobago/component/UIData.java
uses or overrides a deprecated API.
Note: Recompile with -Xlint:deprecation for details.
[INFO] [resources:resources]
[INFO] Using default encoding to copy filtered resources.
[INFO] [compiler:compile]
Compiling 364 source files to /local/continuum-1.0.3-SNAPSHOT/apps/continuum/working-directory/34/target/classes
[INFO] [apt:execute {execution: tobago-faces-config}]
[ERROR] Note: /local/continuum-1.0.3-SNAPSHOT/apps/continuum/working-directory/34/src/main/java/org/apache/myfaces/tobago/component/UIData.java
uses or overrides a deprecated API.
Note: Recompile with -Xlint:deprecation for details.

[INFO] [resources:resources {execution: copy-faces-config}]
[INFO] Using default encoding to copy filtered resources.
[INFO] [resources:testResources]
[INFO] Using default encoding to copy filtered resources.
[INFO] [compiler:testCompile]
Compiling 36 source files to /local/continuum-1.0.3-SNAPSHOT/apps/continuum/working-directory/34/target/test-classes
[INFO] [surefire:test]
[INFO] Surefire report directory: /local/continuum-1.0.3-SNAPSHOT/apps/continuum/working-directory/34/target/surefire-reports

-------------------------------------------------------
 T E S T S
-------------------------------------------------------
Running org.apache.myfaces.tobago.webapp.TobagoResponseWriterUnitTest
Tests run: 5, Failures: 0, Errors: 0, Skipped: 0, Time elapsed: 0.049 sec
Running org.apache.myfaces.tobago.util.RangeParserUnitTest
Tests run: 1, Failures: 0, Errors: 0, Skipped: 0, Time elapsed: 0.012 sec
Running org.apache.myfaces.tobago.taglib.component.GenericTagUnitTest
Dec 17, 2006 2:25:27 PM org.apache.myfaces.tobago.taglib.component.ButtonTag setAccessKey
WARNING: Attibute 'accessKey' is deprecated, and will removed soon!
Dec 17, 2006 2:25:27 PM org.apache.myfaces.tobago.taglib.component.ButtonTag setLabelWithAccessKey
WARNING: Attibute 'labelWithAccessKey' is deprecated, and will removed soon! Please use 'label'
instead.
Dec 17, 2006 2:25:27 PM org.apache.myfaces.tobago.taglib.component.InputTag setAccessKey
WARNING: Attibute 'accessKey' is deprecated, and will removed soon!
Dec 17, 2006 2:25:27 PM org.apache.myfaces.tobago.taglib.component.InputTag setLabelWithAccessKey
WARNING: Attibute 'labelWithAccessKey' is deprecated, and will removed soon! Please use 'label'
instead.
Dec 17, 2006 2:25:27 PM org.apache.myfaces.tobago.taglib.component.InputTag setAccessKey
WARNING: Attibute 'accessKey' is deprecated, and will removed soon!
Dec 17, 2006 2:25:27 PM org.apache.myfaces.tobago.taglib.component.InputTag setLabelWithAccessKey
WARNING: Attibute 'labelWithAccessKey' is deprecated, and will removed soon! Please use 'label'
instead.
Dec 17, 2006 2:25:27 PM org.apache.myfaces.tobago.taglib.component.InputTag setAccessKey
WARNING: Attibute 'accessKey' is deprecated, and will removed soon!
Dec 17, 2006 2:25:27 PM org.apache.myfaces.tobago.taglib.component.InputTag setLabelWithAccessKey
WARNING: Attibute 'labelWithAccessKey' is deprecated, and will removed soon! Please use 'label'
instead.
Dec 17, 2006 2:25:27 PM org.apache.myfaces.tobago.taglib.component.InputTag setAccessKey
WARNING: Attibute 'accessKey' is deprecated, and will removed soon!
Dec 17, 2006 2:25:27 PM org.apache.myfaces.tobago.taglib.component.InputTag setLabelWithAccessKey
WARNING: Attibute 'labelWithAccessKey' is deprecated, and will removed soon! Please use 'label'
instead.
Dec 17, 2006 2:25:27 PM org.apache.myfaces.tobago.taglib.component.InputTag setAccessKey
WARNING: Attibute 'accessKey' is deprecated, and will removed soon!
Dec 17, 2006 2:25:27 PM org.apache.myfaces.tobago.taglib.component.InputTag setLabelWithAccessKey
WARNING: Attibute 'labelWithAccessKey' is deprecated, and will removed soon! Please use 'label'
instead.
Dec 17, 2006 2:25:27 PM org.apache.myfaces.tobago.taglib.component.InputTag setAccessKey
WARNING: Attibute 'accessKey' is deprecated, and will removed soon!
Dec 17, 2006 2:25:27 PM org.apache.myfaces.tobago.taglib.component.InputTag setLabelWithAccessKey
WARNING: Attibute 'labelWithAccessKey' is deprecated, and will removed soon! Please use 'label'
instead.
Dec 17, 2006 2:25:27 PM org.apache.myfaces.tobago.taglib.component.LabelTag setAccessKey
WARNING: Attibute 'accessKey' is deprecated, and will removed soon!
Dec 17, 2006 2:25:27 PM org.apache.myfaces.tobago.taglib.component.LabelTag setLabelWithAccessKey
WARNING: Attibute 'labelWithAccessKey' is deprecated, and will removed soon! Please use 'label'
instead.
Tests run: 2, Failures: 0, Errors: 0, Skipped: 0, Time elapsed: 0.354 sec
Running org.apache.myfaces.tobago.component.UITreeUnitTest
Tests run: 1, Failures: 0, Errors: 0, Skipped: 0, Time elapsed: 0.011 sec
Running org.apache.myfaces.tobago.renderkit.LabelWithAccessKeyUnitTest
Dec 17, 2006 2:25:27 PM org.apache.myfaces.tobago.taglib.component.LinkTag setAccessKey
WARNING: Attibute 'accessKey' is deprecated, and will removed soon!
Dec 17, 2006 2:25:27 PM org.apache.myfaces.tobago.taglib.component.LinkTag setLabelWithAccessKey
WARNING: Attibute 'labelWithAccessKey' is deprecated, and will removed soon! Please use 'label'
instead.
Dec 17, 2006 2:25:27 PM org.apache.myfaces.tobago.taglib.component.InputTag setAccessKey
WARNING: Attibute 'accessKey' is deprecated, and will removed soon!
Dec 17, 2006 2:25:27 PM org.apache.myfaces.tobago.taglib.component.InputTag setLabelWithAccessKey
WARNING: Attibute 'labelWithAccessKey' is deprecated, and will removed soon! Please use 'label'
instead.
Dec 17, 2006 2:25:27 PM org.apache.myfaces.tobago.taglib.component.InputTag setAccessKey
WARNING: Attibute 'accessKey' is deprecated, and will removed soon!
Dec 17, 2006 2:25:27 PM org.apache.myfaces.tobago.taglib.component.InputTag setLabelWithAccessKey
WARNING: Attibute 'labelWithAccessKey' is deprecated, and will removed soon! Please use 'label'
instead.
Dec 17, 2006 2:25:27 PM org.apache.myfaces.tobago.taglib.component.InputTag setAccessKey
WARNING: Attibute 'accessKey' is deprecated, and will removed soon!
Dec 17, 2006 2:25:27 PM org.apache.myfaces.tobago.taglib.component.InputTag setLabelWithAccessKey
WARNING: Attibute 'labelWithAccessKey' is deprecated, and will removed soon! Please use 'label'
instead.
Dec 17, 2006 2:25:27 PM org.apache.myfaces.tobago.taglib.component.TabTag setAccessKey
WARNING: Attibute 'accessKey' is deprecated, and will removed soon!
Dec 17, 2006 2:25:27 PM org.apache.myfaces.tobago.taglib.component.TabTag setLabelWithAccessKey
WARNING: Attibute 'labelWithAccessKey' is deprecated, and will removed soon! Please use 'label'
instead.
Dec 17, 2006 2:25:27 PM org.apache.myfaces.tobago.taglib.component.InputTag setAccessKey
WARNING: Attibute 'accessKey' is deprecated, and will removed soon!
Dec 17, 2006 2:25:27 PM org.apache.myfaces.tobago.taglib.component.InputTag setLabelWithAccessKey
WARNING: Attibute 'labelWithAccessKey' is deprecated, and will removed soon! Please use 'label'
instead.
Dec 17, 2006 2:25:28 PM org.apache.myfaces.tobago.renderkit.LabelWithAccessKey findIndicator
WARNING: _ in label is last char, this is not allowedlabel='Save_'.
Dec 17, 2006 2:25:28 PM org.apache.myfaces.tobago.renderkit.LabelWithAccessKey findIndicator
WARNING: _ in label is last char, this is not allowedlabel='Save_'.
Tests run: 5, Failures: 0, Errors: 0, Skipped: 0, Time elapsed: 0.056 sec
Running org.apache.myfaces.tobago.webapp.TobagoMultipartFormdataRequestUnitTest
Tests run: 5, Failures: 0, Errors: 0, Skipped: 0, Time elapsed: 0.048 sec
Running org.apache.myfaces.tobago.util.StringUtilUnitTest
Tests run: 1, Failures: 0, Errors: 0, Skipped: 0, Time elapsed: 0.012 sec
Running org.apache.myfaces.tobago.convert.DurationConverterUnitTest
Tests run: 2, Failures: 0, Errors: 0, Skipped: 0, Time elapsed: 0.031 sec
Running org.apache.myfaces.tobago.taglib.component.GenericComponentTagUnitTest
Dec 17, 2006 2:25:28 PM org.apache.myfaces.tobago.taglib.component.GenericComponentTagUnitTest
testComponent
INFO: testing tag: org.apache.myfaces.tobago.taglib.component.ButtonTag
Dec 17, 2006 2:25:28 PM org.apache.myfaces.tobago.taglib.component.TobagoTag setProperties
WARNING: the height attribute is deprecated, please use a layout manager. (ButtonTag)
Dec 17, 2006 2:25:28 PM javax.faces.component.UIComponentBase getRenderer
WARNING: No Renderer found for component {Component-Path : [Class: javax.faces.component.UIViewRoot,ViewId:
/viewId][Class: org.apache.myfaces.tobago.component.UICommand,Id: _idJsp0]} (component-family=javax.faces.Command,
renderer-type=Button)
Dec 17, 2006 2:25:28 PM javax.faces.component.UIComponentBase getRenderer
WARNING: No Renderer found for component {Component-Path : [Class: javax.faces.component.UIViewRoot,ViewId:
/viewId][Class: org.apache.myfaces.tobago.component.UICommand,Id: _idJsp0]} (component-family=javax.faces.Command,
renderer-type=Button)
Dec 17, 2006 2:25:28 PM org.apache.myfaces.tobago.component.ComponentUtil getBooleanAttribute
WARNING: Unknown type 'java.lang.Integer' for boolean attribute: height id: _idJsp0 comp:
org.apache.myfaces.tobago.component.UICommand@9cbd4b
Tests run: 1, Failures: 0, Errors: 0, Skipped: 0, Time elapsed: 0.079 sec
Running org.apache.myfaces.tobago.util.HtmlWriterUtilUnitTest
Tests run: 2, Failures: 0, Errors: 0, Skipped: 0, Time elapsed: 0.01 sec
Running org.apache.myfaces.tobago.renderkit.html.HtmlRendererUtilTest
Tests run: 1, Failures: 0, Errors: 0, Skipped: 0, Time elapsed: 0.012 sec
Running org.apache.myfaces.tobago.component.UIDataUnitTest
Tests run: 1, Failures: 0, Errors: 0, Skipped: 0, Time elapsed: 0.026 sec

Results :
Tests run: 27, Failures: 0, Errors: 0, Skipped: 0

[INFO] [jar:jar]
[INFO] Building jar: /local/continuum-1.0.3-SNAPSHOT/apps/continuum/working-directory/34/target/tobago-core-1.0.10-SNAPSHOT.jar
[INFO] [install:install]
[INFO] Installing /local/continuum-1.0.3-SNAPSHOT/apps/continuum/working-directory/34/target/tobago-core-1.0.10-SNAPSHOT.jar
to /export/home/mrmaven/.m2/repository/org/apache/myfaces/tobago/tobago-core/1.0.10-SNAPSHOT/tobago-core-1.0.10-SNAPSHOT.jar
[INFO] Preparing checkstyle:check
[INFO] Setting property: classpath.resource.loader.class => 'org.codehaus.plexus.velocity.ContextClassLoaderResourceLoader'.
[INFO] Setting property: velocimacro.messages.on => 'false'.
[INFO] Setting property: resource.loader => 'classpath'.
[INFO] Setting property: resource.manager.logwhenfound => 'false'.
[INFO] ************************************************************** 
[INFO] Starting Jakarta Velocity v1.4
[INFO] RuntimeInstance initializing.
[INFO] Default Properties File: org/apache/velocity/runtime/defaults/velocity.properties
[INFO] Default ResourceManager initializing. (class org.apache.velocity.runtime.resource.ResourceManagerImpl)
[INFO] Resource Loader Instantiated: org.codehaus.plexus.velocity.ContextClassLoaderResourceLoader
[INFO] ClasspathResourceLoader : initialization starting.
[INFO] ClasspathResourceLoader : initialization complete.
[INFO] ResourceCache : initialized. (class org.apache.velocity.runtime.resource.ResourceCacheImpl)
[INFO] Default ResourceManager initialization complete.
[INFO] Loaded System Directive: org.apache.velocity.runtime.directive.Literal
[INFO] Loaded System Directive: org.apache.velocity.runtime.directive.Macro
[INFO] Loaded System Directive: org.apache.velocity.runtime.directive.Parse
[INFO] Loaded System Directive: org.apache.velocity.runtime.directive.Include
[INFO] Loaded System Directive: org.apache.velocity.runtime.directive.Foreach
[INFO] Created: 20 parsers.
[INFO] Velocimacro : initialization starting.
[INFO] Velocimacro : adding VMs from VM library template : VM_global_library.vm
[ERROR] ResourceManager : unable to find resource 'VM_global_library.vm' in any resource loader.
[INFO] Velocimacro : error using  VM library template VM_global_library.vm : org.apache.velocity.exception.ResourceNotFoundException:
Unable to find resource 'VM_global_library.vm'
[INFO] Velocimacro :  VM library template macro registration complete.
[INFO] Velocimacro : allowInline = true : VMs can be defined inline in templates
[INFO] Velocimacro : allowInlineToOverride = false : VMs defined inline may NOT replace previous
VM definitions
[INFO] Velocimacro : allowInlineLocal = false : VMs defined inline will be  global in scope
if allowed.
[INFO] Velocimacro : initialization complete.
[INFO] Velocity successfully started.
[INFO] [checkstyle:checkstyle]
[INFO] [checkstyle:check]
[INFO] ------------------------------------------------------------------------
[INFO] BUILD SUCCESSFUL
[INFO] ------------------------------------------------------------------------
[INFO] Total time: 39 seconds
[INFO] Finished at: Sun Dec 17 14:25:36 GMT+00:00 2006
[INFO] Final Memory: 23M/322M
[INFO] ------------------------------------------------------------------------

****************************************************************************



Mime
View raw message