myfaces-commits mailing list archives

Site index · List index
Message view « Date » · « Thread »
Top « Date » · « Thread »
From "Continuum@myfaces.zones.apache.org" <mrma...@myfaces.zones.apache.org>
Subject [continuum] BUILD FAILURE: Tomahawk Core
Date Tue, 02 Jan 2007 16:36:47 GMT
Online report : http://myfaces.zones.apache.org:8080/continuum/servlet/continuum/target/ProjectBuild.vm/view/ProjectBuild/id/16/buildId/7761
Build statistics:
  State: Failed
  Previous State: Ok
  Started at: Tue, 2 Jan 2007 16:36:00 +0000
  Finished at: Tue, 2 Jan 2007 16:36:47 +0000
  Total time: 46s
  Build Trigger: Schedule
  Exit code: 1
  Building machine hostname: myfaces.zones.apache.org
  Operating system : SunOS(unknown)
  Java version : 1.5.0_09(Sun Microsystems Inc.)

Changes
         paulsp          o Add test to verify component was rendered
o Cleanup unneeded code

             /myfaces/tomahawk/trunk/core/src/test/java/org/apache/myfaces/component/html/ext/HtmlDataTableTest.java
            /myfaces/tomahawk/trunk/core/src/test/java/org/apache/myfaces/test/AbstractTomahawkJsfTestCase.java
           paulsp          Renamed AbstractTomahawkJsfTestCase to correctly reflect the Shale
class it extends.
             /myfaces/tomahawk/trunk/core/src/test/java/org/apache/myfaces/component/html/ext/HtmlDataTableTest.java
            /myfaces/tomahawk/trunk/core/src/test/java/org/apache/myfaces/test/AbstractTomahawkJsfTestCase.java
            /myfaces/tomahawk/trunk/core/src/test/java/org/apache/myfaces/test/AbstractTomahawkViewControllerTestCase.java
(from /myfaces/tomahawk/trunk/core/src/test/java/org/apache/myfaces/test/AbstractTomahawkJsfTestCase.java:491826)
        
****************************************************************************
Output:
****************************************************************************
[INFO] Scanning for projects...
[INFO] Searching repository for plugin with prefix: 'source'.
[INFO] ----------------------------------------------------------------------------
[INFO] Building Tomahawk Core
[INFO]    task-segment: [clean, install, source:jar, deploy, site-deploy]
[INFO] ----------------------------------------------------------------------------
[INFO] [clean:clean]
[INFO] Deleting directory /local/continuum-1.0.3-SNAPSHOT/apps/continuum/working-directory/16/target
[INFO] Deleting directory /local/continuum-1.0.3-SNAPSHOT/apps/continuum/working-directory/16/target/classes
[INFO] Deleting directory /local/continuum-1.0.3-SNAPSHOT/apps/continuum/working-directory/16/target/test-classes
[INFO] [dependency:unpack {execution: unpack-shared-impl-sources}]
[INFO] Configured Artifact: org.apache.myfaces.shared:myfaces-shared-tomahawk:sources:2.0.5-SNAPSHOT:jar
[INFO] Expanding: /export/home/mrmaven/.m2/repository/org/apache/myfaces/shared/myfaces-shared-tomahawk/2.0.5-SNAPSHOT/myfaces-shared-tomahawk-2.0.5-SNAPSHOT-sources.jar
into /local/continuum-1.0.3-SNAPSHOT/apps/continuum/working-directory/16/target/shared_sources
[INFO] [xslt:transform {execution: default}]
[INFO] # of XML files: 1
[INFO] transform, srcFile: /local/continuum-1.0.3-SNAPSHOT/apps/continuum/working-directory/16/src/main/tld/tomahawk.tld,
destFile: /local/continuum-1.0.3-SNAPSHOT/apps/continuum/working-directory/16/target/classes/META-INF/tomahawk.tld
[INFO] [xslt:transform {execution: generate-tld-for-jar}]
[INFO] # of XML files: 1
[INFO] file up-to-date: /local/continuum-1.0.3-SNAPSHOT/apps/continuum/working-directory/16/target/classes/META-INF/tomahawk.tld
[INFO] [xslt:transform {execution: generate-tld-for-tlddoc}]
[INFO] # of XML files: 1
[INFO] transform, srcFile: /local/continuum-1.0.3-SNAPSHOT/apps/continuum/working-directory/16/src/main/tld/tomahawk.tld,
destFile: /local/continuum-1.0.3-SNAPSHOT/apps/continuum/working-directory/16/target/tlddoc-site/tomahawk.tld
[INFO] [build-helper:add-source {execution: add-source}]
[INFO] Source directory: /local/continuum-1.0.3-SNAPSHOT/apps/continuum/working-directory/16/target/shared_sources
added.
[INFO] [resources:resources]
[INFO] Using default encoding to copy filtered resources.
[INFO] [compiler:compile]
Compiling 419 source files to /local/continuum-1.0.3-SNAPSHOT/apps/continuum/working-directory/16/target/classes
[INFO] [dependency:unpack {execution: unpack-shared-tomahawk}]
[INFO] Configured Artifact: org.apache.myfaces.shared:myfaces-shared-tomahawk:null:2.0.5-SNAPSHOT:jar
[INFO] myfaces-shared-tomahawk-2.0.5-SNAPSHOT.jar already unpacked.
[INFO] [resources:testResources]
[INFO] Using default encoding to copy filtered resources.
[INFO] [compiler:testCompile]
Compiling 28 source files to /local/continuum-1.0.3-SNAPSHOT/apps/continuum/working-directory/16/target/test-classes
[INFO] ------------------------------------------------------------------------
[ERROR] BUILD FAILURE
[INFO] ------------------------------------------------------------------------
[INFO] Compilation failure

/local/continuum-1.0.3-SNAPSHOT/apps/continuum/working-directory/16/src/test/java/org/apache/myfaces/custom/savestate/UISaveStateTest.java:[28,31]
cannot find symbol
symbol  : class AbstractTomahawkJsfTestCase
location: package org.apache.myfaces.test

/local/continuum-1.0.3-SNAPSHOT/apps/continuum/working-directory/16/src/test/java/org/apache/myfaces/custom/savestate/UISaveStateTest.java:[34,37]
cannot find symbol
symbol: class AbstractTomahawkJsfTestCase
public class UISaveStateTest extends AbstractTomahawkJsfTestCase{

/local/continuum-1.0.3-SNAPSHOT/apps/continuum/working-directory/16/src/test/java/org/apache/myfaces/custom/stylesheet/StylesheetRendererTest.java:[27,31]
cannot find symbol
symbol  : class AbstractTomahawkJsfTestCase
location: package org.apache.myfaces.test

/local/continuum-1.0.3-SNAPSHOT/apps/continuum/working-directory/16/src/test/java/org/apache/myfaces/custom/stylesheet/StylesheetRendererTest.java:[30,44]
cannot find symbol
symbol: class AbstractTomahawkJsfTestCase
public class StylesheetRendererTest extends AbstractTomahawkJsfTestCase

/local/continuum-1.0.3-SNAPSHOT/apps/continuum/working-directory/16/src/test/java/org/apache/myfaces/custom/tree2/AbstractTreeTestCase.java:[31,31]
cannot find symbol
symbol  : class AbstractTomahawkJsfTestCase
location: package org.apache.myfaces.test

/local/continuum-1.0.3-SNAPSHOT/apps/continuum/working-directory/16/src/test/java/org/apache/myfaces/custom/tree2/AbstractTreeTestCase.java:[59,42]
cannot find symbol
symbol: class AbstractTomahawkJsfTestCase
public class AbstractTreeTestCase extends AbstractTomahawkJsfTestCase

/local/continuum-1.0.3-SNAPSHOT/apps/continuum/working-directory/16/src/test/java/org/apache/myfaces/custom/savestate/UISaveStateTest.java:[48,16]
cannot find symbol
symbol  : variable super
location: class org.apache.myfaces.custom.savestate.UISaveStateTest

/local/continuum-1.0.3-SNAPSHOT/apps/continuum/working-directory/16/src/test/java/org/apache/myfaces/custom/savestate/UISaveStateTest.java:[51,16]
cannot find symbol
symbol  : variable facesContext
location: class org.apache.myfaces.custom.savestate.UISaveStateTest

/local/continuum-1.0.3-SNAPSHOT/apps/continuum/working-directory/16/src/test/java/org/apache/myfaces/custom/savestate/UISaveStateTest.java:[57,16]
cannot find symbol
symbol  : variable super
location: class org.apache.myfaces.custom.savestate.UISaveStateTest

/local/continuum-1.0.3-SNAPSHOT/apps/continuum/working-directory/16/src/test/java/org/apache/myfaces/custom/savestate/UISaveStateTest.java:[61,44]
cannot find symbol
symbol  : variable facesContext
location: class org.apache.myfaces.custom.savestate.UISaveStateTest

/local/continuum-1.0.3-SNAPSHOT/apps/continuum/working-directory/16/src/test/java/org/apache/myfaces/custom/savestate/UISaveStateTest.java:[64,75]
cannot find symbol
symbol  : variable facesContext
location: class org.apache.myfaces.custom.savestate.UISaveStateTest

/local/continuum-1.0.3-SNAPSHOT/apps/continuum/working-directory/16/src/test/java/org/apache/myfaces/custom/savestate/UISaveStateTest.java:[67,59]
cannot find symbol
symbol  : variable facesContext
location: class org.apache.myfaces.custom.savestate.UISaveStateTest

/local/continuum-1.0.3-SNAPSHOT/apps/continuum/working-directory/16/src/test/java/org/apache/myfaces/custom/savestate/UISaveStateTest.java:[69,24]
cannot find symbol
symbol  : method assertEquals(java.lang.Object,java.util.LinkedList)
location: class org.apache.myfaces.custom.savestate.UISaveStateTest

/local/continuum-1.0.3-SNAPSHOT/apps/continuum/working-directory/16/src/test/java/org/apache/myfaces/custom/savestate/UISaveStateTest.java:[71,47]
cannot find symbol
symbol  : variable facesContext
location: class org.apache.myfaces.custom.savestate.UISaveStateTest

/local/continuum-1.0.3-SNAPSHOT/apps/continuum/working-directory/16/src/test/java/org/apache/myfaces/custom/savestate/UISaveStateTest.java:[74,24]
cannot find symbol
symbol  : method fail()
location: class org.apache.myfaces.custom.savestate.UISaveStateTest

/local/continuum-1.0.3-SNAPSHOT/apps/continuum/working-directory/16/src/test/java/org/apache/myfaces/custom/savestate/UISaveStateTest.java:[79,44]
cannot find symbol
symbol  : variable facesContext
location: class org.apache.myfaces.custom.savestate.UISaveStateTest

/local/continuum-1.0.3-SNAPSHOT/apps/continuum/working-directory/16/src/test/java/org/apache/myfaces/custom/savestate/UISaveStateTest.java:[82,87]
cannot find symbol
symbol  : variable facesContext
location: class org.apache.myfaces.custom.savestate.UISaveStateTest

/local/continuum-1.0.3-SNAPSHOT/apps/continuum/working-directory/16/src/test/java/org/apache/myfaces/custom/savestate/UISaveStateTest.java:[85,59]
cannot find symbol
symbol  : variable facesContext
location: class org.apache.myfaces.custom.savestate.UISaveStateTest

/local/continuum-1.0.3-SNAPSHOT/apps/continuum/working-directory/16/src/test/java/org/apache/myfaces/custom/savestate/UISaveStateTest.java:[87,24]
cannot find symbol
symbol  : method assertNotSame(java.lang.Object,org.apache.myfaces.custom.savestate.SaveStateTestBean)
location: class org.apache.myfaces.custom.savestate.UISaveStateTest

/local/continuum-1.0.3-SNAPSHOT/apps/continuum/working-directory/16/src/test/java/org/apache/myfaces/custom/savestate/UISaveStateTest.java:[89,47]
cannot find symbol
symbol  : variable facesContext
location: class org.apache.myfaces.custom.savestate.UISaveStateTest

/local/continuum-1.0.3-SNAPSHOT/apps/continuum/working-directory/16/src/test/java/org/apache/myfaces/custom/savestate/UISaveStateTest.java:[91,24]
cannot find symbol
symbol  : method fail()
location: class org.apache.myfaces.custom.savestate.UISaveStateTest

/local/continuum-1.0.3-SNAPSHOT/apps/continuum/working-directory/16/src/test/java/org/apache/myfaces/custom/stylesheet/StylesheetRendererTest.java:[43,8]
cannot find symbol
symbol  : variable super
location: class org.apache.myfaces.custom.stylesheet.StylesheetRendererTest

/local/continuum-1.0.3-SNAPSHOT/apps/continuum/working-directory/16/src/test/java/org/apache/myfaces/custom/stylesheet/StylesheetRendererTest.java:[48,8]
cannot find symbol
symbol  : variable facesContext
location: class org.apache.myfaces.custom.stylesheet.StylesheetRendererTest

/local/continuum-1.0.3-SNAPSHOT/apps/continuum/working-directory/16/src/test/java/org/apache/myfaces/custom/stylesheet/StylesheetRendererTest.java:[57,8]
cannot find symbol
symbol  : variable super
location: class org.apache.myfaces.custom.stylesheet.StylesheetRendererTest

/local/continuum-1.0.3-SNAPSHOT/apps/continuum/working-directory/16/src/test/java/org/apache/myfaces/custom/stylesheet/StylesheetRendererTest.java:[74,29]
cannot find symbol
symbol  : variable facesContext
location: class org.apache.myfaces.custom.stylesheet.StylesheetRendererTest

/local/continuum-1.0.3-SNAPSHOT/apps/continuum/working-directory/16/src/test/java/org/apache/myfaces/custom/stylesheet/StylesheetRendererTest.java:[75,8]
cannot find symbol
symbol  : variable facesContext
location: class org.apache.myfaces.custom.stylesheet.StylesheetRendererTest

/local/continuum-1.0.3-SNAPSHOT/apps/continuum/working-directory/16/src/test/java/org/apache/myfaces/custom/stylesheet/StylesheetRendererTest.java:[79,8]
cannot find symbol
symbol  : method assertTrue(java.lang.String,boolean)
location: class org.apache.myfaces.custom.stylesheet.StylesheetRendererTest

/local/continuum-1.0.3-SNAPSHOT/apps/continuum/working-directory/16/src/test/java/org/apache/myfaces/custom/stylesheet/StylesheetRendererTest.java:[86,29]
cannot find symbol
symbol  : variable facesContext
location: class org.apache.myfaces.custom.stylesheet.StylesheetRendererTest

/local/continuum-1.0.3-SNAPSHOT/apps/continuum/working-directory/16/src/test/java/org/apache/myfaces/custom/stylesheet/StylesheetRendererTest.java:[87,8]
cannot find symbol
symbol  : variable facesContext
location: class org.apache.myfaces.custom.stylesheet.StylesheetRendererTest

/local/continuum-1.0.3-SNAPSHOT/apps/continuum/working-directory/16/src/test/java/org/apache/myfaces/custom/stylesheet/StylesheetRendererTest.java:[91,8]
cannot find symbol
symbol  : method assertTrue(java.lang.String,boolean)
location: class org.apache.myfaces.custom.stylesheet.StylesheetRendererTest

/local/continuum-1.0.3-SNAPSHOT/apps/continuum/working-directory/16/src/test/java/org/apache/myfaces/custom/tree2/AbstractTreeTestCase.java:[81,8]
cannot find symbol
symbol  : variable super
location: class org.apache.myfaces.custom.tree2.AbstractTreeTestCase

/local/continuum-1.0.3-SNAPSHOT/apps/continuum/working-directory/16/src/test/java/org/apache/myfaces/custom/tree2/UITreeDataTest.java:[68,8]
cannot find symbol
symbol  : method assertTrue(java.lang.String,boolean)
location: class org.apache.myfaces.custom.tree2.UITreeDataTest

/local/continuum-1.0.3-SNAPSHOT/apps/continuum/working-directory/16/src/test/java/org/apache/myfaces/custom/tree2/UITreeDataTest.java:[77,8]
cannot find symbol
symbol  : method assertTrue(java.lang.String,boolean)
location: class org.apache.myfaces.custom.tree2.UITreeDataTest

/local/continuum-1.0.3-SNAPSHOT/apps/continuum/working-directory/16/src/test/java/org/apache/myfaces/custom/tree2/UITreeDataTest.java:[94,8]
cannot find symbol
symbol  : method assertTrue(java.lang.String,boolean)
location: class org.apache.myfaces.custom.tree2.UITreeDataTest

/local/continuum-1.0.3-SNAPSHOT/apps/continuum/working-directory/16/src/test/java/org/apache/myfaces/custom/tree2/UITreeDataTest.java:[106,8]
cannot find symbol
symbol  : method assertTrue(java.lang.String,boolean)
location: class org.apache.myfaces.custom.tree2.UITreeDataTest

/local/continuum-1.0.3-SNAPSHOT/apps/continuum/working-directory/16/src/test/java/org/apache/myfaces/custom/tree2/UITreeDataTest.java:[109,8]
cannot find symbol
symbol  : method assertTrue(java.lang.String,boolean)
location: class org.apache.myfaces.custom.tree2.UITreeDataTest

/local/continuum-1.0.3-SNAPSHOT/apps/continuum/working-directory/16/src/test/java/org/apache/myfaces/custom/tree2/UITreeDataTest.java:[112,8]
cannot find symbol
symbol  : method assertTrue(java.lang.String,boolean)
location: class org.apache.myfaces.custom.tree2.UITreeDataTest

/local/continuum-1.0.3-SNAPSHOT/apps/continuum/working-directory/16/src/test/java/org/apache/myfaces/custom/tree2/UITreeDataTest.java:[115,8]
cannot find symbol
symbol  : method assertTrue(java.lang.String,boolean)
location: class org.apache.myfaces.custom.tree2.UITreeDataTest

/local/continuum-1.0.3-SNAPSHOT/apps/continuum/working-directory/16/src/test/java/org/apache/myfaces/custom/tree2/UITreeDataTest.java:[118,8]
cannot find symbol
symbol  : method assertTrue(java.lang.String,boolean)
location: class org.apache.myfaces.custom.tree2.UITreeDataTest

/local/continuum-1.0.3-SNAPSHOT/apps/continuum/working-directory/16/src/test/java/org/apache/myfaces/custom/tree2/UITreeDataTest.java:[121,8]
cannot find symbol
symbol  : method assertTrue(java.lang.String,boolean)
location: class org.apache.myfaces.custom.tree2.UITreeDataTest

/local/continuum-1.0.3-SNAPSHOT/apps/continuum/working-directory/16/src/test/java/org/apache/myfaces/custom/tree2/UITreeDataTest.java:[124,8]
cannot find symbol
symbol  : method assertTrue(java.lang.String,boolean)
location: class org.apache.myfaces.custom.tree2.UITreeDataTest

/local/continuum-1.0.3-SNAPSHOT/apps/continuum/working-directory/16/src/test/java/org/apache/myfaces/custom/tree2/UITreeDataTest.java:[127,8]
cannot find symbol
symbol  : method assertTrue(java.lang.String,boolean)
location: class org.apache.myfaces.custom.tree2.UITreeDataTest

/local/continuum-1.0.3-SNAPSHOT/apps/continuum/working-directory/16/src/test/java/org/apache/myfaces/custom/tree2/UITreeDataTest.java:[130,8]
cannot find symbol
symbol  : method assertTrue(java.lang.String,boolean)
location: class org.apache.myfaces.custom.tree2.UITreeDataTest

/local/continuum-1.0.3-SNAPSHOT/apps/continuum/working-directory/16/src/test/java/org/apache/myfaces/custom/tree2/UITreeDataTest.java:[133,8]
cannot find symbol
symbol  : method assertTrue(java.lang.String,boolean)
location: class org.apache.myfaces.custom.tree2.UITreeDataTest

/local/continuum-1.0.3-SNAPSHOT/apps/continuum/working-directory/16/src/test/java/org/apache/myfaces/custom/tree2/UITreeDataTest.java:[136,8]
cannot find symbol
symbol  : method assertTrue(java.lang.String,boolean)
location: class org.apache.myfaces.custom.tree2.UITreeDataTest

/local/continuum-1.0.3-SNAPSHOT/apps/continuum/working-directory/16/src/test/java/org/apache/myfaces/custom/tree2/UITreeDataTest.java:[139,8]
cannot find symbol
symbol  : method assertTrue(java.lang.String,boolean)
location: class org.apache.myfaces.custom.tree2.UITreeDataTest

/local/continuum-1.0.3-SNAPSHOT/apps/continuum/working-directory/16/src/test/java/org/apache/myfaces/custom/tree2/UITreeDataTest.java:[155,8]
cannot find symbol
symbol  : method assertFalse(java.lang.String,boolean)
location: class org.apache.myfaces.custom.tree2.UITreeDataTest

/local/continuum-1.0.3-SNAPSHOT/apps/continuum/working-directory/16/src/test/java/org/apache/myfaces/custom/tree2/UITreeDataTest.java:[158,8]
cannot find symbol
symbol  : method assertFalse(java.lang.String,boolean)
location: class org.apache.myfaces.custom.tree2.UITreeDataTest

/local/continuum-1.0.3-SNAPSHOT/apps/continuum/working-directory/16/src/test/java/org/apache/myfaces/custom/tree2/UITreeDataTest.java:[161,8]
cannot find symbol
symbol  : method assertFalse(java.lang.String,boolean)
location: class org.apache.myfaces.custom.tree2.UITreeDataTest

/local/continuum-1.0.3-SNAPSHOT/apps/continuum/working-directory/16/src/test/java/org/apache/myfaces/custom/tree2/UITreeDataTest.java:[164,8]
cannot find symbol
symbol  : method assertFalse(java.lang.String,boolean)
location: class org.apache.myfaces.custom.tree2.UITreeDataTest

/local/continuum-1.0.3-SNAPSHOT/apps/continuum/working-directory/16/src/test/java/org/apache/myfaces/custom/tree2/UITreeDataTest.java:[167,8]
cannot find symbol
symbol  : method assertFalse(java.lang.String,boolean)
location: class org.apache.myfaces.custom.tree2.UITreeDataTest

/local/continuum-1.0.3-SNAPSHOT/apps/continuum/working-directory/16/src/test/java/org/apache/myfaces/custom/tree2/UITreeDataTest.java:[178,28]
cannot find symbol
symbol  : variable facesContext
location: class org.apache.myfaces.custom.tree2.UITreeDataTest

/local/continuum-1.0.3-SNAPSHOT/apps/continuum/working-directory/16/src/test/java/org/apache/myfaces/custom/tree2/HtmlTreeRendererTest.java:[80,8]
cannot find symbol
symbol  : variable renderKit
location: class org.apache.myfaces.custom.tree2.HtmlTreeRendererTest

/local/continuum-1.0.3-SNAPSHOT/apps/continuum/working-directory/16/src/test/java/org/apache/myfaces/custom/tree2/HtmlTreeRendererTest.java:[94,36]
cannot find symbol
symbol  : variable facesContext
location: class org.apache.myfaces.custom.tree2.HtmlTreeRendererTest

/local/continuum-1.0.3-SNAPSHOT/apps/continuum/working-directory/16/src/test/java/org/apache/myfaces/custom/tree2/HtmlTreeRendererTest.java:[99,8]
cannot find symbol
symbol  : method assertEquals(java.lang.String,int,int)
location: class org.apache.myfaces.custom.tree2.HtmlTreeRendererTest

/local/continuum-1.0.3-SNAPSHOT/apps/continuum/working-directory/16/src/test/java/org/apache/myfaces/custom/tree2/HtmlTreeRendererTest.java:[102,8]
cannot find symbol
symbol  : method assertEquals(java.lang.String,java.lang.String)
location: class org.apache.myfaces.custom.tree2.HtmlTreeRendererTest

/local/continuum-1.0.3-SNAPSHOT/apps/continuum/working-directory/16/src/test/java/org/apache/myfaces/custom/tree2/HtmlTreeRendererTest.java:[105,8]
cannot find symbol
symbol  : method assertEquals(java.lang.String,java.lang.String)
location: class org.apache.myfaces.custom.tree2.HtmlTreeRendererTest

/local/continuum-1.0.3-SNAPSHOT/apps/continuum/working-directory/16/src/test/java/org/apache/myfaces/custom/tree2/HtmlTreeRendererTest.java:[108,8]
cannot find symbol
symbol  : method assertEquals(java.lang.String,java.lang.String)
location: class org.apache.myfaces.custom.tree2.HtmlTreeRendererTest

/local/continuum-1.0.3-SNAPSHOT/apps/continuum/working-directory/16/src/test/java/org/apache/myfaces/custom/tree2/HtmlTreeRendererTest.java:[111,8]
cannot find symbol
symbol  : method assertEquals(java.lang.String,java.lang.String)
location: class org.apache.myfaces.custom.tree2.HtmlTreeRendererTest

/local/continuum-1.0.3-SNAPSHOT/apps/continuum/working-directory/16/src/test/java/org/apache/myfaces/custom/tree2/HtmlTreeRendererTest.java:[124,36]
cannot find symbol
symbol  : variable facesContext
location: class org.apache.myfaces.custom.tree2.HtmlTreeRendererTest

/local/continuum-1.0.3-SNAPSHOT/apps/continuum/working-directory/16/src/test/java/org/apache/myfaces/custom/tree2/HtmlTreeRendererTest.java:[129,8]
cannot find symbol
symbol  : method assertEquals(java.lang.String,int,int)
location: class org.apache.myfaces.custom.tree2.HtmlTreeRendererTest

/local/continuum-1.0.3-SNAPSHOT/apps/continuum/working-directory/16/src/test/java/org/apache/myfaces/custom/tree2/HtmlTreeRendererTest.java:[132,8]
cannot find symbol
symbol  : method assertEquals(java.lang.String,java.lang.String)
location: class org.apache.myfaces.custom.tree2.HtmlTreeRendererTest

/local/continuum-1.0.3-SNAPSHOT/apps/continuum/working-directory/16/src/test/java/org/apache/myfaces/custom/tree2/HtmlTreeRendererTest.java:[135,8]
cannot find symbol
symbol  : method assertEquals(java.lang.String,java.lang.String)
location: class org.apache.myfaces.custom.tree2.HtmlTreeRendererTest

/local/continuum-1.0.3-SNAPSHOT/apps/continuum/working-directory/16/src/test/java/org/apache/myfaces/custom/tree2/HtmlTreeRendererTest.java:[138,8]
cannot find symbol
symbol  : method assertEquals(java.lang.String,java.lang.String)
location: class org.apache.myfaces.custom.tree2.HtmlTreeRendererTest

/local/continuum-1.0.3-SNAPSHOT/apps/continuum/working-directory/16/src/test/java/org/apache/myfaces/custom/tree2/HtmlTreeRendererTest.java:[141,8]
cannot find symbol
symbol  : method assertEquals(java.lang.String,java.lang.String)
location: class org.apache.myfaces.custom.tree2.HtmlTreeRendererTest

/local/continuum-1.0.3-SNAPSHOT/apps/continuum/working-directory/16/src/test/java/org/apache/myfaces/custom/tree2/HtmlTreeRendererTest.java:[144,8]
cannot find symbol
symbol  : method assertEquals(java.lang.String,java.lang.String)
location: class org.apache.myfaces.custom.tree2.HtmlTreeRendererTest

/local/continuum-1.0.3-SNAPSHOT/apps/continuum/working-directory/16/src/test/java/org/apache/myfaces/custom/tree2/HtmlTreeRendererTest.java:[147,8]
cannot find symbol
symbol  : method assertEquals(java.lang.String,java.lang.String)
location: class org.apache.myfaces.custom.tree2.HtmlTreeRendererTest

/local/continuum-1.0.3-SNAPSHOT/apps/continuum/working-directory/16/src/test/java/org/apache/myfaces/custom/tree2/HtmlTreeRendererTest.java:[150,8]
cannot find symbol
symbol  : method assertEquals(java.lang.String,java.lang.String)
location: class org.apache.myfaces.custom.tree2.HtmlTreeRendererTest

/local/continuum-1.0.3-SNAPSHOT/apps/continuum/working-directory/16/src/test/java/org/apache/myfaces/custom/tree2/HtmlTreeRendererTest.java:[153,8]
cannot find symbol
symbol  : method assertEquals(java.lang.String,java.lang.String)
location: class org.apache.myfaces.custom.tree2.HtmlTreeRendererTest

/local/continuum-1.0.3-SNAPSHOT/apps/continuum/working-directory/16/src/test/java/org/apache/myfaces/custom/tree2/HtmlTreeRendererTest.java:[156,8]
cannot find symbol
symbol  : method assertEquals(java.lang.String,java.lang.String)
location: class org.apache.myfaces.custom.tree2.HtmlTreeRendererTest

/local/continuum-1.0.3-SNAPSHOT/apps/continuum/working-directory/16/src/test/java/org/apache/myfaces/custom/tree2/HtmlTreeRendererTest.java:[159,8]
cannot find symbol
symbol  : method assertEquals(java.lang.String,java.lang.String)
location: class org.apache.myfaces.custom.tree2.HtmlTreeRendererTest

/local/continuum-1.0.3-SNAPSHOT/apps/continuum/working-directory/16/src/test/java/org/apache/myfaces/custom/tree2/HtmlTreeRendererTest.java:[162,8]
cannot find symbol
symbol  : method assertEquals(java.lang.String,java.lang.String)
location: class org.apache.myfaces.custom.tree2.HtmlTreeRendererTest

/local/continuum-1.0.3-SNAPSHOT/apps/continuum/working-directory/16/src/test/java/org/apache/myfaces/custom/tree2/HtmlTreeTest.java:[65,8]
cannot find symbol
symbol  : method assertTrue(java.lang.String,boolean)
location: class org.apache.myfaces.custom.tree2.HtmlTreeTest

/local/continuum-1.0.3-SNAPSHOT/apps/continuum/working-directory/16/src/test/java/org/apache/myfaces/custom/tree2/HtmlTreeTest.java:[66,8]
cannot find symbol
symbol  : method assertTrue(java.lang.String,boolean)
location: class org.apache.myfaces.custom.tree2.HtmlTreeTest

/local/continuum-1.0.3-SNAPSHOT/apps/continuum/working-directory/16/src/test/java/org/apache/myfaces/custom/tree2/HtmlTreeTest.java:[67,8]
cannot find symbol
symbol  : method assertTrue(java.lang.String,boolean)
location: class org.apache.myfaces.custom.tree2.HtmlTreeTest

/local/continuum-1.0.3-SNAPSHOT/apps/continuum/working-directory/16/src/test/java/org/apache/myfaces/custom/tree2/HtmlTreeTest.java:[68,8]
cannot find symbol
symbol  : method assertTrue(java.lang.String,boolean)
location: class org.apache.myfaces.custom.tree2.HtmlTreeTest

/local/continuum-1.0.3-SNAPSHOT/apps/continuum/working-directory/16/src/test/java/org/apache/myfaces/custom/tree2/HtmlTreeTest.java:[69,8]
cannot find symbol
symbol  : method assertTrue(java.lang.String,boolean)
location: class org.apache.myfaces.custom.tree2.HtmlTreeTest


[INFO] ------------------------------------------------------------------------
[INFO] For more information, run Maven with the -e switch
[INFO] ------------------------------------------------------------------------
[INFO] Total time: 45 seconds
[INFO] Finished at: Tue Jan 02 16:36:46 GMT+00:00 2007
[INFO] Final Memory: 25M/321M
[INFO] ------------------------------------------------------------------------

****************************************************************************



Mime
View raw message