myfaces-commits mailing list archives

Site index · List index
Message view « Date » · « Thread »
Top « Date » · « Thread »
From "Continuum@myfaces.zones.apache.org" <comm...@myfaces.apache.org>
Subject [continuum] BUILD FAILURE: Core Project
Date Sat, 03 Feb 2007 03:16:00 GMT
Online report : http://myfaces.zones.apache.org:8081/continuum/buildResult.action?buildId=671&projectId=1
Build statistics:
  State: Failed
  Previous State: Error
  Started at: Sat, 3 Feb 2007 03:15:35 +0000
  Finished at: Sat, 3 Feb 2007 03:15:40 +0000
  Total time: 5s
  Build Trigger: Schedule
  Build Number: 2
  Exit code: 1
  Building machine hostname: myfaces.zones.apache.org
  Operating system : SunOS(unknown)
  Java version : 1.5.0_10(Sun Microsystems Inc.)

****************************************************************************
SCM Changes:
****************************************************************************
Changed: weber @ Wed, 31 Jan 2007 13:54:23 +0000
Comment: MYFACES-1525 (actions of UICommand could execute in wrong phase)
Files changed:
  /myfaces/core/trunk/api/src/main/java/javax/faces/component/UICommand.java ( 501845 )

Changed: manolito @ Fri, 2 Feb 2007 16:15:22 +0000
Comment: Last release:prepare step for the maven-project artifact: Fix dependency versions
for build-tools and myfaces-master to 1.0.6-SNAPSHOT
Files changed:
  /myfaces/core/trunk/api/pom.xml ( 502643 )
  /myfaces/core/trunk/pom.xml ( 502643 )
  /myfaces/shared/trunk/pom.xml ( 502643 )
  /myfaces/site/trunk/pom.xml ( 502643 )
  /myfaces/tobago/trunk/pom.xml ( 502643 )
  /myfaces/tomahawk/trunk/pom.xml ( 502643 )

****************************************************************************
SCM Changes since last success:
****************************************************************************
****************************************************************************
Dependencies Changes:
****************************************************************************
No dependencies changed

****************************************************************************
Test Summary:
****************************************************************************
Tests: 0
Failures: 0
Total time: 0

****************************************************************************
Output:
****************************************************************************
[INFO] Scanning for projects...
[INFO] snapshot org.apache.myfaces.maven:myfaces-master:1.0.6-SNAPSHOT: checking for updates
from apache.snapshots
Downloading: http://people.apache.org/repo/m2-snapshot-repository/org/apache/myfaces/maven/myfaces-master/1.0.6-SNAPSHOT/myfaces-master-1.0.6-SNAPSHOT.pom
[WARNING] Unable to get resource from repository apache.snapshots (http://people.apache.org/repo/m2-snapshot-repository)
[INFO] ------------------------------------------------------------------------
[ERROR] FATAL ERROR
[INFO] ------------------------------------------------------------------------
[INFO] Failed to resolve artifact.

GroupId: org.apache.myfaces.maven
ArtifactId: myfaces-master
Version: 1.0.6-SNAPSHOT

Reason: Unable to download the artifact from any repository

  org.apache.myfaces.maven:myfaces-master:pom:1.0.6-SNAPSHOT

from the specified remote repositories:
  central (http://repo1.maven.org/maven2),
  apache.snapshots (http://people.apache.org/repo/m2-snapshot-repository)


[INFO] ------------------------------------------------------------------------
[INFO] Trace
org.apache.maven.reactor.MavenExecutionException: Cannot find parent: org.apache.myfaces.maven:myfaces-master
for project: org.apache.myfaces.core:myfaces-core-project:pom:1.1.5-SNAPSHOT
	at org.apache.maven.DefaultMaven.getProjects(DefaultMaven.java:365)
	at org.apache.maven.DefaultMaven.doExecute(DefaultMaven.java:278)
	at org.apache.maven.DefaultMaven.execute(DefaultMaven.java:115)
	at org.apache.maven.cli.MavenCli.main(MavenCli.java:256)
	at sun.reflect.NativeMethodAccessorImpl.invoke0(Native Method)
	at sun.reflect.NativeMethodAccessorImpl.invoke(NativeMethodAccessorImpl.java:39)
	at sun.reflect.DelegatingMethodAccessorImpl.invoke(DelegatingMethodAccessorImpl.java:25)
	at java.lang.reflect.Method.invoke(Method.java:585)
	at org.codehaus.classworlds.Launcher.launchEnhanced(Launcher.java:315)
	at org.codehaus.classworlds.Launcher.launch(Launcher.java:255)
	at org.codehaus.classworlds.Launcher.mainWithExitCode(Launcher.java:430)
	at org.codehaus.classworlds.Launcher.main(Launcher.java:375)
Caused by: org.apache.maven.project.ProjectBuildingException: Cannot find parent: org.apache.myfaces.maven:myfaces-master
for project: org.apache.myfaces.core:myfaces-core-project:pom:1.1.5-SNAPSHOT
	at org.apache.maven.project.DefaultMavenProjectBuilder.assembleLineage(DefaultMavenProjectBuilder.java:1161)
	at org.apache.maven.project.DefaultMavenProjectBuilder.buildInternal(DefaultMavenProjectBuilder.java:674)
	at org.apache.maven.project.DefaultMavenProjectBuilder.buildFromSourceFileInternal(DefaultMavenProjectBuilder.java:416)
	at org.apache.maven.project.DefaultMavenProjectBuilder.build(DefaultMavenProjectBuilder.java:192)
	at org.apache.maven.DefaultMaven.getProject(DefaultMaven.java:515)
	at org.apache.maven.DefaultMaven.collectProjects(DefaultMaven.java:447)
	at org.apache.maven.DefaultMaven.getProjects(DefaultMaven.java:351)
	... 11 more
Caused by: org.apache.maven.project.ProjectBuildingException: POM 'org.apache.myfaces.maven:myfaces-master'
not found in repository: Unable to download the artifact from any repository

  org.apache.myfaces.maven:myfaces-master:pom:1.0.6-SNAPSHOT

from the specified remote repositories:
  central (http://repo1.maven.org/maven2),
  apache.snapshots (http://people.apache.org/repo/m2-snapshot-repository)

	at org.apache.maven.project.DefaultMavenProjectBuilder.findModelFromRepository(DefaultMavenProjectBuilder.java:513)
	at org.apache.maven.project.DefaultMavenProjectBuilder.assembleLineage(DefaultMavenProjectBuilder.java:1157)
	... 17 more
Caused by: org.apache.maven.artifact.resolver.ArtifactNotFoundException: Unable to download
the artifact from any repository

  org.apache.myfaces.maven:myfaces-master:pom:1.0.6-SNAPSHOT

from the specified remote repositories:
  central (http://repo1.maven.org/maven2),
  apache.snapshots (http://people.apache.org/repo/m2-snapshot-repository)

	at org.apache.maven.artifact.resolver.DefaultArtifactResolver.resolve(DefaultArtifactResolver.java:136)
	at org.apache.maven.artifact.resolver.DefaultArtifactResolver.resolve(DefaultArtifactResolver.java:63)
	at org.apache.maven.project.DefaultMavenProjectBuilder.findModelFromRepository(DefaultMavenProjectBuilder.java:467)
	... 18 more
Caused by: org.apache.maven.wagon.ResourceDoesNotExistException: Unable to download the artifact
from any repository
	at org.apache.maven.artifact.manager.DefaultWagonManager.getArtifact(DefaultWagonManager.java:260)
	at org.apache.maven.artifact.resolver.DefaultArtifactResolver.resolve(DefaultArtifactResolver.java:124)
	... 20 more
[INFO] ------------------------------------------------------------------------
[INFO] Total time: 1 second
[INFO] Finished at: Sat Feb 03 03:15:40 GMT+00:00 2007
[INFO] Final Memory: 2M/14M
[INFO] ------------------------------------------------------------------------

****************************************************************************



Mime
View raw message