myfaces-commits mailing list archives

Site index · List index
Message view « Date » · « Thread »
Top « Date » · « Thread »
From "Continuum@myfaces.zones.apache.org" <comm...@myfaces.apache.org>
Subject [continuum] BUILD FAILURE: Example Addressbook
Date Sun, 01 Apr 2007 18:38:01 GMT
Online report : http://myfaces.zones.apache.org:8081/continuum/buildResult.action?buildId=6250&projectId=105
Build statistics:
  State: Failed
  Previous State: Ok
  Started at: Sun, 1 Apr 2007 18:36:53 +0000
  Finished at: Sun, 1 Apr 2007 18:38:00 +0000
  Total time: 1m 6s
  Build Trigger: Schedule
  Build Number: 18
  Exit code: 1
  Building machine hostname: myfaces.zones.apache.org
  Operating system : SunOS(unknown)
  Java version : 1.5.0_11(Sun Microsystems Inc.)

****************************************************************************
SCM Changes:
****************************************************************************
Changed: idus @ Sun, 1 Apr 2007 15:30:25 +0000
Comment: small improvements for login page and cleanup in resource files
Files changed:
  /myfaces/tobago/trunk/example/addressbook/src/main/webapp/auth/login.jsp ( 524621 )
  /myfaces/tobago/trunk/example/addressbook/src/main/webapp/tobago-resource/html/standard/standard/property/resource.properties
( 524621 )
  /myfaces/tobago/trunk/example/addressbook/src/main/webapp/tobago-resource/html/standard/standard/property/resource_de.properties
( 524621 )
  /myfaces/tobago/trunk/example/addressbook/src/test/resources/realm.properties ( 524621 )

Changed: idus @ Sun, 1 Apr 2007 15:41:08 +0000
Comment: cosmetics: spaces
Files changed:
  /myfaces/tobago/trunk/example/addressbook/src/main/webapp/META-INF/context.xml ( 524622
)
  /myfaces/tobago/trunk/example/addressbook/src/main/webapp/application/admin/admin.jsp (
524622 )
  /myfaces/tobago/trunk/example/addressbook/src/main/webapp/application/editor.jsp ( 524622
)
  /myfaces/tobago/trunk/example/addressbook/src/main/webapp/application/list.jsp ( 524622
)
  /myfaces/tobago/trunk/example/addressbook/src/main/webapp/auth/error.jsp ( 524622 )
  /myfaces/tobago/trunk/example/addressbook/src/main/webapp/auth/login.jsp ( 524622 )
  /myfaces/tobago/trunk/example/addressbook/src/main/webapp/auth/logout.jsp ( 524622 )
  /myfaces/tobago/trunk/example/addressbook/src/main/webapp/start.jsp ( 524622 )

Changed: idus @ Sun, 1 Apr 2007 18:36:06 +0000
Comment: hack to make country persistent and started localization of login dialog
Files changed:
  /myfaces/tobago/trunk/example/addressbook/src/main/java/org/apache/myfaces/tobago/example/addressbook/Address.java
( 524652 )
  /myfaces/tobago/trunk/example/addressbook/src/main/java/org/apache/myfaces/tobago/example/addressbook/web/Controller.java
( 524652 )
  /myfaces/tobago/trunk/example/addressbook/src/main/webapp/auth/error.jsp ( 524652 )
  /myfaces/tobago/trunk/example/addressbook/src/main/webapp/auth/login.jsp ( 524652 )
  /myfaces/tobago/trunk/example/addressbook/src/main/webapp/tobago-resource/html/standard/standard/property/resource.properties
( 524652 )

****************************************************************************
SCM Changes since last success:
****************************************************************************
****************************************************************************
Dependencies Changes:
****************************************************************************
org.apache.myfaces.tobago:tobago-theme-charlotteville:1.0.11-SNAPSHOT

org.apache.myfaces.tobago:tobago-security:1.0.11-SNAPSHOT

org.apache.myfaces.tobago:tobago-core:1.0.11-SNAPSHOT

org.apache.myfaces.tobago:tobago-theme-richmond:1.0.11-SNAPSHOT

org.apache.myfaces.tobago:tobago-fileupload:1.0.11-SNAPSHOT

org.apache.myfaces.tobago:tobago-example:1.0.11-SNAPSHOT

****************************************************************************
Test Summary:
****************************************************************************
Tests: 0
Failures: 0
Total time: 0

****************************************************************************
Output:
****************************************************************************
[INFO] Scanning for projects...
[INFO] Searching repository for plugin with prefix: 'checkstyle'.
[INFO] ----------------------------------------------------------------------------
[INFO] Building Example Addressbook
[INFO]    task-segment: [clean, install, deploy, checkstyle:check]
[INFO] ----------------------------------------------------------------------------
[INFO] [clean:clean]
[INFO] Deleting directory /local/continuum-1.1-SNAPSHOT/apps/continuum/working-directory/105/target
[INFO] Deleting directory /local/continuum-1.1-SNAPSHOT/apps/continuum/working-directory/105/target/classes
[INFO] Deleting directory /local/continuum-1.1-SNAPSHOT/apps/continuum/working-directory/105/target/test-classes
[INFO] [cobertura:clean {execution: clean}]
[INFO] [resources:resources]
[INFO] Using default encoding to copy filtered resources.
[WARNING] 
	Artifact javax.servlet:servlet-api:jar:2.3:provided retains local scope 'provided' overriding
broader scope 'compile'
	given by a dependency. If this is not intended, modify or remove the local scope.

[WARNING] 
	Artifact junit:junit:jar:4.1:test retains local scope 'test' overriding broader scope 'compile'
	given by a dependency. If this is not intended, modify or remove the local scope.

[INFO] [compiler:compile]
[INFO] Compiling 18 source files to /local/continuum-1.1-SNAPSHOT/apps/continuum/working-directory/105/target/classes
[INFO] [antrun:run {execution: default}]
[INFO] Executing tasks
     [java] 225  INFO   [main] openjpa.Tool - No targets were given.  Running on all classes
in your persistent classes list, or all metadata files in classpath directories if you have
not listed your persistent classes.  Use -help to display tool usage information.
     [java] 253  INFO   [main] openjpa.MetaData - Found 2 classes with metadata in 4 milliseconds.
     [java] 308  INFO   [main] openjpa.Tool - Enhancer running on type "class org.apache.myfaces.tobago.example.addressbook.Picture".
     [java] 403  INFO   [main] openjpa.MetaData - Parsing class "org.apache.myfaces.tobago.example.addressbook.Picture".
     [java] 403  INFO   [main] openjpa.MetaData - Parsing package "org.apache.myfaces.tobago.example.addressbook.Picture".
     [java] 620  INFO   [main] openjpa.Tool - Enhancer running on type "class org.apache.myfaces.tobago.example.addressbook.Address".
     [java] 641  INFO   [main] openjpa.MetaData - Parsing class "org.apache.myfaces.tobago.example.addressbook.Address".
[INFO] Executed tasks
[INFO] [resources:testResources]
[INFO] Using default encoding to copy filtered resources.
[INFO] [compiler:testCompile]
[INFO] No sources to compile
[INFO] [surefire:test]
[INFO] Surefire report directory: /local/continuum-1.1-SNAPSHOT/apps/continuum/working-directory/105/target/surefire-reports

-------------------------------------------------------
 T E S T S
-------------------------------------------------------
There are no tests to run.

Results :

Tests run: 0, Failures: 0, Errors: 0, Skipped: 0

[INFO] [war:war]
[INFO] Exploding webapp...
[INFO] Assembling webapp tobago-example-addressbook in /local/continuum-1.1-SNAPSHOT/apps/continuum/working-directory/105/target/tobago-example-addressbook
[INFO] Copy webapp webResources to /local/continuum-1.1-SNAPSHOT/apps/continuum/working-directory/105/target/tobago-example-addressbook
[INFO] Generating war /local/continuum-1.1-SNAPSHOT/apps/continuum/working-directory/105/target/tobago-example-addressbook.war
[INFO] Building war: /local/continuum-1.1-SNAPSHOT/apps/continuum/working-directory/105/target/tobago-example-addressbook.war
[INFO] [dependency:unpack {execution: unpack}]
[INFO] Configured Artifact: org.tango-project:tango-icon-theme:0.8.0:jar
[INFO] Expanding: /export/home/mrmaven/.m2/repository/org/tango-project/tango-icon-theme/0.8.0/tango-icon-theme-0.8.0.jar
into /local/continuum-1.1-SNAPSHOT/apps/continuum/working-directory/105/target/tobago-example-addressbook/tobago-resource/html/standard/standard/image
[INFO] [install:install]
[INFO] Installing /local/continuum-1.1-SNAPSHOT/apps/continuum/working-directory/105/target/tobago-example-addressbook.war
to /export/home/mrmaven/.m2/repository/org/apache/myfaces/tobago/tobago-example-addressbook/1.0.11-SNAPSHOT/tobago-example-addressbook-1.0.11-SNAPSHOT.war
[INFO] [resources:resources]
[INFO] Using default encoding to copy filtered resources.
[INFO] [compiler:compile]
[INFO] Nothing to compile - all classes are up to date
[INFO] [antrun:run {execution: default}]
[INFO] Executing tasks
     [java] 188  INFO   [main] openjpa.Tool - No targets were given.  Running on all classes
in your persistent classes list, or all metadata files in classpath directories if you have
not listed your persistent classes.  Use -help to display tool usage information.
     [java] 200  INFO   [main] openjpa.MetaData - Found 2 classes with metadata in 3 milliseconds.
     [java] log4j:WARN No appenders could be found for logger (org.apache.myfaces.tobago.example.addressbook.Address).
     [java] log4j:WARN Please initialize the log4j system properly.
     [java] 263  INFO   [main] openjpa.Tool - Enhancer running on type "class org.apache.myfaces.tobago.example.addressbook.Picture".
     [java] 373  INFO   [main] openjpa.MetaData - Parsing class "org.apache.myfaces.tobago.example.addressbook.Picture".
     [java] 373  INFO   [main] openjpa.MetaData - Parsing package "org.apache.myfaces.tobago.example.addressbook.Picture".
     [java] 458  INFO   [main] openjpa.Tool - The class is already persistence capable - no
enhancement performed.
     [java] 459  INFO   [main] openjpa.Tool - Enhancer running on type "class org.apache.myfaces.tobago.example.addressbook.Address".
     [java] 505  INFO   [main] openjpa.MetaData - Parsing class "org.apache.myfaces.tobago.example.addressbook.Address".
     [java] 544  INFO   [main] openjpa.Tool - The class is already persistence capable - no
enhancement performed.
[INFO] Executed tasks
[INFO] [resources:testResources]
[INFO] Using default encoding to copy filtered resources.
[INFO] [compiler:testCompile]
[INFO] No sources to compile
[INFO] [surefire:test]
[INFO] Surefire report directory: /local/continuum-1.1-SNAPSHOT/apps/continuum/working-directory/105/target/surefire-reports

-------------------------------------------------------
 T E S T S
-------------------------------------------------------
There are no tests to run.

Results :

Tests run: 0, Failures: 0, Errors: 0, Skipped: 0

[INFO] [war:war]
[INFO] Exploding webapp...
[INFO] Assembling webapp tobago-example-addressbook in /local/continuum-1.1-SNAPSHOT/apps/continuum/working-directory/105/target/tobago-example-addressbook
[INFO] Copy webapp webResources to /local/continuum-1.1-SNAPSHOT/apps/continuum/working-directory/105/target/tobago-example-addressbook
[INFO] Generating war /local/continuum-1.1-SNAPSHOT/apps/continuum/working-directory/105/target/tobago-example-addressbook.war
[INFO] Building war: /local/continuum-1.1-SNAPSHOT/apps/continuum/working-directory/105/target/tobago-example-addressbook.war
[INFO] [dependency:unpack {execution: unpack}]
[INFO] Configured Artifact: org.tango-project:tango-icon-theme:0.8.0:jar
[INFO] tango-icon-theme-0.8.0.jar already unpacked.
[INFO] [install:install]
[INFO] Installing /local/continuum-1.1-SNAPSHOT/apps/continuum/working-directory/105/target/tobago-example-addressbook.war
to /export/home/mrmaven/.m2/repository/org/apache/myfaces/tobago/tobago-example-addressbook/1.0.11-SNAPSHOT/tobago-example-addressbook-1.0.11-SNAPSHOT.war
[INFO] [deploy:deploy]
altDeploymentRepository = null
[INFO] Retrieving previous build number from apache-maven-snapshots
Uploading: scpexe://minotaur.apache.org/www/people.apache.org/repo/m2-snapshot-repository/org/apache/myfaces/tobago/tobago-example-addressbook/1.0.11-SNAPSHOT/tobago-example-addressbook-1.0.11-SNAPSHOT.war
[INFO] Retrieving previous metadata from apache-maven-snapshots
[INFO] Uploading project information for tobago-example-addressbook 1.0.11-SNAPSHOT
[INFO] Retrieving previous metadata from apache-maven-snapshots
[INFO] Uploading repository metadata for: 'artifact org.apache.myfaces.tobago:tobago-example-addressbook'
[INFO] Retrieving previous metadata from apache-maven-snapshots
[INFO] Uploading repository metadata for: 'snapshot org.apache.myfaces.tobago:tobago-example-addressbook:1.0.11-SNAPSHOT'
[INFO] Preparing checkstyle:check
[INFO] Setting property: classpath.resource.loader.class => 'org.codehaus.plexus.velocity.ContextClassLoaderResourceLoader'.
[INFO] Setting property: velocimacro.messages.on => 'false'.
[INFO] Setting property: resource.loader => 'classpath'.
[INFO] Setting property: resource.manager.logwhenfound => 'false'.
[INFO] ************************************************************** 
[INFO] Starting Jakarta Velocity v1.4
[INFO] RuntimeInstance initializing.
[INFO] Default Properties File: org/apache/velocity/runtime/defaults/velocity.properties
[INFO] Default ResourceManager initializing. (class org.apache.velocity.runtime.resource.ResourceManagerImpl)
[INFO] Resource Loader Instantiated: org.codehaus.plexus.velocity.ContextClassLoaderResourceLoader
[INFO] ClasspathResourceLoader : initialization starting.
[INFO] ClasspathResourceLoader : initialization complete.
[INFO] ResourceCache : initialized. (class org.apache.velocity.runtime.resource.ResourceCacheImpl)
[INFO] Default ResourceManager initialization complete.
[INFO] Loaded System Directive: org.apache.velocity.runtime.directive.Literal
[INFO] Loaded System Directive: org.apache.velocity.runtime.directive.Macro
[INFO] Loaded System Directive: org.apache.velocity.runtime.directive.Parse
[INFO] Loaded System Directive: org.apache.velocity.runtime.directive.Include
[INFO] Loaded System Directive: org.apache.velocity.runtime.directive.Foreach
[INFO] Created: 20 parsers.
[INFO] Velocimacro : initialization starting.
[INFO] Velocimacro : adding VMs from VM library template : VM_global_library.vm
[ERROR] ResourceManager : unable to find resource 'VM_global_library.vm' in any resource loader.
[INFO] Velocimacro : error using  VM library template VM_global_library.vm : org.apache.velocity.exception.ResourceNotFoundException:
Unable to find resource 'VM_global_library.vm'
[INFO] Velocimacro :  VM library template macro registration complete.
[INFO] Velocimacro : allowInline = true : VMs can be defined inline in templates
[INFO] Velocimacro : allowInlineToOverride = false : VMs defined inline may NOT replace previous
VM definitions
[INFO] Velocimacro : allowInlineLocal = false : VMs defined inline will be  global in scope
if allowed.
[INFO] Velocimacro : initialization complete.
[INFO] Velocity successfully started.
[INFO] [checkstyle:checkstyle]
[INFO] There are 2 checkstyle errors.
[INFO] [checkstyle:check]
[INFO] ------------------------------------------------------------------------
[ERROR] BUILD FAILURE
[INFO] ------------------------------------------------------------------------
[INFO] You have 2 checkstyle violations.
[INFO] ------------------------------------------------------------------------
[INFO] For more information, run Maven with the -e switch
[INFO] ------------------------------------------------------------------------
[INFO] Total time: 1 minute 5 seconds
[INFO] Finished at: Sun Apr 01 18:37:59 GMT+00:00 2007
[INFO] Final Memory: 20M/57M
[INFO] ------------------------------------------------------------------------

****************************************************************************



Mime
View raw message