myfaces-commits mailing list archives

Site index · List index
Message view « Date » · « Thread »
Top « Date » · « Thread »
From "Continuum@myfaces.zones.apache.org" <comm...@myfaces.apache.org>
Subject [continuum] BUILD FAILURE: Apache MyFaces Trinidad API
Date Wed, 27 Jun 2007 02:02:19 GMT
Online report : http://myfaces.zones.apache.org:8081/continuum/buildResult.action?buildId=2563&projectId=132
Build statistics:
  State: Failed
  Previous State: Failed
  Started at: Wed 27 Jun 2007 02:02:07 +0000
  Finished at: Wed 27 Jun 2007 02:02:08 +0000
  Total time: 1s
  Build Trigger: Schedule
  Build Number: 19
  Exit code: 1
  Building machine hostname: myfaces.zones.apache.org
  Operating system : SunOS(unknown)
  Java version : 1.5.0_11(Sun Microsystems Inc.)

****************************************************************************
SCM Changes:
****************************************************************************
Changed: no author @ no date
Comment: no comment
Files changed:
  src/main/java/org/apache/myfaces/trinidad/event/SetActionListener.java ( no revision )
  src/main/java/org/apache/myfaces/trinidad/component/UIXCollection.java ( no revision )
  src/main/java/org/apache/myfaces/trinidad/component/UIXComponentBase.java ( no revision
)
  src/main/java/org/apache/myfaces/trinidad/resource/CachingResourceLoader.java ( no revision
)
  src/main/java/org/apache/myfaces/trinidad/webapp/ResourceServlet.java ( no revision )
  src/main/resources/META-INF/NOTICE ( no revision )
  src/site/xdoc/tagdoc/tr_fileDownloadActionListener.xml ( no revision )

****************************************************************************
SCM Changes since last success:
****************************************************************************
Changed: no author @ no date
Comment: no comment
Files changed:
  src/main/java/org/apache/myfaces/trinidad/convert/NumberConverter.java ( no revision )
  src/main/java/org/apache/myfaces/trinidad/convert/RGBColorFormat.java ( no revision )
  src/main/java/org/apache/myfaces/trinidad/model/SortCriterion.java ( no revision )
  src/main/java/org/apache/myfaces/trinidad/model/XMLMenuModel.java ( no revision )
  src/main/java/org/apache/myfaces/trinidad/model/DefaultBoundedRangeModel.java ( no revision
)
  src/main/java/org/apache/myfaces/trinidad/model/SortableModel.java ( no revision )
  src/main/java/org/apache/myfaces/trinidad/model/RowKeySetTreeImpl.java ( no revision )
  src/main/java/org/apache/myfaces/trinidad/event/RangeChangeEvent.java ( no revision )
  src/main/java/org/apache/myfaces/trinidad/event/RowDisclosureEvent.java ( no revision )
  src/main/java/org/apache/myfaces/trinidad/event/PollEvent.java ( no revision )
  src/main/java/org/apache/myfaces/trinidad/event/AttributeChangeEvent.java ( no revision
)
  src/main/java/org/apache/myfaces/trinidad/event/LaunchEvent.java ( no revision )
  src/main/java/org/apache/myfaces/trinidad/event/DisclosureEvent.java ( no revision )
  src/main/java/org/apache/myfaces/trinidad/event/ReturnEvent.java ( no revision )
  src/main/java/org/apache/myfaces/trinidad/event/FocusEvent.java ( no revision )
  src/main/java/org/apache/myfaces/trinidad/event/ChartDrillDownEvent.java ( no revision )
  src/main/java/org/apache/myfaces/trinidad/event/SelectionEvent.java ( no revision )
  src/main/java/org/apache/myfaces/trinidad/event/SortEvent.java ( no revision )
  src/main/java/org/apache/myfaces/trinidad/component/HierarchyUtils.java ( no revision )
  src/main/java/org/apache/myfaces/trinidad/component/UIXCollection.java ( no revision )
  src/main/java/org/apache/myfaces/trinidad/component/TableRowEvent.java ( no revision )
  src/main/java/org/apache/myfaces/trinidad/component/WrapperEvent.java ( no revision )
  src/main/java/org/apache/myfaces/trinidad/component/FacesMessageWrapper.java ( no revision
)
  src/main/java/org/apache/myfaces/trinidad/bean/util/StateUtils.java ( no revision )
  src/main/java/org/apache/myfaces/trinidad/change/ReorderChildrenComponentChange.java ( no
revision )
  src/main/java/org/apache/myfaces/trinidad/change/AddChildComponentChange.java ( no revision
)
  src/main/java/org/apache/myfaces/trinidad/change/RemoveFacetComponentChange.java ( no revision
)
  src/main/java/org/apache/myfaces/trinidad/change/RemoveChildComponentChange.java ( no revision
)
  src/main/java/org/apache/myfaces/trinidad/change/SetFacetChildComponentChange.java ( no
revision )
  src/main/java/org/apache/myfaces/trinidad/change/AttributeComponentChange.java ( no revision
)
  src/main/java/org/apache/myfaces/trinidad/resource/AggregatingResourceLoader.java ( no revision
)
  src/main/java/org/apache/myfaces/trinidad/util/LabeledFacesMessage.java ( no revision )
  src/main/java/org/apache/myfaces/trinidad/util/ErrorMessages.java ( no revision )
  src/main/java/org/apache/myfaces/trinidad/util/MessageFactory.java ( no revision )
  src/main/java/org/apache/myfaces/trinidad/util/ClassLoaderUtils.java ( no revision )
  src/main/java/org/apache/myfaces/trinidad/webapp/UIXComponentTag.java ( no revision )
  src/main/java/org/apache/myfaces/trinidad/webapp/ResourceServlet.java ( no revision )
  src/main/java-templates/org/apache/myfaces/trinidad/component/UIXIteratorTemplate.java (
no revision )
  src/main/java-templates/org/apache/myfaces/trinidad/component/UIXEditableValueTemplate.java
( no revision )
  pom.xml ( no revision )

****************************************************************************
Dependencies Changes:
****************************************************************************
No dependencies changed

****************************************************************************
Test Summary:
****************************************************************************
Tests: 462
Failures: 0
Total time: 4352

****************************************************************************
Output:
****************************************************************************
[INFO] Scanning for projects...
[INFO] ------------------------------------------------------------------------
[ERROR] FATAL ERROR
[INFO] ------------------------------------------------------------------------
[INFO] Failed to resolve artifact.

GroupId: org.apache.myfaces.trinidad
ArtifactId: trinidad
Version: 1.0.2-SNAPSHOT

Reason: Unable to download the artifact from any repository

  org.apache.myfaces.trinidad:trinidad:pom:1.0.2-SNAPSHOT

from the specified remote repositories:
  central (http://repo1.maven.org/maven2)


[INFO] ------------------------------------------------------------------------
[INFO] Trace
org.apache.maven.reactor.MavenExecutionException: Cannot find parent: org.apache.myfaces.trinidad:trinidad
for project: null:trinidad-api:jar:null
	at org.apache.maven.DefaultMaven.getProjects(DefaultMaven.java:373)
	at org.apache.maven.DefaultMaven.doExecute(DefaultMaven.java:286)
	at org.apache.maven.DefaultMaven.execute(DefaultMaven.java:123)
	at org.apache.maven.cli.MavenCli.main(MavenCli.java:272)
	at sun.reflect.NativeMethodAccessorImpl.invoke0(Native Method)
	at sun.reflect.NativeMethodAccessorImpl.invoke(NativeMethodAccessorImpl.java:39)
	at sun.reflect.DelegatingMethodAccessorImpl.invoke(DelegatingMethodAccessorImpl.java:25)
	at java.lang.reflect.Method.invoke(Method.java:585)
	at org.codehaus.classworlds.Launcher.launchEnhanced(Launcher.java:315)
	at org.codehaus.classworlds.Launcher.launch(Launcher.java:255)
	at org.codehaus.classworlds.Launcher.mainWithExitCode(Launcher.java:430)
	at org.codehaus.classworlds.Launcher.main(Launcher.java:375)
Caused by: org.apache.maven.project.ProjectBuildingException: Cannot find parent: org.apache.myfaces.trinidad:trinidad
for project: null:trinidad-api:jar:null
	at org.apache.maven.project.DefaultMavenProjectBuilder.assembleLineage(DefaultMavenProjectBuilder.java:1198)
	at org.apache.maven.project.DefaultMavenProjectBuilder.buildInternal(DefaultMavenProjectBuilder.java:697)
	at org.apache.maven.project.DefaultMavenProjectBuilder.buildFromSourceFileInternal(DefaultMavenProjectBuilder.java:431)
	at org.apache.maven.project.DefaultMavenProjectBuilder.build(DefaultMavenProjectBuilder.java:195)
	at org.apache.maven.DefaultMaven.getProject(DefaultMaven.java:523)
	at org.apache.maven.DefaultMaven.collectProjects(DefaultMaven.java:455)
	at org.apache.maven.DefaultMaven.getProjects(DefaultMaven.java:359)
	... 11 more
Caused by: org.apache.maven.project.ProjectBuildingException: POM 'org.apache.myfaces.trinidad:trinidad'
not found in repository: Unable to download the artifact from any repository

  org.apache.myfaces.trinidad:trinidad:pom:1.0.2-SNAPSHOT

from the specified remote repositories:
  central (http://repo1.maven.org/maven2)

	at org.apache.maven.project.DefaultMavenProjectBuilder.findModelFromRepository(DefaultMavenProjectBuilder.java:528)
	at org.apache.maven.project.DefaultMavenProjectBuilder.assembleLineage(DefaultMavenProjectBuilder.java:1194)
	... 17 more
Caused by: org.apache.maven.artifact.resolver.ArtifactNotFoundException: Unable to download
the artifact from any repository

  org.apache.myfaces.trinidad:trinidad:pom:1.0.2-SNAPSHOT

from the specified remote repositories:
  central (http://repo1.maven.org/maven2)

	at org.apache.maven.artifact.resolver.DefaultArtifactResolver.resolve(DefaultArtifactResolver.java:197)
	at org.apache.maven.artifact.resolver.DefaultArtifactResolver.resolve(DefaultArtifactResolver.java:73)
	at org.apache.maven.project.DefaultMavenProjectBuilder.findModelFromRepository(DefaultMavenProjectBuilder.java:482)
	... 18 more
Caused by: org.apache.maven.wagon.ResourceDoesNotExistException: Unable to download the artifact
from any repository
	at org.apache.maven.artifact.manager.DefaultWagonManager.getArtifact(DefaultWagonManager.java:308)
	at org.apache.maven.artifact.resolver.DefaultArtifactResolver.resolve(DefaultArtifactResolver.java:185)
	... 20 more
[INFO] ------------------------------------------------------------------------
[INFO] Total time: < 1 second
[INFO] Finished at: Wed Jun 27 02:02:08 GMT+00:00 2007
[INFO] Final Memory: 1M/14M
[INFO] ------------------------------------------------------------------------

****************************************************************************



Mime
View raw message