myfaces-commits mailing list archives

Site index · List index
Message view « Date » · « Thread »
Top « Date » · « Thread »
From Continuum VMBuild Server <contin...@apache.org>
Subject [continuum] BUILD FAILURE: Apache MyFaces Trinidad API
Date Mon, 05 Nov 2007 15:29:58 GMT
Online report : http://vmbuild.apache.org/continuum/buildResult.action?buildId=16027&projectId=15

Build statistics:
  State: Failed
  Previous State: Ok
  Started at: Mon 5 Nov 2007 07:27:38 -0800
  Finished at: Mon 5 Nov 2007 07:29:22 -0800
  Total time: 1m 43s
  Build Trigger: Schedule
  Build Number: 145
  Exit code: 1
  Building machine hostname: vmbuild.apache.org
  Operating system : Linux(unknown)
  Java Home version : 
          java version "1.6.0"
          Java(TM) SE Runtime Environment (build 1.6.0-b105)
          Java HotSpot(TM) Client VM (build 1.6.0-b105, mixed mode, sharing)
        
  Builder version :
          Maven version: 2.0.7
          Java version: 1.6.0
          OS name: "linux" version: "2.6.20-16-server" arch: "i386"
    
****************************************************************************
SCM Changes:
****************************************************************************
Changed: no author @ no date
Comment: no comment
Files changed:
  src/test/java/org/apache/myfaces/trinidad/convert/TrinidadNumberConverterTest.java ( no
revision )
  src/test/java/org/apache/myfaces/trinidad/convert/NumberConverterTestCase.java ( no revision
)

****************************************************************************
Dependencies Changes:
****************************************************************************
org.apache.myfaces.trinidad:trinidad-build:1.0.4-SNAPSHOT

org.apache.myfaces.trinidad:trinidad:1.0.4-SNAPSHOT


****************************************************************************
Build Defintion:
****************************************************************************
POM filename: pom.xml
Goals: clean install source:jar deploy:deploy   
Arguments: --non-recursive --batch-mode -DaltDeploymentRepository=vmbuild.repo::default::file://localhost/home/continuum/data/repositories/myfaces
Build Fresh: false
Always Build: false
Default Build Definition: true
Schedule: DEFAULT_SCHEDULE
Description: 


****************************************************************************
Test Summary:
****************************************************************************
Tests: 464
Failures: 2
Total time: 5950

****************************************************************************
Output:
****************************************************************************
[INFO] Scanning for projects...
[INFO] Searching repository for plugin with prefix: 'source'.
[INFO] ----------------------------------------------------------------------------
[INFO] Building Apache MyFaces Trinidad API
[INFO]    task-segment: [clean, install, source:jar, deploy:deploy]
[INFO] ----------------------------------------------------------------------------
[INFO] [clean:clean]
[INFO] Deleting directory /home/continuum/data/working-directory/15/target
[INFO] Deleting directory /home/continuum/data/working-directory/15/target/classes
[INFO] Deleting directory /home/continuum/data/working-directory/15/target/test-classes
[INFO] Deleting directory /home/continuum/data/working-directory/15/target/site
[INFO] [xrts:generate-sources {execution: default}]
[INFO] Generating 30 XRTS bundles to /home/continuum/data/working-directory/15/target/maven-xrts-plugin/main/java
[INFO] [faces:generate-components {execution: default}]
[INFO] Generated 133 component(s)
[INFO] [i18n:generate-locale-elements {execution: default}]
[INFO] Generating LocaleElements
[INFO] Setting property: classpath.resource.loader.class => 'org.codehaus.plexus.velocity.ContextClassLoaderResourceLoader'.
[INFO] Setting property: velocimacro.messages.on => 'false'.
[INFO] Setting property: resource.loader => 'classpath'.
[INFO] Setting property: resource.manager.logwhenfound => 'false'.
[INFO] [remote-resources:process {execution: default}]
[INFO] [resources:resources]
[INFO] Using default encoding to copy filtered resources.
[INFO] [compiler:compile]
[INFO] Compiling 335 source files to /home/continuum/data/working-directory/15/target/classes
[WARNING] /home/continuum/data/working-directory/15/target/maven-faces-plugin/main/java/org/apache/myfaces/trinidad/component/core/layout/CorePanelAccordion.java:[128,62]
[unchecked] unchecked cast
found   : java.util.List
required: java.util.List<javax.faces.component.UIComponent>

[WARNING] /home/continuum/data/working-directory/15/src/main/java/org/apache/myfaces/trinidad/model/RowKeySetImpl.java:[139,17]
[deprecation] isContainedByDefault() in org.apache.myfaces.trinidad.model.RowKeySet has been
deprecated

[WARNING] /home/continuum/data/working-directory/15/src/main/java/org/apache/myfaces/trinidad/model/RowKeySetImpl.java:[139,17]
[deprecation] isContainedByDefault() in org.apache.myfaces.trinidad.model.RowKeySet has been
deprecated

[WARNING] /home/continuum/data/working-directory/15/src/main/java/org/apache/myfaces/trinidad/component/TableUtils.java:[229,8]
[cast] redundant cast to javax.faces.component.UIComponent

[WARNING] /home/continuum/data/working-directory/15/target/maven-faces-plugin/main/java/org/apache/myfaces/trinidad/component/UIXGroup.java:[97,60]
[unchecked] unchecked cast
found   : java.util.List
required: java.util.List<javax.faces.component.UIComponent>

[WARNING] /home/continuum/data/working-directory/15/target/maven-faces-plugin/main/java/org/apache/myfaces/trinidad/component/UIXTable.java:[178,6]
[deprecation] clearCurrencyStringCache() in org.apache.myfaces.trinidad.component.UIXCollection
has been deprecated

[INFO] [xrts:generate-test-sources {execution: default}]
[INFO] Generating 1 XRTS bundles to /home/continuum/data/working-directory/15/target/maven-xrts-plugin/test/java
[INFO] [resources:testResources]
[INFO] Using default encoding to copy filtered resources.
[INFO] [compiler:testCompile]
[INFO] Compiling 86 source files to /home/continuum/data/working-directory/15/target/test-classes
[WARNING] /home/continuum/data/working-directory/15/src/test/java/org/apache/myfaces/trinidad/convert/NumberConverterTestCase.java:[222,22]
unmappable character for encoding UTF8

[WARNING] /home/continuum/data/working-directory/15/src/test/java/org/apache/myfaces/trinidad/convert/NumberConverterTestCase.java:[222,30]
unmappable character for encoding UTF8

[INFO] [surefire:test]
[INFO] Setting reports dir: /home/continuum/data/working-directory/15/target/surefire-reports

-------------------------------------------------------
 T E S T S
-------------------------------------------------------
[surefire] Running org.apache.myfaces.trinidad.component.html.HtmlTableLayoutTest
[surefire] Tests run: 8, Failures: 0, Errors: 0, Time elapsed: 0.921 sec
[surefire] Running org.apache.myfaces.trinidad.component.html.HtmlFrameTest
[surefire] Tests run: 8, Failures: 0, Errors: 0, Time elapsed: 0.013 sec
[surefire] Running org.apache.myfaces.trinidad.component.html.HtmlHtmlTest
[surefire] Tests run: 6, Failures: 0, Errors: 0, Time elapsed: 0.013 sec
[surefire] Running org.apache.myfaces.trinidad.component.html.HtmlScriptTest
[surefire] Tests run: 8, Failures: 0, Errors: 0, Time elapsed: 0.012 sec
[surefire] Running org.apache.myfaces.trinidad.component.html.HtmlFrameBorderLayoutTest
[surefire] Tests run: 8, Failures: 0, Errors: 0, Time elapsed: 0.082 sec
[surefire] Running org.apache.myfaces.trinidad.component.html.HtmlRowLayoutTest
[surefire] Tests run: 8, Failures: 0, Errors: 0, Time elapsed: 0.013 sec
[surefire] Running org.apache.myfaces.trinidad.component.html.HtmlCellFormatTest
[surefire] Tests run: 8, Failures: 0, Errors: 0, Time elapsed: 0.029 sec
[surefire] Running org.apache.myfaces.trinidad.component.UIXTreeTest
[surefire] Tests run: 1, Failures: 0, Errors: 0, Time elapsed: 0.009 sec
[surefire] Running org.apache.myfaces.trinidad.component.FindComponentTest
[surefire] Tests run: 4, Failures: 0, Errors: 0, Time elapsed: 0.013 sec
[surefire] Running org.apache.myfaces.trinidad.component.AddRemoveTest
[surefire] Tests run: 4, Failures: 0, Errors: 0, Time elapsed: 0.007 sec
[surefire] Running org.apache.myfaces.trinidad.component.UIXSelectManyTest
[surefire] Tests run: 11, Failures: 0, Errors: 0, Time elapsed: 0.027 sec
[surefire] Running org.apache.myfaces.trinidad.component.UIXInputTest
[surefire] Tests run: 3, Failures: 0, Errors: 0, Time elapsed: 0.007 sec
[surefire] Running org.apache.myfaces.trinidad.component.UIXProcessTest
[surefire] Tests run: 6, Failures: 0, Errors: 0, Time elapsed: 0.03 sec
[surefire] Running org.apache.myfaces.trinidad.component.UIXTableTest
[surefire] Tests run: 10, Failures: 0, Errors: 0, Time elapsed: 0.228 sec
[surefire] Running org.apache.myfaces.trinidad.component.UIXShowDetailTest
[surefire] Tests run: 7, Failures: 0, Errors: 0, Time elapsed: 0.055 sec
[surefire] Running org.apache.myfaces.trinidad.component.UIXSwitcherTest
[surefire] Tests run: 5, Failures: 0, Errors: 0, Time elapsed: 0.013 sec
[surefire] Running org.apache.myfaces.trinidad.component.core.data.CoreSelectRangeChoiceBarTest
[surefire] Tests run: 7, Failures: 0, Errors: 0, Time elapsed: 0.031 sec
[surefire] Running org.apache.myfaces.trinidad.component.core.data.CoreColumnTest
[surefire] Tests run: 8, Failures: 0, Errors: 0, Time elapsed: 0.018 sec
[surefire] Running org.apache.myfaces.trinidad.component.core.CoreFormTest
[surefire] Tests run: 8, Failures: 0, Errors: 0, Time elapsed: 0.024 sec
[surefire] Running org.apache.myfaces.trinidad.component.core.layout.CoreShowDetailHeaderTest
[surefire] Tests run: 7, Failures: 0, Errors: 0, Time elapsed: 0.015 sec
[surefire] Running org.apache.myfaces.trinidad.component.core.layout.CorePanelAccordionTest
[surefire] Tests run: 8, Failures: 0, Errors: 0, Time elapsed: 0.018 sec
[surefire] Running org.apache.myfaces.trinidad.component.core.layout.CorePanelSideBarTest
[surefire] Tests run: 7, Failures: 0, Errors: 0, Time elapsed: 0.014 sec
[surefire] Running org.apache.myfaces.trinidad.component.core.layout.CoreShowDetailTest
[surefire] Tests run: 7, Failures: 0, Errors: 0, Time elapsed: 0.014 sec
[surefire] Running org.apache.myfaces.trinidad.component.core.layout.CorePanelBorderLayoutTest
[surefire] Tests run: 8, Failures: 0, Errors: 0, Time elapsed: 0.02 sec
[surefire] Running org.apache.myfaces.trinidad.component.core.layout.CorePanelHeaderTest
[surefire] Tests run: 7, Failures: 0, Errors: 0, Time elapsed: 0.027 sec
[surefire] Running org.apache.myfaces.trinidad.component.core.layout.CorePanelGroupLayoutTest
[surefire] Tests run: 8, Failures: 0, Errors: 0, Time elapsed: 0.01 sec
[surefire] Running org.apache.myfaces.trinidad.component.core.layout.CorePanelBoxTest
[surefire] Tests run: 7, Failures: 0, Errors: 0, Time elapsed: 0.043 sec
[surefire] Running org.apache.myfaces.trinidad.component.core.layout.CorePanelChoiceTest
[surefire] Tests run: 8, Failures: 0, Errors: 0, Time elapsed: 0.046 sec
[surefire] Running org.apache.myfaces.trinidad.component.core.layout.CorePanelRadioTest
[surefire] Tests run: 8, Failures: 0, Errors: 0, Time elapsed: 0.051 sec
[surefire] Running org.apache.myfaces.trinidad.component.core.layout.CorePanelListTest
[surefire] Tests run: 7, Failures: 0, Errors: 0, Time elapsed: 0.021 sec
[surefire] Running org.apache.myfaces.trinidad.component.core.input.CoreSelectBooleanCheckboxTest
[surefire] Tests run: 9, Failures: 0, Errors: 0, Time elapsed: 0.017 sec
[surefire] Running org.apache.myfaces.trinidad.component.core.input.CoreInputHiddenTest
[surefire] Tests run: 9, Failures: 0, Errors: 0, Time elapsed: 0.013 sec
[surefire] Running org.apache.myfaces.trinidad.component.core.nav.CoreBreadCrumbsTest
[surefire] Tests run: 7, Failures: 0, Errors: 0, Time elapsed: 0.016 sec
[surefire] Running org.apache.myfaces.trinidad.component.core.nav.CoreTrainTest
[surefire] Tests run: 2, Failures: 0, Errors: 0, Time elapsed: 0.002 sec
[surefire] Running org.apache.myfaces.trinidad.component.core.output.CoreOutputTextTest
[surefire] Tests run: 8, Failures: 0, Errors: 0, Time elapsed: 0.011 sec
[surefire] Running org.apache.myfaces.trinidad.component.core.output.CoreSpacerTest
[surefire] Tests run: 8, Failures: 0, Errors: 0, Time elapsed: 0.05 sec
[surefire] Running org.apache.myfaces.trinidad.component.core.output.CoreSeparatorTest
[surefire] Tests run: 8, Failures: 0, Errors: 0, Time elapsed: 0.009 sec
[surefire] Running org.apache.myfaces.trinidad.component.UIXSelectOrderTest
[surefire] Tests run: 11, Failures: 0, Errors: 0, Time elapsed: 0.016 sec
[surefire] Running org.apache.myfaces.trinidad.convert.JsfDateTimeConverterTest
[surefire] Tests run: 1, Failures: 0, Errors: 0, Time elapsed: 1.912 sec
[surefire] Running org.apache.myfaces.trinidad.convert.ColorConverterTest
[surefire] Tests run: 11, Failures: 0, Errors: 0, Time elapsed: 0.155 sec
[surefire] Running org.apache.myfaces.trinidad.convert.TrinidadNumberConverterTest
[surefire] Tests run: 19, Failures: 1, Errors: 0, Time elapsed: 0.057 sec <<<<<<<<
FAILURE !! 
[surefire] Running org.apache.myfaces.trinidad.convert.TrinidadDateTimeConverterTest
[surefire] Tests run: 9, Failures: 0, Errors: 0, Time elapsed: 0.182 sec
[surefire] Running org.apache.myfaces.trinidad.convert.JsfNumberConverterTest
[surefire] Tests run: 17, Failures: 1, Errors: 0, Time elapsed: 0.02 sec <<<<<<<<
FAILURE !! 
[surefire] Running org.apache.myfaces.trinidad.resource.AggregatingResourceLoaderTest
[surefire] Tests run: 3, Failures: 0, Errors: 0, Time elapsed: 0.032 sec
[surefire] Running org.apache.myfaces.trinidad.resource.CachingResourceLoaderTest
[surefire] Tests run: 1, Failures: 0, Errors: 0, Time elapsed: 0.005 sec
[surefire] Running org.apache.myfaces.trinidad.bean.FacesBeanImplTest
[surefire] Tests run: 12, Failures: 0, Errors: 0, Time elapsed: 1.185 sec
[surefire] Running org.apache.myfaces.trinidad.bean.TypeTest
[surefire] Tests run: 6, Failures: 0, Errors: 0, Time elapsed: 0.014 sec
[surefire] Running org.apache.myfaces.trinidad.bean.PropertyKeyTest
[surefire] Tests run: 5, Failures: 0, Errors: 0, Time elapsed: 0.003 sec
[surefire] Running org.apache.myfaces.trinidad.bean.util.ValueMapTest
[surefire] Tests run: 9, Failures: 0, Errors: 0, Time elapsed: 0.009 sec
[surefire] Running org.apache.myfaces.trinidad.model.RowKeySetTreeImplTest
[surefire] Tests run: 13, Failures: 0, Errors: 0, Time elapsed: 0.16 sec
[surefire] Running org.apache.myfaces.trinidad.model.SortableModelTest
[surefire] Tests run: 9, Failures: 0, Errors: 0, Time elapsed: 0.079 sec
[surefire] Running org.apache.myfaces.trinidad.model.ChildPropertyTreeModelTest
[surefire] Tests run: 4, Failures: 0, Errors: 0, Time elapsed: 0.021 sec
[surefire] Running org.apache.myfaces.trinidad.model.RowKeySetImplTest
[surefire] Tests run: 14, Failures: 0, Errors: 0, Time elapsed: 0.048 sec
[surefire] Running org.apache.myfaces.trinidad.util.Base64OutputStreamTest
Nov 5, 2007 3:29:21 PM org.apache.myfaces.trinidad.model.RowKeySetImpl setCollectionModel
WARNING: CollectionModel was set to null
[surefire] Tests run: 5, Failures: 0, Errors: 0, Time elapsed: 0.012 sec
[surefire] Running org.apache.myfaces.trinidad.util.ArrayMapTest
[surefire] Tests run: 9, Failures: 0, Errors: 0, Time elapsed: 0.004 sec
[surefire] Running org.apache.myfaces.trinidad.util.Base64InputStreamTest
[surefire] Tests run: 3, Failures: 0, Errors: 0, Time elapsed: 0.01 sec
[surefire] Running org.apache.myfaces.trinidad.util.ListFromCollectionTest
[surefire] Tests run: 1, Failures: 0, Errors: 0, Time elapsed: 0.005 sec
[surefire] Running org.apache.myfaces.trinidad.util.ServiceTest
[surefire] Tests run: 2, Failures: 0, Errors: 0, Time elapsed: 0.007 sec
[surefire] Running org.apache.myfaces.trinidad.validator.DateRestrictionValidatorTest
[surefire] Tests run: 8, Failures: 0, Errors: 0, Time elapsed: 0.019 sec
[surefire] Running org.apache.myfaces.trinidad.validator.RegExpValidatorTest
[surefire] Tests run: 10, Failures: 0, Errors: 0, Time elapsed: 0.01 sec
[surefire] Running org.apache.myfaces.trinidad.validator.DateTimeRangeValidatorTest
[surefire] Tests run: 12, Failures: 0, Errors: 0, Time elapsed: 0.016 sec
[surefire] Running org.apache.myfaces.trinidad.validator.ByteLengthValidatorTest
[surefire] Tests run: 9, Failures: 0, Errors: 0, Time elapsed: 0.01 sec
[INFO] ------------------------------------------------------------------------
[ERROR] BUILD ERROR
[INFO] ------------------------------------------------------------------------
[INFO] There are test failures.
[INFO] ------------------------------------------------------------------------
[INFO] For more information, run Maven with the -e switch
[INFO] ------------------------------------------------------------------------
[INFO] Total time: 1 minute 6 seconds
[INFO] Finished at: Mon Nov 05 15:29:21 UTC 2007
[INFO] Final Memory: 19M/46M
[INFO] ------------------------------------------------------------------------

****************************************************************************



Mime
View raw message