myfaces-commits mailing list archives

Site index · List index
Message view « Date » · « Thread »
Top « Date » · « Thread »
From Continuum VMBuild Server <contin...@apache.org>
Subject [continuum] BUILD FAILURE: Apache Trinidad Maven JDev Plugin
Date Mon, 19 Nov 2007 10:06:51 GMT
Online report : http://vmbuild.apache.org/continuum/buildResult.action?buildId=23821&projectId=205

Build statistics:
  State: Failed
  Previous State: Ok
  Started at: Mon 19 Nov 2007 02:06:25 -0800
  Finished at: Mon 19 Nov 2007 02:06:41 -0800
  Total time: 16s
  Build Trigger: Schedule
  Build Number: 11
  Exit code: 1
  Building machine hostname: vmbuild.apache.org
  Operating system : Linux(unknown)
  Java Home version : 
          java version "1.6.0"
          Java(TM) SE Runtime Environment (build 1.6.0-b105)
          Java HotSpot(TM) Client VM (build 1.6.0-b105, mixed mode, sharing)
        
  Builder version :
          Maven version: 2.0.7
          Java version: 1.6.0
          OS name: "linux" version: "2.6.20-16-server" arch: "i386"
    
****************************************************************************
SCM Changes:
****************************************************************************
Changed: no author @ no date
Comment: no comment
Files changed:
  src/main/java/org/apache/myfaces/trinidadbuild/plugin/jdeveloper/JDeveloperMojo.java ( no
revision )
  src/main/resources/org/apache/myfaces/trinidadbuild/plugin/jdeveloper/10.1.3.0.4/project.xml
( no revision )
  src/main/resources/org/apache/myfaces/trinidadbuild/plugin/jdeveloper/10.1.3.0.4/workspace.xml
( no revision )
  src/main/resources/org/apache/myfaces/trinidadbuild/plugin/jdeveloper/11.1.1.0.0/project.xml
( no revision )
  src/main/resources/org/apache/myfaces/trinidadbuild/plugin/jdeveloper/11.1.1.0.0/workspace.xml
( no revision )

****************************************************************************
Dependencies Changes:
****************************************************************************
org.apache.myfaces.trinidadbuild:maven-plugin-parent:1.2.4-SNAPSHOT


****************************************************************************
Build Defintion:
****************************************************************************
POM filename: pom.xml
Goals: clean install source:jar deploy:deploy   
Arguments: --non-recursive --batch-mode -DaltDeploymentRepository=vmbuild.repo::default::file://localhost/home/continuum/data/repositories/myfaces
Build Fresh: false
Always Build: false
Default Build Definition: true
Schedule: DEFAULT_SCHEDULE
Description: 


****************************************************************************
Test Summary:
****************************************************************************
Tests: 0
Failures: 0
Total time: 0

****************************************************************************
Output:
****************************************************************************
[INFO] Scanning for projects...
[INFO] Searching repository for plugin with prefix: 'source'.
[INFO] ----------------------------------------------------------------------------
[INFO] Building Apache Trinidad Maven JDev Plugin
[INFO]    task-segment: [clean, install, source:jar, deploy:deploy]
[INFO] ----------------------------------------------------------------------------
[INFO] [clean:clean]
[INFO] Deleting directory /home/continuum/data/working-directory/205/target
[INFO] Deleting directory /home/continuum/data/working-directory/205/target/classes
[INFO] Deleting directory /home/continuum/data/working-directory/205/target/test-classes
[INFO] Deleting directory /home/continuum/data/working-directory/205/target/site
[INFO] [plugin:descriptor]
[INFO] Using 2 extractors.
[INFO] Applying extractor for language: java
[INFO] Extractor for language: java found 1 mojo descriptors.
[INFO] Applying extractor for language: bsh
[INFO] Extractor for language: bsh found 0 mojo descriptors.
[INFO] Setting property: classpath.resource.loader.class => 'org.codehaus.plexus.velocity.ContextClassLoaderResourceLoader'.
[INFO] Setting property: velocimacro.messages.on => 'false'.
[INFO] Setting property: resource.loader => 'classpath'.
[INFO] Setting property: resource.manager.logwhenfound => 'false'.
[INFO] [remote-resources:process {execution: default}]
[INFO] [resources:resources]
[INFO] Using default encoding to copy filtered resources.
[INFO] [compiler:compile]
[INFO] Compiling 1 source file to /home/continuum/data/working-directory/205/target/classes
[INFO] ------------------------------------------------------------------------
[ERROR] BUILD FAILURE
[INFO] ------------------------------------------------------------------------
[INFO] Compilation failure

/home/continuum/data/working-directory/205/src/main/java/org/apache/myfaces/trinidadbuild/plugin/jdeveloper/JDeveloperMojo.java:[890,4]
cannot find symbol
symbol  : class TldContentHandler
location: class org.apache.myfaces.trinidadbuild.plugin.jdeveloper.JDeveloperMojo

/home/continuum/data/working-directory/205/src/main/java/org/apache/myfaces/trinidadbuild/plugin/jdeveloper/JDeveloperMojo.java:[890,39]
cannot find symbol
symbol  : class TldContentHandler
location: class org.apache.myfaces.trinidadbuild.plugin.jdeveloper.JDeveloperMojo


[INFO] ------------------------------------------------------------------------
[INFO] For more information, run Maven with the -e switch
[INFO] ------------------------------------------------------------------------
[INFO] Total time: 8 seconds
[INFO] Finished at: Mon Nov 19 02:06:41 PST 2007
[INFO] Final Memory: 12M/23M
[INFO] ------------------------------------------------------------------------

****************************************************************************



Mime
View raw message