myfaces-commits mailing list archives

Site index · List index
Message view « Date » · « Thread »
Top « Date » · « Thread »
From "Continuum@myfaces.zones.apache.org" <comm...@myfaces.apache.org>
Subject [continuum] BUILD FAILURE: Tobago Core
Date Mon, 05 Nov 2007 22:08:11 GMT
Online report : http://myfaces.zones.apache.org:8080/continuum/buildResult.action?buildId=1645&projectId=7

Build statistics:
  State: Failed
  Previous State: Ok
  Started at: Mon 5 Nov 2007 22:05:17 +0000
  Finished at: Mon 5 Nov 2007 22:08:08 +0000
  Total time: 2m 50s
  Build Trigger: Schedule
  Build Number: 43
  Exit code: 1
  Building machine hostname: myfaces.zones.apache.org
  Operating system : SunOS(unknown)
  Java Home version : 
          java version "1.5.0_13"
          Java(TM) 2 Runtime Environment, Standard Edition (build 1.5.0_13-b05)
          Java HotSpot(TM) Server VM (build 1.5.0_13-b05, mixed mode)
        
  Builder version :
          Maven version: 2.0.7
          Java version: 1.5.0_13
          OS name: "sunos" version: "5.10" arch: "x86"
    
****************************************************************************
SCM Changes:
****************************************************************************
Changed: bommel @ Mon 5 Nov 2007 21:12:46 +0000
Comment: (TOBAGO-533) Allow non String value for tip attribute
Files changed:
  /myfaces/tobago/trunk/core/src/main/java/org/apache/myfaces/tobago/renderkit/RenderUtil.java
( 592152 )
  /myfaces/tobago/trunk/core/src/main/java/org/apache/myfaces/tobago/renderkit/html/HtmlRendererUtil.java
( 592152 )
  /myfaces/tobago/trunk/theme/scarborough/src/main/java/org/apache/myfaces/tobago/renderkit/html/scarborough/standard/tag/ButtonRenderer.java
( 592152 )
  /myfaces/tobago/trunk/theme/scarborough/src/main/java/org/apache/myfaces/tobago/renderkit/html/scarborough/standard/tag/FileRenderer.java
( 592152 )
  /myfaces/tobago/trunk/theme/scarborough/src/main/java/org/apache/myfaces/tobago/renderkit/html/scarborough/standard/tag/ImageRenderer.java
( 592152 )
  /myfaces/tobago/trunk/theme/scarborough/src/main/java/org/apache/myfaces/tobago/renderkit/html/scarborough/standard/tag/LabelRenderer.java
( 592152 )
  /myfaces/tobago/trunk/theme/scarborough/src/main/java/org/apache/myfaces/tobago/renderkit/html/scarborough/standard/tag/LinkRenderer.java
( 592152 )
  /myfaces/tobago/trunk/theme/scarborough/src/main/java/org/apache/myfaces/tobago/renderkit/html/scarborough/standard/tag/OutRenderer.java
( 592152 )
  /myfaces/tobago/trunk/theme/scarborough/src/main/java/org/apache/myfaces/tobago/renderkit/html/scarborough/standard/tag/ProgressRenderer.java
( 592152 )
  /myfaces/tobago/trunk/theme/scarborough/src/main/java/org/apache/myfaces/tobago/renderkit/html/scarborough/standard/tag/SelectBooleanCheckboxRenderer.java
( 592152 )
  /myfaces/tobago/trunk/theme/scarborough/src/main/java/org/apache/myfaces/tobago/renderkit/html/scarborough/standard/tag/SelectOneListboxRenderer.java
( 592152 )
  /myfaces/tobago/trunk/theme/scarborough/src/main/java/org/apache/myfaces/tobago/renderkit/html/scarborough/standard/tag/SelectOneRadioRenderer.java
( 592152 )
  /myfaces/tobago/trunk/theme/scarborough/src/main/java/org/apache/myfaces/tobago/renderkit/html/scarborough/standard/tag/TabGroupRenderer.java
( 592152 )
  /myfaces/tobago/trunk/theme/scarborough/src/main/java/org/apache/myfaces/tobago/renderkit/html/scarborough/standard/tag/ToolBarRenderer.java
( 592152 )
  /myfaces/tobago/trunk/theme/scarborough/src/main/java/org/apache/myfaces/tobago/renderkit/html/scarborough/standard/tag/TreeListboxBoxRenderer.java
( 592152 )

****************************************************************************
Dependencies Changes:
****************************************************************************
org.apache.myfaces.tobago:tobago-tool-annotation:1.0.13-SNAPSHOT

org.apache.myfaces.tobago:tobago-tool-apt:1.0.13-SNAPSHOT

org.apache.myfaces.tobago:tobago:1.0.13-SNAPSHOT

****************************************************************************
Test Summary:
****************************************************************************
Tests: 40
Failures: 0
Total time: 2719

****************************************************************************
Output:
****************************************************************************
[INFO] Scanning for projects...
[INFO] Searching repository for plugin with prefix: 'checkstyle'.
[INFO] ----------------------------------------------------------------------------
[INFO] Building Tobago Core
[INFO]    task-segment: [clean, deploy, checkstyle:check]
[INFO] ----------------------------------------------------------------------------
[INFO] [clean:clean]
[INFO] Deleting directory /local/continuum-1.1-beta-2/apps/continuum/webapp/WEB-INF/working-directory/7/target
[INFO] Deleting directory /local/continuum-1.1-beta-2/apps/continuum/webapp/WEB-INF/working-directory/7/target/classes
[INFO] Deleting directory /local/continuum-1.1-beta-2/apps/continuum/webapp/WEB-INF/working-directory/7/target/test-classes
[INFO] Deleting directory /local/continuum-1.1-beta-2/apps/continuum/webapp/WEB-INF/working-directory/7/target/site
[INFO] [cobertura:clean {execution: clean}]
[INFO] [scm:update {execution: getting-scm.revision}]
[INFO] Executing: svn --non-interactive update
[INFO] Working directory: /local/continuum-1.1-beta-2/apps/continuum/webapp/WEB-INF/working-directory/7
[INFO] Storing revision in 'scm.revision' project property.
[INFO] [resources:resources]
[INFO] Using default encoding to copy filtered resources.
[INFO] [compiler:compile]
[INFO] Compiling 416 source files to /local/continuum-1.1-beta-2/apps/continuum/webapp/WEB-INF/working-directory/7/target/classes
[INFO] [apt:execute {execution: tobago-tlds}]
Note: Some input files use or override a deprecated API.
Note: Recompile with -Xlint:deprecation for details.
[INFO] [apt:execute {execution: tobago-faces-config}]
[ERROR] Note: Some input files use or override a deprecated API.
Note: Recompile with -Xlint:deprecation for details.

[INFO] [resources:resources {execution: copy-faces-config}]
[INFO] Using default encoding to copy filtered resources.
[INFO] [resources:testResources]
[INFO] Using default encoding to copy filtered resources.
[INFO] [compiler:testCompile]
[INFO] Compiling 37 source files to /local/continuum-1.1-beta-2/apps/continuum/webapp/WEB-INF/working-directory/7/target/test-classes
[INFO] [surefire:test]
[INFO] Surefire report directory: /local/continuum-1.1-beta-2/apps/continuum/webapp/WEB-INF/working-directory/7/target/surefire-reports
log4j:WARN No appenders could be found for logger (org.apache.myfaces.tobago.webapp.TobagoMultipartFormdataRequest).
log4j:WARN Please initialize the log4j system properly.

-------------------------------------------------------
 T E S T S
-------------------------------------------------------
Running org.apache.myfaces.tobago.webapp.TobagoResponseWriterUnitTest
Tests run: 10, Failures: 0, Errors: 0, Skipped: 0, Time elapsed: 0.075 sec
Running org.apache.myfaces.tobago.renderkit.LabelWithAccessKeyUnitTest
Tests run: 5, Failures: 0, Errors: 0, Skipped: 0, Time elapsed: 0.075 sec
Running org.apache.myfaces.tobago.util.StringUtilUnitTest
Tests run: 1, Failures: 0, Errors: 0, Skipped: 0, Time elapsed: 0.013 sec
Running org.apache.myfaces.tobago.renderkit.html.StyleClassesUnitTest
Tests run: 7, Failures: 0, Errors: 0, Skipped: 0, Time elapsed: 0.035 sec
Running org.apache.myfaces.tobago.taglib.component.GenericComponentTagUnitTest
Tests run: 3, Failures: 0, Errors: 0, Skipped: 0, Time elapsed: 2.27 sec
Running org.apache.myfaces.tobago.util.LayoutInfoUnitTest
Tests run: 1, Failures: 0, Errors: 0, Skipped: 0, Time elapsed: 0.014 sec
Running org.apache.myfaces.tobago.util.RangeParserUnitTest
Tests run: 1, Failures: 0, Errors: 0, Skipped: 0, Time elapsed: 0.005 sec
Running org.apache.myfaces.tobago.taglib.component.GenericTagUnitTest
Tests run: 2, Failures: 0, Errors: 0, Skipped: 0, Time elapsed: 0.247 sec
Running org.apache.myfaces.tobago.component.UITreeUnitTest
Tests run: 1, Failures: 0, Errors: 0, Skipped: 0, Time elapsed: 0.003 sec
Running org.apache.myfaces.tobago.webapp.TobagoMultipartFormdataRequestUnitTest
Tests run: 5, Failures: 0, Errors: 0, Skipped: 0, Time elapsed: 0.006 sec
Running org.apache.myfaces.tobago.util.HtmlWriterUtilUnitTest
Tests run: 1, Failures: 0, Errors: 0, Skipped: 0, Time elapsed: 0.004 sec
Running org.apache.myfaces.tobago.convert.DurationConverterUnitTest
Tests run: 2, Failures: 0, Errors: 0, Skipped: 0, Time elapsed: 0.016 sec
Running org.apache.myfaces.tobago.component.UIDataUnitTest
Tests run: 1, Failures: 0, Errors: 0, Skipped: 0, Time elapsed: 0.019 sec

Results :

Tests run: 40, Failures: 0, Errors: 0, Skipped: 0

[INFO] [jar:jar]
[INFO] Building jar: /local/continuum-1.1-beta-2/apps/continuum/webapp/WEB-INF/working-directory/7/target/tobago-core-1.0.13-SNAPSHOT.jar
[INFO] Preparing javadoc:jar
[INFO] ----------------------------------------------------------------------------
[INFO] Building Tobago Core
[INFO] ----------------------------------------------------------------------------
[WARNING] Removing: jar from forked lifecycle, to prevent recursive invocation.
[INFO] [scm:update {execution: getting-scm.revision}]
[INFO] Executing: svn --non-interactive update
[INFO] Working directory: /local/continuum-1.1-beta-2/apps/continuum/webapp/WEB-INF/working-directory/7
[INFO] Storing revision in 'scm.revision' project property.
[INFO] [javadoc:jar {execution: attach-javadoc}]
[ERROR] Error fetching link: http://www.junit.org/junit/javadoc/package-list. IGNORED IT.
[INFO] Building jar: /local/continuum-1.1-beta-2/apps/continuum/webapp/WEB-INF/working-directory/7/target/tobago-core-1.0.13-SNAPSHOT-javadoc.jar
[INFO] Preparing taglib:taglibdocjar
[INFO] Setting property: classpath.resource.loader.class => 'org.codehaus.plexus.velocity.ContextClassLoaderResourceLoader'.
[INFO] Setting property: velocimacro.messages.on => 'false'.
[INFO] Setting property: resource.loader => 'classpath'.
[INFO] Setting property: resource.manager.logwhenfound => 'false'.
[INFO] ************************************************************** 
[INFO] Starting Jakarta Velocity v1.4
[INFO] RuntimeInstance initializing.
[INFO] Default Properties File: org/apache/velocity/runtime/defaults/velocity.properties
[INFO] Default ResourceManager initializing. (class org.apache.velocity.runtime.resource.ResourceManagerImpl)
[INFO] Resource Loader Instantiated: org.codehaus.plexus.velocity.ContextClassLoaderResourceLoader
[INFO] ClasspathResourceLoader : initialization starting.
[INFO] ClasspathResourceLoader : initialization complete.
[INFO] ResourceCache : initialized. (class org.apache.velocity.runtime.resource.ResourceCacheImpl)
[INFO] Default ResourceManager initialization complete.
[INFO] Loaded System Directive: org.apache.velocity.runtime.directive.Literal
[INFO] Loaded System Directive: org.apache.velocity.runtime.directive.Macro
[INFO] Loaded System Directive: org.apache.velocity.runtime.directive.Parse
[INFO] Loaded System Directive: org.apache.velocity.runtime.directive.Include
[INFO] Loaded System Directive: org.apache.velocity.runtime.directive.Foreach
[INFO] Created: 20 parsers.
[INFO] Velocimacro : initialization starting.
[INFO] Velocimacro : adding VMs from VM library template : VM_global_library.vm
[ERROR] ResourceManager : unable to find resource 'VM_global_library.vm' in any resource loader.
[INFO] Velocimacro : error using  VM library template VM_global_library.vm : org.apache.velocity.exception.ResourceNotFoundException:
Unable to find resource 'VM_global_library.vm'
[INFO] Velocimacro :  VM library template macro registration complete.
[INFO] Velocimacro : allowInline = true : VMs can be defined inline in templates
[INFO] Velocimacro : allowInlineToOverride = false : VMs defined inline may NOT replace previous
VM definitions
[INFO] Velocimacro : allowInlineLocal = false : VMs defined inline will be  global in scope
if allowed.
[INFO] Velocimacro : initialization complete.
[INFO] Velocity successfully started.
[INFO] [taglib:taglibdoc]
[INFO] [taglib:taglibdocjar {execution: attach-tlddoc}]
[INFO] Building jar: /local/continuum-1.1-beta-2/apps/continuum/webapp/WEB-INF/working-directory/7/target/tobago-core-1.0.13-SNAPSHOT-tlddoc.jar
[INFO] Preparing source:jar
[WARNING] Removing: jar from forked lifecycle, to prevent recursive invocation.
[WARNING] Removing: taglibdocjar from forked lifecycle, to prevent recursive invocation.
[WARNING] Removing: jar from forked lifecycle, to prevent recursive invocation.
[INFO] [scm:update {execution: getting-scm.revision}]
[INFO] Executing: svn --non-interactive update
[INFO] Working directory: /local/continuum-1.1-beta-2/apps/continuum/webapp/WEB-INF/working-directory/7
[INFO] Storing revision in 'scm.revision' project property.
[INFO] [source:jar {execution: attach-source}]
[INFO] Building jar: /local/continuum-1.1-beta-2/apps/continuum/webapp/WEB-INF/working-directory/7/target/tobago-core-1.0.13-SNAPSHOT-sources.jar
[INFO] [retrotranslator:translate-project {execution: default}]
[INFO] Transforming 447 file(s) from /local/continuum-1.1-beta-2/apps/continuum/webapp/WEB-INF/working-directory/7/target/tobago-core-1.0.13-SNAPSHOT.jar
to /local/continuum-1.1-beta-2/apps/continuum/webapp/WEB-INF/working-directory/7/target/tobago-core-1.0.13-SNAPSHOT-jdk14retro.jar.
[INFO] Transformation of 447 file(s) completed successfully.
[INFO] Verifying 447 file(s) in /local/continuum-1.1-beta-2/apps/continuum/webapp/WEB-INF/working-directory/7/target/tobago-core-1.0.13-SNAPSHOT-jdk14retro.jar.
[INFO] Verification of 447 file(s) completed successfully.
[INFO] [install:install]
[INFO] Installing /local/continuum-1.1-beta-2/apps/continuum/webapp/WEB-INF/working-directory/7/target/tobago-core-1.0.13-SNAPSHOT.jar
to /export/home/mrmaven/.m2/repository/org/apache/myfaces/tobago/tobago-core/1.0.13-SNAPSHOT/tobago-core-1.0.13-SNAPSHOT.jar
[INFO] Installing /local/continuum-1.1-beta-2/apps/continuum/webapp/WEB-INF/working-directory/7/target/tobago-core-1.0.13-SNAPSHOT-javadoc.jar
to /export/home/mrmaven/.m2/repository/org/apache/myfaces/tobago/tobago-core/1.0.13-SNAPSHOT/tobago-core-1.0.13-SNAPSHOT-javadoc.jar
[INFO] Installing /local/continuum-1.1-beta-2/apps/continuum/webapp/WEB-INF/working-directory/7/target/tobago-core-1.0.13-SNAPSHOT-tlddoc.jar
to /export/home/mrmaven/.m2/repository/org/apache/myfaces/tobago/tobago-core/1.0.13-SNAPSHOT/tobago-core-1.0.13-SNAPSHOT-tlddoc.jar
[INFO] Installing /local/continuum-1.1-beta-2/apps/continuum/webapp/WEB-INF/working-directory/7/target/tobago-core-1.0.13-SNAPSHOT-sources.jar
to /export/home/mrmaven/.m2/repository/org/apache/myfaces/tobago/tobago-core/1.0.13-SNAPSHOT/tobago-core-1.0.13-SNAPSHOT-sources.jar
[INFO] Installing /local/continuum-1.1-beta-2/apps/continuum/webapp/WEB-INF/working-directory/7/target/tobago-core-1.0.13-SNAPSHOT-jdk14retro.jar
to /export/home/mrmaven/.m2/repository/org/apache/myfaces/tobago/tobago-core/1.0.13-SNAPSHOT/tobago-core-1.0.13-SNAPSHOT-jdk14retro.jar
[INFO] [deploy:deploy]
altDeploymentRepository = null
[INFO] Retrieving previous build number from apache-maven-snapshots
Uploading: scpexe://minotaur.apache.org/www/people.apache.org/repo/m2-snapshot-repository/org/apache/myfaces/tobago/tobago-core/1.0.13-SNAPSHOT/tobago-core-1.0.13-SNAPSHOT.jar
[INFO] Retrieving previous metadata from apache-maven-snapshots
[INFO] Uploading repository metadata for: 'artifact org.apache.myfaces.tobago:tobago-core'
[INFO] Retrieving previous metadata from apache-maven-snapshots
[INFO] Uploading project information for tobago-core 1.0.13-SNAPSHOT
[INFO] Retrieving previous metadata from apache-maven-snapshots
[INFO] Uploading repository metadata for: 'snapshot org.apache.myfaces.tobago:tobago-core:1.0.13-SNAPSHOT'
[INFO] Retrieving previous build number from apache-maven-snapshots
Uploading: scpexe://minotaur.apache.org/www/people.apache.org/repo/m2-snapshot-repository/org/apache/myfaces/tobago/tobago-core/1.0.13-SNAPSHOT/tobago-core-1.0.13-SNAPSHOT-javadoc.jar
[INFO] Retrieving previous build number from apache-maven-snapshots
Uploading: scpexe://minotaur.apache.org/www/people.apache.org/repo/m2-snapshot-repository/org/apache/myfaces/tobago/tobago-core/1.0.13-SNAPSHOT/tobago-core-1.0.13-SNAPSHOT-tlddoc.jar
[INFO] Retrieving previous build number from apache-maven-snapshots
Uploading: scpexe://minotaur.apache.org/www/people.apache.org/repo/m2-snapshot-repository/org/apache/myfaces/tobago/tobago-core/1.0.13-SNAPSHOT/tobago-core-1.0.13-SNAPSHOT-sources.jar
[INFO] Retrieving previous build number from apache-maven-snapshots
Uploading: scpexe://minotaur.apache.org/www/people.apache.org/repo/m2-snapshot-repository/org/apache/myfaces/tobago/tobago-core/1.0.13-SNAPSHOT/tobago-core-1.0.13-SNAPSHOT-jdk14retro.jar
[INFO] Preparing checkstyle:check
[INFO] Setting property: classpath.resource.loader.class => 'org.codehaus.plexus.velocity.ContextClassLoaderResourceLoader'.
[INFO] Setting property: velocimacro.messages.on => 'false'.
[INFO] Setting property: resource.loader => 'classpath'.
[INFO] Setting property: resource.manager.logwhenfound => 'false'.
[INFO] ************************************************************** 
[INFO] Starting Jakarta Velocity v1.4
[INFO] RuntimeInstance initializing.
[INFO] Default Properties File: org/apache/velocity/runtime/defaults/velocity.properties
[INFO] Default ResourceManager initializing. (class org.apache.velocity.runtime.resource.ResourceManagerImpl)
[INFO] Resource Loader Instantiated: org.codehaus.plexus.velocity.ContextClassLoaderResourceLoader
[INFO] ClasspathResourceLoader : initialization starting.
[INFO] ClasspathResourceLoader : initialization complete.
[INFO] ResourceCache : initialized. (class org.apache.velocity.runtime.resource.ResourceCacheImpl)
[INFO] Default ResourceManager initialization complete.
[INFO] Loaded System Directive: org.apache.velocity.runtime.directive.Literal
[INFO] Loaded System Directive: org.apache.velocity.runtime.directive.Macro
[INFO] Loaded System Directive: org.apache.velocity.runtime.directive.Parse
[INFO] Loaded System Directive: org.apache.velocity.runtime.directive.Include
[INFO] Loaded System Directive: org.apache.velocity.runtime.directive.Foreach
[INFO] Created: 20 parsers.
[INFO] Velocimacro : initialization starting.
[INFO] Velocimacro : adding VMs from VM library template : VM_global_library.vm
[ERROR] ResourceManager : unable to find resource 'VM_global_library.vm' in any resource loader.
[INFO] Velocimacro : error using  VM library template VM_global_library.vm : org.apache.velocity.exception.ResourceNotFoundException:
Unable to find resource 'VM_global_library.vm'
[INFO] Velocimacro :  VM library template macro registration complete.
[INFO] Velocimacro : allowInline = true : VMs can be defined inline in templates
[INFO] Velocimacro : allowInlineToOverride = false : VMs defined inline may NOT replace previous
VM definitions
[INFO] Velocimacro : allowInlineLocal = false : VMs defined inline will be  global in scope
if allowed.
[INFO] Velocimacro : initialization complete.
[INFO] Velocity successfully started.
[INFO] [checkstyle:checkstyle]
[INFO] There are 1 checkstyle errors.
[INFO] [checkstyle:check]
[INFO] ------------------------------------------------------------------------
[ERROR] BUILD FAILURE
[INFO] ------------------------------------------------------------------------
[INFO] You have 1 checkstyle violation.
[INFO] ------------------------------------------------------------------------
[INFO] For more information, run Maven with the -e switch
[INFO] ------------------------------------------------------------------------
[INFO] Total time: 2 minutes 48 seconds
[INFO] Finished at: Mon Nov 05 22:08:07 GMT+00:00 2007
[INFO] Final Memory: 29M/85M
[INFO] ------------------------------------------------------------------------

****************************************************************************



Mime
View raw message