myfaces-commits mailing list archives

Site index · List index
Message view « Date » · « Thread »
Top « Date » · « Thread »
From "Continuum@myfaces.zones.apache.org" <notificati...@myfaces.apache.org>
Subject [continuum] BUILD FAILURE: Apache MyFaces Shared For JSF 1.2 - Project
Date Tue, 11 Mar 2008 10:01:07 GMT
Online report : http://myfaces.zones.apache.org:8080/continuum/buildResult.action?buildId=7364&projectId=47

Build statistics:
  State: Failed
  Previous State: Ok
  Started at: Tue 11 Mar 2008 10:00:20 +0000
  Finished at: Tue 11 Mar 2008 10:01:05 +0000
  Total time: 45s
  Build Trigger: Schedule
  Build Number: 19
  Exit code: 1
  Building machine hostname: myfaces.zones.apache.org
  Operating system : SunOS(unknown)
  Java Home version : 
          java version "1.5.0_15"
          Java(TM) 2 Runtime Environment, Standard Edition (build 1.5.0_15-b04)
          Java HotSpot(TM) Server VM (build 1.5.0_15-b04, mixed mode)
        
  Builder version :
          Maven version: 2.0.8
          Java version: 1.5.0_15
          OS name: "sunos" version: "5.10" arch: "x86" Family: "unix"
    
****************************************************************************
SCM Changes:
****************************************************************************
Changed: tomsp @ Tue 11 Mar 2008 09:11:48 +0000
Comment: MYFACES-1827: fixed thanks to Veit Guna
Files changed:
  /myfaces/shared/trunk_3.0.x/core/src/main/java/org/apache/myfaces/shared/util/MessageUtils.java
( 635856 )
  /myfaces/shared/trunk_3.0.x/core/src/test/java/org/apache/myfaces/shared/util/MessageUtilsTest.java
( 635856 )

****************************************************************************
Dependencies Changes:
****************************************************************************
No dependencies changed

****************************************************************************
Output:
****************************************************************************
[INFO] Scanning for projects...
[INFO] Reactor build order: 
[INFO]   Apache MyFaces Shared For JSF 1.2 - Project
[INFO]   Apache MyFaces Shared For JSF 1.2 - Core
[INFO]   MyFaces Shared Impl
[INFO]   MyFaces Shared Tomahawk
[INFO] ------------------------------------------------------------------------
[INFO] Building Apache MyFaces Shared For JSF 1.2 - Project
[INFO]    task-segment: [clean, deploy]
[INFO] ------------------------------------------------------------------------
[INFO] [clean:clean]
[INFO] [site:attach-descriptor]
[INFO] Unable to load parent project from a relative path: Could not find the model file '/local/continuum-1.1-beta-2/working-directory/47/../pom.xml'.
for project unknown
[INFO] Parent project loaded from repository.
[INFO] [install:install]
[INFO] Installing /local/continuum-1.1-beta-2/working-directory/47/pom.xml to /export/home/mrmaven/.m2/repository/org/apache/myfaces/shared/myfaces-shared-project/3.0.3-SNAPSHOT/myfaces-shared-project-3.0.3-SNAPSHOT.pom
[INFO] [deploy:deploy]
altDeploymentRepository = null
[INFO] Retrieving previous build number from apache-maven-snapshots
Uploading: scpexe://people.apache.org/www/people.apache.org/repo/m2-snapshot-repository/org/apache/myfaces/shared/myfaces-shared-project/3.0.3-SNAPSHOT/myfaces-shared-project-3.0.3-SNAPSHOT.pom
[INFO] Retrieving previous metadata from apache-maven-snapshots
[INFO] Uploading repository metadata for: 'snapshot org.apache.myfaces.shared:myfaces-shared-project:3.0.3-SNAPSHOT'
[INFO] Retrieving previous metadata from apache-maven-snapshots
[INFO] Uploading repository metadata for: 'artifact org.apache.myfaces.shared:myfaces-shared-project'
[INFO] Retrieving previous metadata from apache-maven-snapshots
[INFO] Uploading site descriptor for myfaces-shared-project 3.0.3-SNAPSHOT site.xml
[INFO] ------------------------------------------------------------------------
[INFO] Building Apache MyFaces Shared For JSF 1.2 - Core
[INFO]    task-segment: [clean, deploy]
[INFO] ------------------------------------------------------------------------
[INFO] [clean:clean]
[INFO] Deleting directory /local/continuum-1.1-beta-2/working-directory/47/core/target
[INFO] [resources:resources]
[INFO] Using default encoding to copy filtered resources.
[INFO] [compiler:compile]
[INFO] Compiling 125 source files to /local/continuum-1.1-beta-2/working-directory/47/core/target/classes
[INFO] [resources:testResources]
[INFO] Using default encoding to copy filtered resources.
[INFO] [compiler:testCompile]
[INFO] Compiling 12 source files to /local/continuum-1.1-beta-2/working-directory/47/core/target/test-classes
[INFO] [surefire:test]
[INFO] Setting reports dir: /local/continuum-1.1-beta-2/working-directory/47/core/target/surefire-reports

-------------------------------------------------------
 T E S T S
-------------------------------------------------------
currency 100.00
[surefire] Running org.apache.myfaces.shared.util.MessageUtilsTest
[surefire] Tests run: 11, Failures: 2, Errors: 0, Time elapsed: 0.45 sec <<<<<<<<
FAILURE !! 
[surefire] Running org.apache.myfaces.shared.util.StateUtilsBlowfish_ECBTest
[surefire] Tests run: 11, Failures: 0, Errors: 0, Time elapsed: 0.425 sec
[surefire] Running org.apache.myfaces.shared.util.InitVector_CBCTestCase
[surefire] Tests run: 2, Failures: 0, Errors: 0, Time elapsed: 0.003 sec
[surefire] Running org.apache.myfaces.shared.util.StateUtilsTripleDES_ECBTest
[surefire] Tests run: 11, Failures: 0, Errors: 0, Time elapsed: 0.055 sec
[surefire] Running org.apache.myfaces.shared.util.SecretKeyConfigurationTest
[surefire] Tests run: 4, Failures: 0, Errors: 0, Time elapsed: 0.004 sec
[surefire] Running org.apache.myfaces.shared.util.StateUtilsDefaultTest
[surefire] Tests run: 11, Failures: 0, Errors: 0, Time elapsed: 0.016 sec
[surefire] Running org.apache.myfaces.shared.util.SecretKeyCacheTest
[surefire] Tests run: 2, Failures: 0, Errors: 0, Time elapsed: 0.002 sec
[surefire] Running org.apache.myfaces.shared.renderkit.html.util.HTMLEncoderTest
[surefire] Tests run: 20, Failures: 0, Errors: 0, Time elapsed: 0.016 sec
[surefire] Running org.apache.myfaces.shared.taglib.UIComponentTagUtilsTest
[surefire] Tests run: 1, Failures: 0, Errors: 0, Time elapsed: 0.044 sec
[surefire] Running org.apache.myfaces.shared.webapp.webxml.ServletMappingTest
[surefire] Tests run: 2, Failures: 0, Errors: 0, Time elapsed: 0.004 sec

Results :
[surefire] Tests run: 75, Failures: 2, Errors: 0

[INFO] ------------------------------------------------------------------------
[ERROR] BUILD ERROR
[INFO] ------------------------------------------------------------------------
[INFO] There are some test failure.
[INFO] ------------------------------------------------------------------------
[INFO] For more information, run Maven with the -e switch
[INFO] ------------------------------------------------------------------------
[INFO] Total time: 43 seconds
[INFO] Finished at: Tue Mar 11 10:01:04 GMT+00:00 2008
[INFO] Final Memory: 14M/66M
[INFO] ------------------------------------------------------------------------

****************************************************************************



Mime
View raw message