myfaces-commits mailing list archives

Site index · List index
Message view « Date » · « Thread »
Top « Date » · « Thread »
From "Continuum@myfaces.zones.apache.org" <notificati...@myfaces.apache.org>
Subject [continuum] BUILD FAILURE: Apache MyFaces Shared For JSF 1.1 - Project
Date Tue, 11 Mar 2008 00:01:19 GMT
Online report : http://myfaces.zones.apache.org:8080/continuum/buildResult.action?buildId=7360&projectId=42

Build statistics:
  State: Failed
  Previous State: Ok
  Started at: Tue 11 Mar 2008 00:00:30 +0000
  Finished at: Tue 11 Mar 2008 00:01:15 +0000
  Total time: 44s
  Build Trigger: Schedule
  Build Number: 19
  Exit code: 1
  Building machine hostname: myfaces.zones.apache.org
  Operating system : SunOS(unknown)
  Java Home version : 
          java version "1.5.0_15"
          Java(TM) 2 Runtime Environment, Standard Edition (build 1.5.0_15-b04)
          Java HotSpot(TM) Server VM (build 1.5.0_15-b04, mixed mode)
        
  Builder version :
          Maven version: 2.0.8
          Java version: 1.5.0_15
          OS name: "sunos" version: "5.10" arch: "x86" Family: "unix"
    
****************************************************************************
SCM Changes:
****************************************************************************
Changed: tomsp @ Mon 10 Mar 2008 23:05:57 +0000
Comment: MYFACES-1827: fixed, thanks to Veit Guna
Files changed:
  /myfaces/shared/trunk/core/src/main/java/org/apache/myfaces/shared/util/MessageUtils.java
( 635748 )
  /myfaces/shared/trunk/core/src/test/java/org/apache/myfaces/shared/util/MessageUtilsTest.java
( 635748 )

****************************************************************************
Dependencies Changes:
****************************************************************************
No dependencies changed

****************************************************************************
Test Summary:
****************************************************************************
Tests: 0
Failures: 0
Total time: 0

****************************************************************************
Output:
****************************************************************************
[INFO] Scanning for projects...
[INFO] Reactor build order: 
[INFO]   Apache MyFaces Shared For JSF 1.1 - Project
[INFO]   Apache MyFaces Shared For JSF 1.1 - Core
[INFO]   Apache MyFaces Shared - Impl
[INFO]   Apache MyFaces Shared - Tomahawk
[INFO]   Apache MyFaces Shared - Orchestra
[INFO] ------------------------------------------------------------------------
[INFO] Building Apache MyFaces Shared For JSF 1.1 - Project
[INFO]    task-segment: [clean, deploy]
[INFO] ------------------------------------------------------------------------
[INFO] [clean:clean]
[INFO] [site:attach-descriptor]
[INFO] Unable to load parent project from a relative path: Could not find the model file '/local/continuum-1.1-beta-2/working-directory/42/../pom.xml'.
for project unknown
[INFO] Parent project loaded from repository.
[INFO] [install:install]
[INFO] Installing /local/continuum-1.1-beta-2/working-directory/42/pom.xml to /export/home/mrmaven/.m2/repository/org/apache/myfaces/shared/myfaces-shared-project/2.0.8-SNAPSHOT/myfaces-shared-project-2.0.8-SNAPSHOT.pom
[INFO] [deploy:deploy]
altDeploymentRepository = null
[INFO] Retrieving previous build number from apache-maven-snapshots
Uploading: scpexe://people.apache.org/www/people.apache.org/repo/m2-snapshot-repository/org/apache/myfaces/shared/myfaces-shared-project/2.0.8-SNAPSHOT/myfaces-shared-project-2.0.8-SNAPSHOT.pom
[INFO] Retrieving previous metadata from apache-maven-snapshots
[INFO] Uploading repository metadata for: 'snapshot org.apache.myfaces.shared:myfaces-shared-project:2.0.8-SNAPSHOT'
[INFO] Retrieving previous metadata from apache-maven-snapshots
[INFO] Uploading repository metadata for: 'artifact org.apache.myfaces.shared:myfaces-shared-project'
[INFO] Retrieving previous metadata from apache-maven-snapshots
[INFO] Uploading site descriptor for myfaces-shared-project 2.0.8-SNAPSHOT site.xml
[INFO] ------------------------------------------------------------------------
[INFO] Building Apache MyFaces Shared For JSF 1.1 - Core
[INFO]    task-segment: [clean, deploy]
[INFO] ------------------------------------------------------------------------
[INFO] [clean:clean]
[INFO] Deleting directory /local/continuum-1.1-beta-2/working-directory/42/core/target
[INFO] [resources:resources]
[INFO] Using default encoding to copy filtered resources.
[INFO] [compiler:compile]
Compiling 95 source files to /local/continuum-1.1-beta-2/working-directory/42/core/target/classes
[INFO] [resources:testResources]
[INFO] Using default encoding to copy filtered resources.
[INFO] [compiler:testCompile]
Compiling 16 source files to /local/continuum-1.1-beta-2/working-directory/42/core/target/test-classes
[INFO] ------------------------------------------------------------------------
[ERROR] BUILD FAILURE
[INFO] ------------------------------------------------------------------------
[INFO] Compilation failure

/local/continuum-1.1-beta-2/working-directory/42/core/src/test/java/org/apache/myfaces/shared/util/MessageUtilsTest.java:[202,120]
incompatible types
found   : int
required: java.lang.Object

/local/continuum-1.1-beta-2/working-directory/42/core/src/test/java/org/apache/myfaces/shared/util/MessageUtilsTest.java:[211,115]
incompatible types
found   : int
required: java.lang.Object


[INFO] ------------------------------------------------------------------------
[INFO] For more information, run Maven with the -e switch
[INFO] ------------------------------------------------------------------------
[INFO] Total time: 42 seconds
[INFO] Finished at: Tue Mar 11 00:01:14 GMT+00:00 2008
[INFO] Final Memory: 13M/70M
[INFO] ------------------------------------------------------------------------

****************************************************************************



Mime
View raw message