myfaces-commits mailing list archives

Site index · List index
Message view « Date » · « Thread »
Top « Date » · « Thread »
From "Continuum@myfaces.zones.apache.org" <notificati...@myfaces.apache.org>
Subject [continuum] BUILD FAILURE: Apache MyFaces Commons
Date Fri, 09 Oct 2009 10:10:09 GMT
Online report : http://myfaces.zones.apache.org:8080/continuum/buildResult.action?buildId=24528&projectId=71

Build statistics:
  State: Failed
  Previous State: Error
  Started at: Fri 9 Oct 2009 10:00:53 +0000
  Finished at: Fri 9 Oct 2009 10:10:00 +0000
  Total time: 9m 7s
  Build Trigger: Schedule
  Build Number: 44
  Exit code: 1
  Building machine hostname: myfaces.zones.apache.org
  Operating system : SunOS(unknown)
  Java Home version : 
          java version "1.5.0_21"
          Java(TM) 2 Runtime Environment, Standard Edition (build 1.5.0_21-b01)
          Java HotSpot(TM) Server VM (build 1.5.0_21-b01, mixed mode)
        
  Builder version :
          Maven version: 2.0.10
          Java version: 1.5.0_21
          OS name: "sunos" version: "5.10" arch: "x86" Family: "unix"
    
****************************************************************************
SCM Changes:
****************************************************************************
Changed: ckormos @ Wed 30 Sep 2009 18:54:21 +0000
Comment: applied patch for [MFCOMMONS-11] - New agent detection module (Thanks to Marius Petoi)
Files changed:
  /myfaces/commons/trunk/myfaces-commons-agent ( 820386 )
  /myfaces/commons/trunk/myfaces-commons-agent/pom.xml ( 820386 )
  /myfaces/commons/trunk/myfaces-commons-agent/src ( 820386 )
  /myfaces/commons/trunk/myfaces-commons-agent/src/main ( 820386 )
  /myfaces/commons/trunk/myfaces-commons-agent/src/main/java ( 820386 )
  /myfaces/commons/trunk/myfaces-commons-agent/src/main/java/org ( 820386 )
  /myfaces/commons/trunk/myfaces-commons-agent/src/main/java/org/apache ( 820386 )
  /myfaces/commons/trunk/myfaces-commons-agent/src/main/java/org/apache/myfaces ( 820386 )
  /myfaces/commons/trunk/myfaces-commons-agent/src/main/java/org/apache/myfaces/commons ( 820386 )
  /myfaces/commons/trunk/myfaces-commons-agent/src/main/java/org/apache/myfaces/commons/agent ( 820386 )
  /myfaces/commons/trunk/myfaces-commons-agent/src/main/java/org/apache/myfaces/commons/agent/Agent.java ( 820386 )
  /myfaces/commons/trunk/myfaces-commons-agent/src/main/java/org/apache/myfaces/commons/agent/AgentConstants.java ( 820386 )
  /myfaces/commons/trunk/myfaces-commons-agent/src/main/java/org/apache/myfaces/commons/agent/AgentFactory.java ( 820386 )
  /myfaces/commons/trunk/myfaces-commons-agent/src/main/java/org/apache/myfaces/commons/agent/CapabilityConstants.java ( 820386 )
  /myfaces/commons/trunk/myfaces-commons-agent/src/main/java/org/apache/myfaces/commons/agent/CapabilityKey.java ( 820386 )
  /myfaces/commons/trunk/myfaces-commons-agent/src/main/java/org/apache/myfaces/commons/agent/CapabilityMap.java ( 820386 )
  /myfaces/commons/trunk/myfaces-commons-agent/src/main/java/org/apache/myfaces/commons/agent/CapabilityValue.java ( 820386 )
  /myfaces/commons/trunk/myfaces-commons-agent/src/main/java/org/apache/myfaces/commons/agent/XhtmlAgentConstants.java ( 820386 )
  /myfaces/commons/trunk/myfaces-commons-agent/src/main/java/org/apache/myfaces/commons/agent/impl ( 820386 )
  /myfaces/commons/trunk/myfaces-commons-agent/src/main/java/org/apache/myfaces/commons/agent/impl/AgentFactoryImpl.java ( 820386 )
  /myfaces/commons/trunk/myfaces-commons-agent/src/main/java/org/apache/myfaces/commons/agent/impl/AgentImpl.java ( 820386 )
  /myfaces/commons/trunk/pom.xml ( 820386 )

****************************************************************************
Dependencies Changes:
****************************************************************************
No dependencies changed

****************************************************************************
Test Summary:
****************************************************************************
Tests: 31
Failures: 0
Total time: 2453

****************************************************************************
Output:
****************************************************************************
[INFO] Scanning for projects...
[INFO] Reactor build order: 
[INFO]   Apache MyFaces Commons
[INFO]   Apache MyFaces Commons Utils
[INFO]   Apache MyFaces Commons Validators
[INFO]   Apache MyFaces Commons Converters
[INFO]   Apache MyFaces Commons Components
[INFO]   Apache MyFaces Commons Examples
[INFO]   Apache MyFaces Commons Facelets Examples
[INFO]   Apache MyFaces Commons Agent Detection
[INFO]   Apache MyFaces Common Async Lifecycle
[INFO]   Apache MyFaces Commons Site
[INFO]   Apache MyFaces Common Jetty Continuation Lifecycle
[INFO]   Async Example Webapp
[INFO]   Apache MyFaces Common Weblogic Async Lifecycle
[INFO] Searching repository for plugin with prefix: 'source'.
[INFO] ------------------------------------------------------------------------
[INFO] Building Apache MyFaces Commons
[INFO]    task-segment: [clean, install, source:jar, deploy]
[INFO] ------------------------------------------------------------------------
[INFO] [clean:clean]
[INFO] Deleting directory /local/continuum-1.1-beta-2/working-directory/71/target
[INFO] Preparing checkstyle:check
[INFO] Setting property: classpath.resource.loader.class => 'org.codehaus.plexus.velocity.ContextClassLoaderResourceLoader'.
[INFO] Setting property: velocimacro.messages.on => 'false'.
[INFO] Setting property: resource.loader => 'classpath'.
[INFO] Setting property: resource.manager.logwhenfound => 'false'.
[INFO] ************************************************************** 
[INFO] Starting Jakarta Velocity v1.4
[INFO] RuntimeInstance initializing.
[INFO] Default Properties File: org/apache/velocity/runtime/defaults/velocity.properties
[INFO] Default ResourceManager initializing. (class org.apache.velocity.runtime.resource.ResourceManagerImpl)
[INFO] Resource Loader Instantiated: org.codehaus.plexus.velocity.ContextClassLoaderResourceLoader
[INFO] ClasspathResourceLoader : initialization starting.
[INFO] ClasspathResourceLoader : initialization complete.
[INFO] ResourceCache : initialized. (class org.apache.velocity.runtime.resource.ResourceCacheImpl)
[INFO] Default ResourceManager initialization complete.
[INFO] Loaded System Directive: org.apache.velocity.runtime.directive.Literal
[INFO] Loaded System Directive: org.apache.velocity.runtime.directive.Macro
[INFO] Loaded System Directive: org.apache.velocity.runtime.directive.Parse
[INFO] Loaded System Directive: org.apache.velocity.runtime.directive.Include
[INFO] Loaded System Directive: org.apache.velocity.runtime.directive.Foreach
[INFO] Created: 20 parsers.
[INFO] Velocimacro : initialization starting.
[INFO] Velocimacro : adding VMs from VM library template : VM_global_library.vm
[ERROR] ResourceManager : unable to find resource 'VM_global_library.vm' in any resource loader.
[INFO] Velocimacro : error using  VM library template VM_global_library.vm : org.apache.velocity.exception.ResourceNotFoundException: Unable to find resource 'VM_global_library.vm'
[INFO] Velocimacro :  VM library template macro registration complete.
[INFO] Velocimacro : allowInline = true : VMs can be defined inline in templates
[INFO] Velocimacro : allowInlineToOverride = false : VMs defined inline may NOT replace previous VM definitions
[INFO] Velocimacro : allowInlineLocal = false : VMs defined inline will be  global in scope if allowed.
[INFO] Velocimacro : initialization complete.
[INFO] Velocity successfully started.
[INFO] [checkstyle:checkstyle]
[INFO] Source directory does not exist - skipping report.
[INFO] [checkstyle:check {execution: verify-style}]
[INFO] Unable to perform checkstyle:check, unable to find checkstyle:checkstyle outputFile.
[INFO] Setting property: classpath.resource.loader.class => 'org.codehaus.plexus.velocity.ContextClassLoaderResourceLoader'.
[INFO] Setting property: velocimacro.messages.on => 'false'.
[INFO] Setting property: resource.loader => 'classpath'.
[INFO] Setting property: resource.manager.logwhenfound => 'false'.
[INFO] [remote-resources:process {execution: default}]
[INFO] [site:attach-descriptor]
[INFO] Unable to load parent project from a relative path: Could not find the model file '/local/continuum-1.1-beta-2/working-directory/71/../pom.xml'. for project unknown
[INFO] Parent project loaded from repository.
[INFO] [install:install]
[INFO] Installing /local/continuum-1.1-beta-2/working-directory/71/pom.xml to /export/home/mrmaven/.m2/repository/org/apache/myfaces/commons/commons12/1.0.1-SNAPSHOT/commons12-1.0.1-SNAPSHOT.pom
[INFO] Preparing source:jar
[INFO] No goals needed for project - skipping
[INFO] [source:jar]
[INFO] Preparing checkstyle:check
[INFO] [checkstyle:checkstyle]
[INFO] Source directory does not exist - skipping report.
[INFO] [checkstyle:check {execution: verify-style}]
[INFO] Unable to perform checkstyle:check, unable to find checkstyle:checkstyle outputFile.
[INFO] [remote-resources:process {execution: default}]
[INFO] [site:attach-descriptor]
[INFO] Unable to load parent project from a relative path: Could not find the model file '/local/continuum-1.1-beta-2/working-directory/71/../pom.xml'. for project unknown
[INFO] Parent project loaded from repository.
[INFO] [install:install]
[INFO] Installing /local/continuum-1.1-beta-2/working-directory/71/pom.xml to /export/home/mrmaven/.m2/repository/org/apache/myfaces/commons/commons12/1.0.1-SNAPSHOT/commons12-1.0.1-SNAPSHOT.pom
[INFO] [deploy:deploy]
[INFO] Retrieving previous build number from apache-maven-snapshots
Uploading: scpexe://people.apache.org/www/people.apache.org/repo/m2-snapshot-repository/org/apache/myfaces/commons/commons12/1.0.1-SNAPSHOT/commons12-1.0.1-SNAPSHOT.pom
[INFO] Retrieving previous metadata from apache-maven-snapshots
[INFO] Uploading repository metadata for: 'snapshot org.apache.myfaces.commons:commons12:1.0.1-SNAPSHOT'
[INFO] Retrieving previous metadata from apache-maven-snapshots
[INFO] Uploading repository metadata for: 'artifact org.apache.myfaces.commons:commons12'
[INFO] Uploading site descriptor for commons12 1.0.1-SNAPSHOT site.xml
[INFO] ------------------------------------------------------------------------
[INFO] Building Apache MyFaces Commons Utils
[INFO]    task-segment: [clean, install, source:jar, deploy]
[INFO] ------------------------------------------------------------------------
[INFO] [clean:clean]
[INFO] Deleting directory /local/continuum-1.1-beta-2/working-directory/71/myfaces-commons-utils/target
[INFO] Preparing checkstyle:check
[INFO] [checkstyle:checkstyle]
[WARNING] File encoding has not been set, using platform encoding UTF-8, i.e. build is platform dependent!
[INFO] [checkstyle:check {execution: verify-style}]
[INFO] [remote-resources:process {execution: default}]
[INFO] [resources:resources]
[INFO] Using default encoding to copy filtered resources.
[INFO] [compiler:compile]
[INFO] Compiling 18 source files to /local/continuum-1.1-beta-2/working-directory/71/myfaces-commons-utils/target/classes
[INFO] [resources:testResources]
[INFO] Using default encoding to copy filtered resources.
[INFO] [compiler:testCompile]
[INFO] Compiling 3 source files to /local/continuum-1.1-beta-2/working-directory/71/myfaces-commons-utils/target/test-classes
[INFO] [surefire:test]
[INFO] Surefire report directory: /local/continuum-1.1-beta-2/working-directory/71/myfaces-commons-utils/target/surefire-reports

-------------------------------------------------------
 T E S T S
-------------------------------------------------------
There are no tests to run.

Results :

Tests run: 0, Failures: 0, Errors: 0, Skipped: 0

[INFO] [jar:jar]
[INFO] Building jar: /local/continuum-1.1-beta-2/working-directory/71/myfaces-commons-utils/target/myfaces-commons-utils12-1.0.1-SNAPSHOT.jar
[INFO] [jar:test-jar {execution: default}]
[INFO] Building jar: /local/continuum-1.1-beta-2/working-directory/71/myfaces-commons-utils/target/myfaces-commons-utils12-1.0.1-SNAPSHOT-tests.jar
[INFO] [install:install]
[INFO] Installing /local/continuum-1.1-beta-2/working-directory/71/myfaces-commons-utils/target/myfaces-commons-utils12-1.0.1-SNAPSHOT.jar to /export/home/mrmaven/.m2/repository/org/apache/myfaces/commons/myfaces-commons-utils12/1.0.1-SNAPSHOT/myfaces-commons-utils12-1.0.1-SNAPSHOT.jar
[INFO] Installing /local/continuum-1.1-beta-2/working-directory/71/myfaces-commons-utils/target/myfaces-commons-utils12-1.0.1-SNAPSHOT-tests.jar to /export/home/mrmaven/.m2/repository/org/apache/myfaces/commons/myfaces-commons-utils12/1.0.1-SNAPSHOT/myfaces-commons-utils12-1.0.1-SNAPSHOT-tests.jar
[INFO] Preparing source:jar
[INFO] No goals needed for project - skipping
[INFO] [source:jar]
[INFO] Building jar: /local/continuum-1.1-beta-2/working-directory/71/myfaces-commons-utils/target/myfaces-commons-utils12-1.0.1-SNAPSHOT-sources.jar
[INFO] Preparing checkstyle:check
[INFO] [checkstyle:checkstyle]
[WARNING] File encoding has not been set, using platform encoding UTF-8, i.e. build is platform dependent!
[INFO] [checkstyle:check {execution: verify-style}]
[INFO] [remote-resources:process {execution: default}]
[INFO] [resources:resources]
[INFO] Using default encoding to copy filtered resources.
[INFO] [compiler:compile]
[INFO] Nothing to compile - all classes are up to date
[INFO] [resources:testResources]
[INFO] Using default encoding to copy filtered resources.
[INFO] [compiler:testCompile]
[INFO] Nothing to compile - all classes are up to date
[INFO] [surefire:test]
[INFO] Surefire report directory: /local/continuum-1.1-beta-2/working-directory/71/myfaces-commons-utils/target/surefire-reports

-------------------------------------------------------
 T E S T S
-------------------------------------------------------
There are no tests to run.

Results :

Tests run: 0, Failures: 0, Errors: 0, Skipped: 0

[INFO] [jar:jar]
[INFO] Building jar: /local/continuum-1.1-beta-2/working-directory/71/myfaces-commons-utils/target/myfaces-commons-utils12-1.0.1-SNAPSHOT.jar
[INFO] [jar:test-jar {execution: default}]
[INFO] Building jar: /local/continuum-1.1-beta-2/working-directory/71/myfaces-commons-utils/target/myfaces-commons-utils12-1.0.1-SNAPSHOT-tests.jar
[INFO] [install:install]
[INFO] Installing /local/continuum-1.1-beta-2/working-directory/71/myfaces-commons-utils/target/myfaces-commons-utils12-1.0.1-SNAPSHOT.jar to /export/home/mrmaven/.m2/repository/org/apache/myfaces/commons/myfaces-commons-utils12/1.0.1-SNAPSHOT/myfaces-commons-utils12-1.0.1-SNAPSHOT.jar
[INFO] Installing /local/continuum-1.1-beta-2/working-directory/71/myfaces-commons-utils/target/myfaces-commons-utils12-1.0.1-SNAPSHOT-tests.jar to /export/home/mrmaven/.m2/repository/org/apache/myfaces/commons/myfaces-commons-utils12/1.0.1-SNAPSHOT/myfaces-commons-utils12-1.0.1-SNAPSHOT-tests.jar
[INFO] Installing /local/continuum-1.1-beta-2/working-directory/71/myfaces-commons-utils/target/myfaces-commons-utils12-1.0.1-SNAPSHOT-sources.jar to /export/home/mrmaven/.m2/repository/org/apache/myfaces/commons/myfaces-commons-utils12/1.0.1-SNAPSHOT/myfaces-commons-utils12-1.0.1-SNAPSHOT-sources.jar
[INFO] Installing /local/continuum-1.1-beta-2/working-directory/71/myfaces-commons-utils/target/myfaces-commons-utils12-1.0.1-SNAPSHOT-tests.jar to /export/home/mrmaven/.m2/repository/org/apache/myfaces/commons/myfaces-commons-utils12/1.0.1-SNAPSHOT/myfaces-commons-utils12-1.0.1-SNAPSHOT-tests.jar
[INFO] [deploy:deploy]
[INFO] Retrieving previous build number from apache-maven-snapshots
Uploading: scpexe://people.apache.org/www/people.apache.org/repo/m2-snapshot-repository/org/apache/myfaces/commons/myfaces-commons-utils12/1.0.1-SNAPSHOT/myfaces-commons-utils12-1.0.1-SNAPSHOT.jar
[INFO] Retrieving previous metadata from apache-maven-snapshots
[INFO] Uploading repository metadata for: 'artifact org.apache.myfaces.commons:myfaces-commons-utils12'
[INFO] Retrieving previous metadata from apache-maven-snapshots
[INFO] Uploading repository metadata for: 'snapshot org.apache.myfaces.commons:myfaces-commons-utils12:1.0.1-SNAPSHOT'
[INFO] Uploading project information for myfaces-commons-utils12 1.0.1-SNAPSHOT
[INFO] Retrieving previous build number from apache-maven-snapshots
Uploading: scpexe://people.apache.org/www/people.apache.org/repo/m2-snapshot-repository/org/apache/myfaces/commons/myfaces-commons-utils12/1.0.1-SNAPSHOT/myfaces-commons-utils12-1.0.1-SNAPSHOT-tests.jar
[INFO] Retrieving previous build number from apache-maven-snapshots
Uploading: scpexe://people.apache.org/www/people.apache.org/repo/m2-snapshot-repository/org/apache/myfaces/commons/myfaces-commons-utils12/1.0.1-SNAPSHOT/myfaces-commons-utils12-1.0.1-SNAPSHOT-sources.jar
[INFO] Retrieving previous build number from apache-maven-snapshots
Uploading: scpexe://people.apache.org/www/people.apache.org/repo/m2-snapshot-repository/org/apache/myfaces/commons/myfaces-commons-utils12/1.0.1-SNAPSHOT/myfaces-commons-utils12-1.0.1-SNAPSHOT-tests.jar
[INFO] ------------------------------------------------------------------------
[INFO] Building Apache MyFaces Commons Validators
[INFO]    task-segment: [clean, install, source:jar, deploy]
[INFO] ------------------------------------------------------------------------
[INFO] [clean:clean]
[INFO] Deleting directory /local/continuum-1.1-beta-2/working-directory/71/myfaces-commons-validators/target
[INFO] [myfaces-builder:build-metadata {execution: default}]
log4j:WARN No appenders could be found for logger (org.apache.commons.digester.Digester.sax).
log4j:WARN Please initialize the log4j system properly.
Artifact: myfaces-api-1.2.6.jar have META-INF/myfaces-metadata.xml
[INFO] [myfaces-builder:make-config {execution: makefacesconfig}]
Oct 9, 2009 10:02:32 AM org.apache.myfaces.buildtools.maven2.plugin.builder.utils.ConsoleLogSystem log
INFO: FileResourceLoader : adding path '/local/continuum-1.1-beta-2/working-directory/71/myfaces-commons-validators/src/main/resources/META-INF'
Oct 9, 2009 10:02:32 AM org.apache.myfaces.buildtools.maven2.plugin.builder.utils.ConsoleLogSystem log
INFO: RelativeClasspathResourceLoader : adding path 'META-INF'
Oct 9, 2009 10:02:33 AM org.apache.myfaces.buildtools.maven2.plugin.builder.utils.ConsoleLogSystem log
INFO: Velocimacro : allowInlineLocal = true : VMs defined inline will be local to their defining template only.
[INFO] [myfaces-builder:make-validators {execution: makeval}]
Oct 9, 2009 10:02:33 AM org.apache.myfaces.buildtools.maven2.plugin.builder.MakeValidatorsMojo initVelocity
INFO: Using template from file loader: /local/continuum-1.1-beta-2/working-directory/71/myfaces-commons-validators/src/main/resources/META-INF/validatorClass12.vm
Oct 9, 2009 10:02:33 AM org.apache.myfaces.buildtools.maven2.plugin.builder.utils.ConsoleLogSystem log
INFO: FileResourceLoader : adding path '/local/continuum-1.1-beta-2/working-directory/71/myfaces-commons-validators/src/main/resources/META-INF'
Oct 9, 2009 10:02:33 AM org.apache.myfaces.buildtools.maven2.plugin.builder.utils.ConsoleLogSystem log
INFO: RelativeClasspathResourceLoader : adding path 'META-INF'
Oct 9, 2009 10:02:33 AM org.apache.myfaces.buildtools.maven2.plugin.builder.utils.ConsoleLogSystem log
INFO: Velocimacro : allowInlineLocal = true : VMs defined inline will be local to their defining template only.
Oct 9, 2009 10:02:33 AM org.apache.myfaces.buildtools.maven2.plugin.builder.MakeValidatorsMojo generateValidators
INFO: Generating validator class:org.apache.myfaces.commons.validator.CSVValidator
Oct 9, 2009 10:02:33 AM org.apache.myfaces.buildtools.maven2.plugin.builder.MakeValidatorsMojo generateValidators
INFO: Generating validator class:org.apache.myfaces.commons.validator.CompareToValidator
Oct 9, 2009 10:02:33 AM org.apache.myfaces.buildtools.maven2.plugin.builder.MakeValidatorsMojo generateValidators
INFO: Generating validator class:org.apache.myfaces.commons.validator.CreditCardValidator
Oct 9, 2009 10:02:33 AM org.apache.myfaces.buildtools.maven2.plugin.builder.MakeValidatorsMojo generateValidators
INFO: Generating validator class:org.apache.myfaces.commons.validator.DateRestrictionValidator
Oct 9, 2009 10:02:33 AM org.apache.myfaces.buildtools.maven2.plugin.builder.MakeValidatorsMojo generateValidators
INFO: Generating validator class:org.apache.myfaces.commons.validator.RegExprValidator
Oct 9, 2009 10:02:34 AM org.apache.myfaces.buildtools.maven2.plugin.builder.MakeValidatorsMojo generateValidators
INFO: Generating validator class:org.apache.myfaces.commons.validator.UrlValidator
[INFO] [myfaces-builder:make-validator-tags {execution: make_validator_tags}]
Oct 9, 2009 10:02:34 AM org.apache.myfaces.buildtools.maven2.plugin.builder.MakeValidatorTagsMojo initVelocity
INFO: Using template from file loader: /local/continuum-1.1-beta-2/working-directory/71/myfaces-commons-validators/src/main/resources/META-INF/tagValidatorClass12.vm
Oct 9, 2009 10:02:34 AM org.apache.myfaces.buildtools.maven2.plugin.builder.utils.ConsoleLogSystem log
INFO: FileResourceLoader : adding path '/local/continuum-1.1-beta-2/working-directory/71/myfaces-commons-validators/src/main/resources/META-INF'
Oct 9, 2009 10:02:34 AM org.apache.myfaces.buildtools.maven2.plugin.builder.utils.ConsoleLogSystem log
INFO: RelativeClasspathResourceLoader : adding path 'META-INF'
Oct 9, 2009 10:02:34 AM org.apache.myfaces.buildtools.maven2.plugin.builder.utils.ConsoleLogSystem log
INFO: Velocimacro : allowInlineLocal = true : VMs defined inline will be local to their defining template only.
Oct 9, 2009 10:02:34 AM org.apache.myfaces.buildtools.maven2.plugin.builder.MakeValidatorTagsMojo generateValidators
INFO: Generating tag class:org.apache.myfaces.commons.validator.ValidateCSVTag
Oct 9, 2009 10:02:34 AM org.apache.myfaces.buildtools.maven2.plugin.builder.MakeValidatorTagsMojo generateValidators
INFO: Generating tag class:org.apache.myfaces.commons.validator.ValidateCompareToTag
Oct 9, 2009 10:02:34 AM org.apache.myfaces.buildtools.maven2.plugin.builder.MakeValidatorTagsMojo generateValidators
INFO: Generating tag class:org.apache.myfaces.commons.validator.ValidateCreditCardTag
Oct 9, 2009 10:02:34 AM org.apache.myfaces.buildtools.maven2.plugin.builder.MakeValidatorTagsMojo generateValidators
INFO: Generating tag class:org.apache.myfaces.commons.validator.ValidateDateRestrictionTag
Oct 9, 2009 10:02:34 AM org.apache.myfaces.buildtools.maven2.plugin.builder.MakeValidatorTagsMojo generateValidators
INFO: Generating tag class:org.apache.myfaces.commons.validator.ValidateRegExprTag
Oct 9, 2009 10:02:34 AM org.apache.myfaces.buildtools.maven2.plugin.builder.MakeValidatorTagsMojo generateValidators
INFO: Generating tag class:org.apache.myfaces.commons.validator.ValidateUrlTag
Oct 9, 2009 10:02:34 AM org.apache.myfaces.buildtools.maven2.plugin.builder.MakeValidatorTagsMojo generateValidators
INFO: Generating tag class:org.apache.myfaces.commons.validator.ValidateEmailTag
Oct 9, 2009 10:02:34 AM org.apache.myfaces.buildtools.maven2.plugin.builder.MakeValidatorTagsMojo generateValidators
INFO: Generating tag class:org.apache.myfaces.commons.validator.ValidateISBNTag
[INFO] [myfaces-builder:make-config {execution: makemcvtld}]
Oct 9, 2009 10:02:34 AM org.apache.myfaces.buildtools.maven2.plugin.builder.utils.ConsoleLogSystem log
INFO: FileResourceLoader : adding path '/local/continuum-1.1-beta-2/working-directory/71/myfaces-commons-validators/src/main/resources/META-INF'
Oct 9, 2009 10:02:34 AM org.apache.myfaces.buildtools.maven2.plugin.builder.utils.ConsoleLogSystem log
INFO: RelativeClasspathResourceLoader : adding path 'META-INF'
Oct 9, 2009 10:02:34 AM org.apache.myfaces.buildtools.maven2.plugin.builder.utils.ConsoleLogSystem log
INFO: Velocimacro : allowInlineLocal = true : VMs defined inline will be local to their defining template only.
[INFO] [myfaces-builder:make-config {execution: makemcctaglib}]
Oct 9, 2009 10:02:35 AM org.apache.myfaces.buildtools.maven2.plugin.builder.utils.ConsoleLogSystem log
INFO: FileResourceLoader : adding path '/local/continuum-1.1-beta-2/working-directory/71/myfaces-commons-validators/src/main/resources/META-INF'
Oct 9, 2009 10:02:35 AM org.apache.myfaces.buildtools.maven2.plugin.builder.utils.ConsoleLogSystem log
INFO: RelativeClasspathResourceLoader : adding path 'META-INF'
Oct 9, 2009 10:02:35 AM org.apache.myfaces.buildtools.maven2.plugin.builder.utils.ConsoleLogSystem log
INFO: Velocimacro : allowInlineLocal = true : VMs defined inline will be local to their defining template only.
[INFO] Preparing checkstyle:check
[INFO] [checkstyle:checkstyle]
[WARNING] File encoding has not been set, using platform encoding UTF-8, i.e. build is platform dependent!
[INFO] [checkstyle:check {execution: verify-style}]
[INFO] [remote-resources:process {execution: default}]
[INFO] [resources:resources]
[INFO] Using default encoding to copy filtered resources.
[INFO] [compiler:compile]
[INFO] Compiling 27 source files to /local/continuum-1.1-beta-2/working-directory/71/myfaces-commons-validators/target/classes
[INFO] [resources:testResources]
[INFO] Using default encoding to copy filtered resources.
[INFO] snapshot org.apache.myfaces.commons:myfaces-commons-utils12:1.0.1-SNAPSHOT: checking for updates from java.net
[INFO] snapshot org.apache.myfaces.commons:myfaces-commons-utils12:1.0.1-SNAPSHOT: checking for updates from apache.snapshots
[INFO] [compiler:testCompile]
[INFO] Compiling 8 source files to /local/continuum-1.1-beta-2/working-directory/71/myfaces-commons-validators/target/test-classes
[INFO] [surefire:test]
[INFO] Surefire report directory: /local/continuum-1.1-beta-2/working-directory/71/myfaces-commons-validators/target/surefire-reports

-------------------------------------------------------
 T E S T S
-------------------------------------------------------
Running org.apache.myfaces.commons.validator.EmailValidatorTestCase
Tests run: 3, Failures: 0, Errors: 0, Skipped: 0, Time elapsed: 0.709 sec
Running org.apache.myfaces.commons.validator.RegExprValidatorTestCase
Tests run: 3, Failures: 0, Errors: 0, Skipped: 0, Time elapsed: 0.032 sec
Running org.apache.myfaces.commons.validator.ISBNValidatorTestCase
Tests run: 3, Failures: 0, Errors: 0, Skipped: 0, Time elapsed: 0.021 sec
Running org.apache.myfaces.commons.test.CommonsValidatorTagLibTestCase
Tests run: 3, Failures: 0, Errors: 0, Skipped: 0, Time elapsed: 0.559 sec
Running org.apache.myfaces.commons.test.CommonsValidatorClassElementTestCase
Tests run: 1, Failures: 0, Errors: 0, Skipped: 0, Time elapsed: 0.103 sec
Running org.apache.myfaces.commons.validator.DateRestrictionValidatorTestCase
Tests run: 5, Failures: 0, Errors: 0, Skipped: 0, Time elapsed: 0.026 sec
Running org.apache.myfaces.commons.validator.UrlValidatorTestCase
Tests run: 3, Failures: 0, Errors: 0, Skipped: 0, Time elapsed: 0.031 sec

Results :

Tests run: 21, Failures: 0, Errors: 0, Skipped: 0

[INFO] [jar:jar]
[INFO] Building jar: /local/continuum-1.1-beta-2/working-directory/71/myfaces-commons-validators/target/myfaces-validators12-1.0.1-SNAPSHOT.jar
[INFO] [install:install]
[INFO] Installing /local/continuum-1.1-beta-2/working-directory/71/myfaces-commons-validators/target/myfaces-validators12-1.0.1-SNAPSHOT.jar to /export/home/mrmaven/.m2/repository/org/apache/myfaces/commons/myfaces-validators12/1.0.1-SNAPSHOT/myfaces-validators12-1.0.1-SNAPSHOT.jar
[INFO] Preparing source:jar
[INFO] [myfaces-builder:build-metadata {execution: default}]
Artifact: myfaces-api-1.2.6.jar have META-INF/myfaces-metadata.xml
[INFO] [myfaces-builder:make-config {execution: makefacesconfig}]
Oct 9, 2009 10:02:46 AM org.apache.myfaces.buildtools.maven2.plugin.builder.utils.ConsoleLogSystem log
INFO: FileResourceLoader : adding path '/local/continuum-1.1-beta-2/working-directory/71/myfaces-commons-validators/src/main/resources/META-INF'
Oct 9, 2009 10:02:46 AM org.apache.myfaces.buildtools.maven2.plugin.builder.utils.ConsoleLogSystem log
INFO: RelativeClasspathResourceLoader : adding path 'META-INF'
Oct 9, 2009 10:02:46 AM org.apache.myfaces.buildtools.maven2.plugin.builder.utils.ConsoleLogSystem log
INFO: Velocimacro : allowInlineLocal = true : VMs defined inline will be local to their defining template only.
[INFO] [myfaces-builder:make-validators {execution: makeval}]
Oct 9, 2009 10:02:46 AM org.apache.myfaces.buildtools.maven2.plugin.builder.MakeValidatorsMojo initVelocity
INFO: Using template from file loader: /local/continuum-1.1-beta-2/working-directory/71/myfaces-commons-validators/src/main/resources/META-INF/validatorClass12.vm
Oct 9, 2009 10:02:46 AM org.apache.myfaces.buildtools.maven2.plugin.builder.utils.ConsoleLogSystem log
INFO: FileResourceLoader : adding path '/local/continuum-1.1-beta-2/working-directory/71/myfaces-commons-validators/src/main/resources/META-INF'
Oct 9, 2009 10:02:46 AM org.apache.myfaces.buildtools.maven2.plugin.builder.utils.ConsoleLogSystem log
INFO: RelativeClasspathResourceLoader : adding path 'META-INF'
Oct 9, 2009 10:02:46 AM org.apache.myfaces.buildtools.maven2.plugin.builder.utils.ConsoleLogSystem log
INFO: Velocimacro : allowInlineLocal = true : VMs defined inline will be local to their defining template only.
Oct 9, 2009 10:02:46 AM org.apache.myfaces.buildtools.maven2.plugin.builder.MakeValidatorsMojo generateValidators
INFO: Generating validator class:org.apache.myfaces.commons.validator.CSVValidator
Oct 9, 2009 10:02:46 AM org.apache.myfaces.buildtools.maven2.plugin.builder.MakeValidatorsMojo generateValidators
INFO: Generating validator class:org.apache.myfaces.commons.validator.CompareToValidator
Oct 9, 2009 10:02:46 AM org.apache.myfaces.buildtools.maven2.plugin.builder.MakeValidatorsMojo generateValidators
INFO: Generating validator class:org.apache.myfaces.commons.validator.CreditCardValidator
Oct 9, 2009 10:02:46 AM org.apache.myfaces.buildtools.maven2.plugin.builder.MakeValidatorsMojo generateValidators
INFO: Generating validator class:org.apache.myfaces.commons.validator.DateRestrictionValidator
Oct 9, 2009 10:02:46 AM org.apache.myfaces.buildtools.maven2.plugin.builder.MakeValidatorsMojo generateValidators
INFO: Generating validator class:org.apache.myfaces.commons.validator.RegExprValidator
Oct 9, 2009 10:02:46 AM org.apache.myfaces.buildtools.maven2.plugin.builder.MakeValidatorsMojo generateValidators
INFO: Generating validator class:org.apache.myfaces.commons.validator.UrlValidator
[INFO] [myfaces-builder:make-validator-tags {execution: make_validator_tags}]
Oct 9, 2009 10:02:47 AM org.apache.myfaces.buildtools.maven2.plugin.builder.MakeValidatorTagsMojo initVelocity
INFO: Using template from file loader: /local/continuum-1.1-beta-2/working-directory/71/myfaces-commons-validators/src/main/resources/META-INF/tagValidatorClass12.vm
Oct 9, 2009 10:02:47 AM org.apache.myfaces.buildtools.maven2.plugin.builder.utils.ConsoleLogSystem log
INFO: FileResourceLoader : adding path '/local/continuum-1.1-beta-2/working-directory/71/myfaces-commons-validators/src/main/resources/META-INF'
Oct 9, 2009 10:02:47 AM org.apache.myfaces.buildtools.maven2.plugin.builder.utils.ConsoleLogSystem log
INFO: RelativeClasspathResourceLoader : adding path 'META-INF'
Oct 9, 2009 10:02:47 AM org.apache.myfaces.buildtools.maven2.plugin.builder.utils.ConsoleLogSystem log
INFO: Velocimacro : allowInlineLocal = true : VMs defined inline will be local to their defining template only.
Oct 9, 2009 10:02:47 AM org.apache.myfaces.buildtools.maven2.plugin.builder.MakeValidatorTagsMojo generateValidators
INFO: Generating tag class:org.apache.myfaces.commons.validator.ValidateCSVTag
Oct 9, 2009 10:02:47 AM org.apache.myfaces.buildtools.maven2.plugin.builder.MakeValidatorTagsMojo generateValidators
INFO: Generating tag class:org.apache.myfaces.commons.validator.ValidateCompareToTag
Oct 9, 2009 10:02:47 AM org.apache.myfaces.buildtools.maven2.plugin.builder.MakeValidatorTagsMojo generateValidators
INFO: Generating tag class:org.apache.myfaces.commons.validator.ValidateCreditCardTag
Oct 9, 2009 10:02:47 AM org.apache.myfaces.buildtools.maven2.plugin.builder.MakeValidatorTagsMojo generateValidators
INFO: Generating tag class:org.apache.myfaces.commons.validator.ValidateDateRestrictionTag
Oct 9, 2009 10:02:47 AM org.apache.myfaces.buildtools.maven2.plugin.builder.MakeValidatorTagsMojo generateValidators
INFO: Generating tag class:org.apache.myfaces.commons.validator.ValidateRegExprTag
Oct 9, 2009 10:02:47 AM org.apache.myfaces.buildtools.maven2.plugin.builder.MakeValidatorTagsMojo generateValidators
INFO: Generating tag class:org.apache.myfaces.commons.validator.ValidateUrlTag
Oct 9, 2009 10:02:47 AM org.apache.myfaces.buildtools.maven2.plugin.builder.MakeValidatorTagsMojo generateValidators
INFO: Generating tag class:org.apache.myfaces.commons.validator.ValidateEmailTag
Oct 9, 2009 10:02:47 AM org.apache.myfaces.buildtools.maven2.plugin.builder.MakeValidatorTagsMojo generateValidators
INFO: Generating tag class:org.apache.myfaces.commons.validator.ValidateISBNTag
[INFO] [myfaces-builder:make-config {execution: makemcvtld}]
Oct 9, 2009 10:02:47 AM org.apache.myfaces.buildtools.maven2.plugin.builder.utils.ConsoleLogSystem log
INFO: FileResourceLoader : adding path '/local/continuum-1.1-beta-2/working-directory/71/myfaces-commons-validators/src/main/resources/META-INF'
Oct 9, 2009 10:02:47 AM org.apache.myfaces.buildtools.maven2.plugin.builder.utils.ConsoleLogSystem log
INFO: RelativeClasspathResourceLoader : adding path 'META-INF'
Oct 9, 2009 10:02:47 AM org.apache.myfaces.buildtools.maven2.plugin.builder.utils.ConsoleLogSystem log
INFO: Velocimacro : allowInlineLocal = true : VMs defined inline will be local to their defining template only.
[INFO] [myfaces-builder:make-config {execution: makemcctaglib}]
Oct 9, 2009 10:02:47 AM org.apache.myfaces.buildtools.maven2.plugin.builder.utils.ConsoleLogSystem log
INFO: FileResourceLoader : adding path '/local/continuum-1.1-beta-2/working-directory/71/myfaces-commons-validators/src/main/resources/META-INF'
Oct 9, 2009 10:02:47 AM org.apache.myfaces.buildtools.maven2.plugin.builder.utils.ConsoleLogSystem log
INFO: RelativeClasspathResourceLoader : adding path 'META-INF'
Oct 9, 2009 10:02:47 AM org.apache.myfaces.buildtools.maven2.plugin.builder.utils.ConsoleLogSystem log
INFO: Velocimacro : allowInlineLocal = true : VMs defined inline will be local to their defining template only.
[INFO] [source:jar]
[INFO] Building jar: /local/continuum-1.1-beta-2/working-directory/71/myfaces-commons-validators/target/myfaces-validators12-1.0.1-SNAPSHOT-sources.jar
[INFO] [myfaces-builder:build-metadata {execution: default}]
Artifact: myfaces-api-1.2.6.jar have META-INF/myfaces-metadata.xml
[INFO] [myfaces-builder:make-config {execution: makefacesconfig}]
Oct 9, 2009 10:02:48 AM org.apache.myfaces.buildtools.maven2.plugin.builder.utils.ConsoleLogSystem log
INFO: FileResourceLoader : adding path '/local/continuum-1.1-beta-2/working-directory/71/myfaces-commons-validators/src/main/resources/META-INF'
Oct 9, 2009 10:02:48 AM org.apache.myfaces.buildtools.maven2.plugin.builder.utils.ConsoleLogSystem log
INFO: RelativeClasspathResourceLoader : adding path 'META-INF'
Oct 9, 2009 10:02:48 AM org.apache.myfaces.buildtools.maven2.plugin.builder.utils.ConsoleLogSystem log
INFO: Velocimacro : allowInlineLocal = true : VMs defined inline will be local to their defining template only.
[INFO] [myfaces-builder:make-validators {execution: makeval}]
Oct 9, 2009 10:02:49 AM org.apache.myfaces.buildtools.maven2.plugin.builder.MakeValidatorsMojo initVelocity
INFO: Using template from file loader: /local/continuum-1.1-beta-2/working-directory/71/myfaces-commons-validators/src/main/resources/META-INF/validatorClass12.vm
Oct 9, 2009 10:02:49 AM org.apache.myfaces.buildtools.maven2.plugin.builder.utils.ConsoleLogSystem log
INFO: FileResourceLoader : adding path '/local/continuum-1.1-beta-2/working-directory/71/myfaces-commons-validators/src/main/resources/META-INF'
Oct 9, 2009 10:02:49 AM org.apache.myfaces.buildtools.maven2.plugin.builder.utils.ConsoleLogSystem log
INFO: RelativeClasspathResourceLoader : adding path 'META-INF'
Oct 9, 2009 10:02:49 AM org.apache.myfaces.buildtools.maven2.plugin.builder.utils.ConsoleLogSystem log
INFO: Velocimacro : allowInlineLocal = true : VMs defined inline will be local to their defining template only.
Oct 9, 2009 10:02:49 AM org.apache.myfaces.buildtools.maven2.plugin.builder.MakeValidatorsMojo generateValidators
INFO: Generating validator class:org.apache.myfaces.commons.validator.CSVValidator
Oct 9, 2009 10:02:49 AM org.apache.myfaces.buildtools.maven2.plugin.builder.MakeValidatorsMojo generateValidators
INFO: Generating validator class:org.apache.myfaces.commons.validator.CompareToValidator
Oct 9, 2009 10:02:49 AM org.apache.myfaces.buildtools.maven2.plugin.builder.MakeValidatorsMojo generateValidators
INFO: Generating validator class:org.apache.myfaces.commons.validator.CreditCardValidator
Oct 9, 2009 10:02:49 AM org.apache.myfaces.buildtools.maven2.plugin.builder.MakeValidatorsMojo generateValidators
INFO: Generating validator class:org.apache.myfaces.commons.validator.DateRestrictionValidator
Oct 9, 2009 10:02:49 AM org.apache.myfaces.buildtools.maven2.plugin.builder.MakeValidatorsMojo generateValidators
INFO: Generating validator class:org.apache.myfaces.commons.validator.RegExprValidator
Oct 9, 2009 10:02:49 AM org.apache.myfaces.buildtools.maven2.plugin.builder.MakeValidatorsMojo generateValidators
INFO: Generating validator class:org.apache.myfaces.commons.validator.UrlValidator
[INFO] [myfaces-builder:make-validator-tags {execution: make_validator_tags}]
Oct 9, 2009 10:02:49 AM org.apache.myfaces.buildtools.maven2.plugin.builder.MakeValidatorTagsMojo initVelocity
INFO: Using template from file loader: /local/continuum-1.1-beta-2/working-directory/71/myfaces-commons-validators/src/main/resources/META-INF/tagValidatorClass12.vm
Oct 9, 2009 10:02:49 AM org.apache.myfaces.buildtools.maven2.plugin.builder.utils.ConsoleLogSystem log
INFO: FileResourceLoader : adding path '/local/continuum-1.1-beta-2/working-directory/71/myfaces-commons-validators/src/main/resources/META-INF'
Oct 9, 2009 10:02:49 AM org.apache.myfaces.buildtools.maven2.plugin.builder.utils.ConsoleLogSystem log
INFO: RelativeClasspathResourceLoader : adding path 'META-INF'
Oct 9, 2009 10:02:49 AM org.apache.myfaces.buildtools.maven2.plugin.builder.utils.ConsoleLogSystem log
INFO: Velocimacro : allowInlineLocal = true : VMs defined inline will be local to their defining template only.
Oct 9, 2009 10:02:49 AM org.apache.myfaces.buildtools.maven2.plugin.builder.MakeValidatorTagsMojo generateValidators
INFO: Generating tag class:org.apache.myfaces.commons.validator.ValidateCSVTag
Oct 9, 2009 10:02:49 AM org.apache.myfaces.buildtools.maven2.plugin.builder.MakeValidatorTagsMojo generateValidators
INFO: Generating tag class:org.apache.myfaces.commons.validator.ValidateCompareToTag
Oct 9, 2009 10:02:49 AM org.apache.myfaces.buildtools.maven2.plugin.builder.MakeValidatorTagsMojo generateValidators
INFO: Generating tag class:org.apache.myfaces.commons.validator.ValidateCreditCardTag
Oct 9, 2009 10:02:49 AM org.apache.myfaces.buildtools.maven2.plugin.builder.MakeValidatorTagsMojo generateValidators
INFO: Generating tag class:org.apache.myfaces.commons.validator.ValidateDateRestrictionTag
Oct 9, 2009 10:02:49 AM org.apache.myfaces.buildtools.maven2.plugin.builder.MakeValidatorTagsMojo generateValidators
INFO: Generating tag class:org.apache.myfaces.commons.validator.ValidateRegExprTag
Oct 9, 2009 10:02:49 AM org.apache.myfaces.buildtools.maven2.plugin.builder.MakeValidatorTagsMojo generateValidators
INFO: Generating tag class:org.apache.myfaces.commons.validator.ValidateUrlTag
Oct 9, 2009 10:02:49 AM org.apache.myfaces.buildtools.maven2.plugin.builder.MakeValidatorTagsMojo generateValidators
INFO: Generating tag class:org.apache.myfaces.commons.validator.ValidateEmailTag
Oct 9, 2009 10:02:49 AM org.apache.myfaces.buildtools.maven2.plugin.builder.MakeValidatorTagsMojo generateValidators
INFO: Generating tag class:org.apache.myfaces.commons.validator.ValidateISBNTag
[INFO] [myfaces-builder:make-config {execution: makemcvtld}]
Oct 9, 2009 10:02:50 AM org.apache.myfaces.buildtools.maven2.plugin.builder.utils.ConsoleLogSystem log
INFO: FileResourceLoader : adding path '/local/continuum-1.1-beta-2/working-directory/71/myfaces-commons-validators/src/main/resources/META-INF'
Oct 9, 2009 10:02:50 AM org.apache.myfaces.buildtools.maven2.plugin.builder.utils.ConsoleLogSystem log
INFO: RelativeClasspathResourceLoader : adding path 'META-INF'
Oct 9, 2009 10:02:50 AM org.apache.myfaces.buildtools.maven2.plugin.builder.utils.ConsoleLogSystem log
INFO: Velocimacro : allowInlineLocal = true : VMs defined inline will be local to their defining template only.
[INFO] [myfaces-builder:make-config {execution: makemcctaglib}]
Oct 9, 2009 10:02:50 AM org.apache.myfaces.buildtools.maven2.plugin.builder.utils.ConsoleLogSystem log
INFO: FileResourceLoader : adding path '/local/continuum-1.1-beta-2/working-directory/71/myfaces-commons-validators/src/main/resources/META-INF'
Oct 9, 2009 10:02:50 AM org.apache.myfaces.buildtools.maven2.plugin.builder.utils.ConsoleLogSystem log
INFO: RelativeClasspathResourceLoader : adding path 'META-INF'
Oct 9, 2009 10:02:50 AM org.apache.myfaces.buildtools.maven2.plugin.builder.utils.ConsoleLogSystem log
INFO: Velocimacro : allowInlineLocal = true : VMs defined inline will be local to their defining template only.
[INFO] Preparing checkstyle:check
[INFO] [checkstyle:checkstyle]
[WARNING] File encoding has not been set, using platform encoding UTF-8, i.e. build is platform dependent!
[INFO] [checkstyle:check {execution: verify-style}]
[INFO] [remote-resources:process {execution: default}]
[INFO] [resources:resources]
[INFO] Using default encoding to copy filtered resources.
[INFO] [compiler:compile]
[INFO] Compiling 14 source files to /local/continuum-1.1-beta-2/working-directory/71/myfaces-commons-validators/target/classes
[INFO] [resources:testResources]
[INFO] Using default encoding to copy filtered resources.
[INFO] [compiler:testCompile]
[INFO] Nothing to compile - all classes are up to date
[INFO] [surefire:test]
[INFO] Surefire report directory: /local/continuum-1.1-beta-2/working-directory/71/myfaces-commons-validators/target/surefire-reports

-------------------------------------------------------
 T E S T S
-------------------------------------------------------
Running org.apache.myfaces.commons.validator.EmailValidatorTestCase
Tests run: 3, Failures: 0, Errors: 0, Skipped: 0, Time elapsed: 0.621 sec
Running org.apache.myfaces.commons.validator.RegExprValidatorTestCase
Tests run: 3, Failures: 0, Errors: 0, Skipped: 0, Time elapsed: 0.023 sec
Running org.apache.myfaces.commons.validator.ISBNValidatorTestCase
Tests run: 3, Failures: 0, Errors: 0, Skipped: 0, Time elapsed: 0.019 sec
Running org.apache.myfaces.commons.test.CommonsValidatorTagLibTestCase
Tests run: 3, Failures: 0, Errors: 0, Skipped: 0, Time elapsed: 0.556 sec
Running org.apache.myfaces.commons.test.CommonsValidatorClassElementTestCase
Tests run: 1, Failures: 0, Errors: 0, Skipped: 0, Time elapsed: 0.466 sec
Running org.apache.myfaces.commons.validator.DateRestrictionValidatorTestCase
Tests run: 5, Failures: 0, Errors: 0, Skipped: 0, Time elapsed: 0.025 sec
Running org.apache.myfaces.commons.validator.UrlValidatorTestCase
Tests run: 3, Failures: 0, Errors: 0, Skipped: 0, Time elapsed: 0.029 sec

Results :

Tests run: 21, Failures: 0, Errors: 0, Skipped: 0

[INFO] [jar:jar]
[INFO] Building jar: /local/continuum-1.1-beta-2/working-directory/71/myfaces-commons-validators/target/myfaces-validators12-1.0.1-SNAPSHOT.jar
[INFO] [install:install]
[INFO] Installing /local/continuum-1.1-beta-2/working-directory/71/myfaces-commons-validators/target/myfaces-validators12-1.0.1-SNAPSHOT.jar to /export/home/mrmaven/.m2/repository/org/apache/myfaces/commons/myfaces-validators12/1.0.1-SNAPSHOT/myfaces-validators12-1.0.1-SNAPSHOT.jar
[INFO] Installing /local/continuum-1.1-beta-2/working-directory/71/myfaces-commons-validators/target/myfaces-validators12-1.0.1-SNAPSHOT-sources.jar to /export/home/mrmaven/.m2/repository/org/apache/myfaces/commons/myfaces-validators12/1.0.1-SNAPSHOT/myfaces-validators12-1.0.1-SNAPSHOT-sources.jar
[INFO] [deploy:deploy]
[INFO] Retrieving previous build number from apache-maven-snapshots
Uploading: scpexe://people.apache.org/www/people.apache.org/repo/m2-snapshot-repository/org/apache/myfaces/commons/myfaces-validators12/1.0.1-SNAPSHOT/myfaces-validators12-1.0.1-SNAPSHOT.jar
[INFO] Uploading project information for myfaces-validators12 1.0.1-SNAPSHOT
[INFO] Retrieving previous metadata from apache-maven-snapshots
[INFO] Uploading repository metadata for: 'snapshot org.apache.myfaces.commons:myfaces-validators12:1.0.1-SNAPSHOT'
[INFO] Retrieving previous metadata from apache-maven-snapshots
[INFO] Uploading repository metadata for: 'artifact org.apache.myfaces.commons:myfaces-validators12'
[INFO] Retrieving previous build number from apache-maven-snapshots
Uploading: scpexe://people.apache.org/www/people.apache.org/repo/m2-snapshot-repository/org/apache/myfaces/commons/myfaces-validators12/1.0.1-SNAPSHOT/myfaces-validators12-1.0.1-SNAPSHOT-sources.jar
[INFO] ------------------------------------------------------------------------
[INFO] Building Apache MyFaces Commons Converters
[INFO]    task-segment: [clean, install, source:jar, deploy]
[INFO] ------------------------------------------------------------------------
[INFO] [clean:clean]
[INFO] Deleting directory /local/continuum-1.1-beta-2/working-directory/71/myfaces-commons-converters/target
[INFO] [myfaces-builder:build-metadata {execution: default}]
Artifact: myfaces-api-1.2.6.jar have META-INF/myfaces-metadata.xml
[INFO] [myfaces-builder:make-config {execution: makefacesconfig}]
Oct 9, 2009 10:03:29 AM org.apache.myfaces.buildtools.maven2.plugin.builder.utils.ConsoleLogSystem log
INFO: FileResourceLoader : adding path '/local/continuum-1.1-beta-2/working-directory/71/myfaces-commons-converters/src/main/resources/META-INF'
Oct 9, 2009 10:03:29 AM org.apache.myfaces.buildtools.maven2.plugin.builder.utils.ConsoleLogSystem log
INFO: RelativeClasspathResourceLoader : adding path 'META-INF'
Oct 9, 2009 10:03:29 AM org.apache.myfaces.buildtools.maven2.plugin.builder.utils.ConsoleLogSystem log
INFO: Velocimacro : allowInlineLocal = true : VMs defined inline will be local to their defining template only.
[INFO] [myfaces-builder:make-converter-tags {execution: make_converter_tags}]
Oct 9, 2009 10:03:29 AM org.apache.myfaces.buildtools.maven2.plugin.builder.MakeConverterTagsMojo initVelocity
INFO: Using template from file loader: /local/continuum-1.1-beta-2/working-directory/71/myfaces-commons-converters/src/main/resources/META-INF/tagConverterClass12.vm
Oct 9, 2009 10:03:29 AM org.apache.myfaces.buildtools.maven2.plugin.builder.utils.ConsoleLogSystem log
INFO: FileResourceLoader : adding path '/local/continuum-1.1-beta-2/working-directory/71/myfaces-commons-converters/src/main/resources/META-INF'
Oct 9, 2009 10:03:29 AM org.apache.myfaces.buildtools.maven2.plugin.builder.utils.ConsoleLogSystem log
INFO: RelativeClasspathResourceLoader : adding path 'META-INF'
Oct 9, 2009 10:03:29 AM org.apache.myfaces.buildtools.maven2.plugin.builder.utils.ConsoleLogSystem log
INFO: Velocimacro : allowInlineLocal = true : VMs defined inline will be local to their defining template only.
Oct 9, 2009 10:03:29 AM org.apache.myfaces.buildtools.maven2.plugin.builder.MakeConverterTagsMojo generateConverters
INFO: Generating tag class:org.apache.myfaces.commons.converter.ConvertBooleanTag
Oct 9, 2009 10:03:29 AM org.apache.myfaces.buildtools.maven2.plugin.builder.MakeConverterTagsMojo generateConverters
INFO: Generating tag class:org.apache.myfaces.commons.converter.ConvertDateTimeTag
Oct 9, 2009 10:03:29 AM org.apache.myfaces.buildtools.maven2.plugin.builder.MakeConverterTagsMojo generateConverters
INFO: Generating tag class:org.apache.myfaces.commons.converter.ConvertEnumTag
Oct 9, 2009 10:03:29 AM org.apache.myfaces.buildtools.maven2.plugin.builder.MakeConverterTagsMojo generateConverters
INFO: Generating tag class:org.apache.myfaces.commons.converter.TypedNumberConverterTag
[INFO] [myfaces-builder:make-config {execution: makemcctld}]
Oct 9, 2009 10:03:30 AM org.apache.myfaces.buildtools.maven2.plugin.builder.utils.ConsoleLogSystem log
INFO: FileResourceLoader : adding path '/local/continuum-1.1-beta-2/working-directory/71/myfaces-commons-converters/src/main/resources/META-INF'
Oct 9, 2009 10:03:30 AM org.apache.myfaces.buildtools.maven2.plugin.builder.utils.ConsoleLogSystem log
INFO: RelativeClasspathResourceLoader : adding path 'META-INF'
Oct 9, 2009 10:03:30 AM org.apache.myfaces.buildtools.maven2.plugin.builder.utils.ConsoleLogSystem log
INFO: Velocimacro : allowInlineLocal = true : VMs defined inline will be local to their defining template only.
[INFO] [myfaces-builder:make-config {execution: makemcctaglib}]
Oct 9, 2009 10:03:30 AM org.apache.myfaces.buildtools.maven2.plugin.builder.utils.ConsoleLogSystem log
INFO: FileResourceLoader : adding path '/local/continuum-1.1-beta-2/working-directory/71/myfaces-commons-converters/src/main/resources/META-INF'
Oct 9, 2009 10:03:30 AM org.apache.myfaces.buildtools.maven2.plugin.builder.utils.ConsoleLogSystem log
INFO: RelativeClasspathResourceLoader : adding path 'META-INF'
Oct 9, 2009 10:03:30 AM org.apache.myfaces.buildtools.maven2.plugin.builder.utils.ConsoleLogSystem log
INFO: Velocimacro : allowInlineLocal = true : VMs defined inline will be local to their defining template only.
[INFO] Preparing checkstyle:check
[INFO] [checkstyle:checkstyle]
[WARNING] File encoding has not been set, using platform encoding UTF-8, i.e. build is platform dependent!
[INFO] [checkstyle:check {execution: verify-style}]
[INFO] [remote-resources:process {execution: default}]
[INFO] [resources:resources]
[INFO] Using default encoding to copy filtered resources.
[INFO] [compiler:compile]
[INFO] Compiling 9 source files to /local/continuum-1.1-beta-2/working-directory/71/myfaces-commons-converters/target/classes
[INFO] [resources:testResources]
[INFO] Using default encoding to copy filtered resources.
[INFO] [compiler:testCompile]
[INFO] Compiling 5 source files to /local/continuum-1.1-beta-2/working-directory/71/myfaces-commons-converters/target/test-classes
[INFO] [surefire:test]
[INFO] Surefire report directory: /local/continuum-1.1-beta-2/working-directory/71/myfaces-commons-converters/target/surefire-reports

-------------------------------------------------------
 T E S T S
-------------------------------------------------------
Running org.apache.myfaces.commons.converter.TypedNumberConverterTest
Tests run: 2, Failures: 0, Errors: 0, Skipped: 0, Time elapsed: 0.166 sec
Running org.apache.myfaces.commons.converter.EnumConverterTest
No Renderer found for component {Component-Path : [Class: javax.faces.component.UIInput,Id: txt_test]} (component-family=javax.faces.Input, renderer-type=javax.faces.Text)
Oct 9, 2009 10:03:33 AM javax.faces.component.UIComponentBase getRenderer
WARNING: No Renderer found for component {Component-Path : [Class: javax.faces.component.UIInput,Id: txt_test]} (component-family=javax.faces.Input, renderer-type=javax.faces.Text)
Tests run: 2, Failures: 0, Errors: 0, Skipped: 0, Time elapsed: 0.051 sec
Running org.apache.myfaces.commons.converter.BooleanConverterTest
Tests run: 2, Failures: 0, Errors: 0, Skipped: 0, Time elapsed: 0.012 sec
Running org.apache.myfaces.commons.test.CommonsConverterClassElementTestCase
Tests run: 1, Failures: 0, Errors: 0, Skipped: 0, Time elapsed: 0.327 sec
Running org.apache.myfaces.commons.test.CommonsConverterTagLibTestCase
Tests run: 3, Failures: 0, Errors: 0, Skipped: 0, Time elapsed: 0.217 sec

Results :

Tests run: 10, Failures: 0, Errors: 0, Skipped: 0

[INFO] [jar:jar]
[INFO] Building jar: /local/continuum-1.1-beta-2/working-directory/71/myfaces-commons-converters/target/myfaces-converters12-1.0.1-SNAPSHOT.jar
[INFO] [install:install]
[INFO] Installing /local/continuum-1.1-beta-2/working-directory/71/myfaces-commons-converters/target/myfaces-converters12-1.0.1-SNAPSHOT.jar to /export/home/mrmaven/.m2/repository/org/apache/myfaces/commons/myfaces-converters12/1.0.1-SNAPSHOT/myfaces-converters12-1.0.1-SNAPSHOT.jar
[INFO] Preparing source:jar
[INFO] [myfaces-builder:build-metadata {execution: default}]
Artifact: myfaces-api-1.2.6.jar have META-INF/myfaces-metadata.xml
[INFO] [myfaces-builder:make-config {execution: makefacesconfig}]
Oct 9, 2009 10:03:35 AM org.apache.myfaces.buildtools.maven2.plugin.builder.utils.ConsoleLogSystem log
INFO: FileResourceLoader : adding path '/local/continuum-1.1-beta-2/working-directory/71/myfaces-commons-converters/src/main/resources/META-INF'
Oct 9, 2009 10:03:35 AM org.apache.myfaces.buildtools.maven2.plugin.builder.utils.ConsoleLogSystem log
INFO: RelativeClasspathResourceLoader : adding path 'META-INF'
Oct 9, 2009 10:03:35 AM org.apache.myfaces.buildtools.maven2.plugin.builder.utils.ConsoleLogSystem log
INFO: Velocimacro : allowInlineLocal = true : VMs defined inline will be local to their defining template only.
[INFO] [myfaces-builder:make-converter-tags {execution: make_converter_tags}]
Oct 9, 2009 10:03:35 AM org.apache.myfaces.buildtools.maven2.plugin.builder.MakeConverterTagsMojo initVelocity
INFO: Using template from file loader: /local/continuum-1.1-beta-2/working-directory/71/myfaces-commons-converters/src/main/resources/META-INF/tagConverterClass12.vm
Oct 9, 2009 10:03:35 AM org.apache.myfaces.buildtools.maven2.plugin.builder.utils.ConsoleLogSystem log
INFO: FileResourceLoader : adding path '/local/continuum-1.1-beta-2/working-directory/71/myfaces-commons-converters/src/main/resources/META-INF'
Oct 9, 2009 10:03:35 AM org.apache.myfaces.buildtools.maven2.plugin.builder.utils.ConsoleLogSystem log
INFO: RelativeClasspathResourceLoader : adding path 'META-INF'
Oct 9, 2009 10:03:35 AM org.apache.myfaces.buildtools.maven2.plugin.builder.utils.ConsoleLogSystem log
INFO: Velocimacro : allowInlineLocal = true : VMs defined inline will be local to their defining template only.
Oct 9, 2009 10:03:35 AM org.apache.myfaces.buildtools.maven2.plugin.builder.MakeConverterTagsMojo generateConverters
INFO: Generating tag class:org.apache.myfaces.commons.converter.ConvertBooleanTag
Oct 9, 2009 10:03:35 AM org.apache.myfaces.buildtools.maven2.plugin.builder.MakeConverterTagsMojo generateConverters
INFO: Generating tag class:org.apache.myfaces.commons.converter.ConvertDateTimeTag
Oct 9, 2009 10:03:35 AM org.apache.myfaces.buildtools.maven2.plugin.builder.MakeConverterTagsMojo generateConverters
INFO: Generating tag class:org.apache.myfaces.commons.converter.ConvertEnumTag
Oct 9, 2009 10:03:35 AM org.apache.myfaces.buildtools.maven2.plugin.builder.MakeConverterTagsMojo generateConverters
INFO: Generating tag class:org.apache.myfaces.commons.converter.TypedNumberConverterTag
[INFO] [myfaces-builder:make-config {execution: makemcctld}]
Oct 9, 2009 10:03:35 AM org.apache.myfaces.buildtools.maven2.plugin.builder.utils.ConsoleLogSystem log
INFO: FileResourceLoader : adding path '/local/continuum-1.1-beta-2/working-directory/71/myfaces-commons-converters/src/main/resources/META-INF'
Oct 9, 2009 10:03:35 AM org.apache.myfaces.buildtools.maven2.plugin.builder.utils.ConsoleLogSystem log
INFO: RelativeClasspathResourceLoader : adding path 'META-INF'
Oct 9, 2009 10:03:35 AM org.apache.myfaces.buildtools.maven2.plugin.builder.utils.ConsoleLogSystem log
INFO: Velocimacro : allowInlineLocal = true : VMs defined inline will be local to their defining template only.
[INFO] [myfaces-builder:make-config {execution: makemcctaglib}]
Oct 9, 2009 10:03:35 AM org.apache.myfaces.buildtools.maven2.plugin.builder.utils.ConsoleLogSystem log
INFO: FileResourceLoader : adding path '/local/continuum-1.1-beta-2/working-directory/71/myfaces-commons-converters/src/main/resources/META-INF'
Oct 9, 2009 10:03:35 AM org.apache.myfaces.buildtools.maven2.plugin.builder.utils.ConsoleLogSystem log
INFO: RelativeClasspathResourceLoader : adding path 'META-INF'
Oct 9, 2009 10:03:35 AM org.apache.myfaces.buildtools.maven2.plugin.builder.utils.ConsoleLogSystem log
INFO: Velocimacro : allowInlineLocal = true : VMs defined inline will be local to their defining template only.
[INFO] [source:jar]
[INFO] Building jar: /local/continuum-1.1-beta-2/working-directory/71/myfaces-commons-converters/target/myfaces-converters12-1.0.1-SNAPSHOT-sources.jar
[INFO] [myfaces-builder:build-metadata {execution: default}]
Artifact: myfaces-api-1.2.6.jar have META-INF/myfaces-metadata.xml
[INFO] [myfaces-builder:make-config {execution: makefacesconfig}]
Oct 9, 2009 10:03:36 AM org.apache.myfaces.buildtools.maven2.plugin.builder.utils.ConsoleLogSystem log
INFO: FileResourceLoader : adding path '/local/continuum-1.1-beta-2/working-directory/71/myfaces-commons-converters/src/main/resources/META-INF'
Oct 9, 2009 10:03:36 AM org.apache.myfaces.buildtools.maven2.plugin.builder.utils.ConsoleLogSystem log
INFO: RelativeClasspathResourceLoader : adding path 'META-INF'
Oct 9, 2009 10:03:36 AM org.apache.myfaces.buildtools.maven2.plugin.builder.utils.ConsoleLogSystem log
INFO: Velocimacro : allowInlineLocal = true : VMs defined inline will be local to their defining template only.
[INFO] [myfaces-builder:make-converter-tags {execution: make_converter_tags}]
Oct 9, 2009 10:03:36 AM org.apache.myfaces.buildtools.maven2.plugin.builder.MakeConverterTagsMojo initVelocity
INFO: Using template from file loader: /local/continuum-1.1-beta-2/working-directory/71/myfaces-commons-converters/src/main/resources/META-INF/tagConverterClass12.vm
Oct 9, 2009 10:03:36 AM org.apache.myfaces.buildtools.maven2.plugin.builder.utils.ConsoleLogSystem log
INFO: FileResourceLoader : adding path '/local/continuum-1.1-beta-2/working-directory/71/myfaces-commons-converters/src/main/resources/META-INF'
Oct 9, 2009 10:03:36 AM org.apache.myfaces.buildtools.maven2.plugin.builder.utils.ConsoleLogSystem log
INFO: RelativeClasspathResourceLoader : adding path 'META-INF'
Oct 9, 2009 10:03:36 AM org.apache.myfaces.buildtools.maven2.plugin.builder.utils.ConsoleLogSystem log
INFO: Velocimacro : allowInlineLocal = true : VMs defined inline will be local to their defining template only.
Oct 9, 2009 10:03:36 AM org.apache.myfaces.buildtools.maven2.plugin.builder.MakeConverterTagsMojo generateConverters
INFO: Generating tag class:org.apache.myfaces.commons.converter.ConvertBooleanTag
Oct 9, 2009 10:03:36 AM org.apache.myfaces.buildtools.maven2.plugin.builder.MakeConverterTagsMojo generateConverters
INFO: Generating tag class:org.apache.myfaces.commons.converter.ConvertDateTimeTag
Oct 9, 2009 10:03:36 AM org.apache.myfaces.buildtools.maven2.plugin.builder.MakeConverterTagsMojo generateConverters
INFO: Generating tag class:org.apache.myfaces.commons.converter.ConvertEnumTag
Oct 9, 2009 10:03:36 AM org.apache.myfaces.buildtools.maven2.plugin.builder.MakeConverterTagsMojo generateConverters
INFO: Generating tag class:org.apache.myfaces.commons.converter.TypedNumberConverterTag
[INFO] [myfaces-builder:make-config {execution: makemcctld}]
Oct 9, 2009 10:03:36 AM org.apache.myfaces.buildtools.maven2.plugin.builder.utils.ConsoleLogSystem log
INFO: FileResourceLoader : adding path '/local/continuum-1.1-beta-2/working-directory/71/myfaces-commons-converters/src/main/resources/META-INF'
Oct 9, 2009 10:03:36 AM org.apache.myfaces.buildtools.maven2.plugin.builder.utils.ConsoleLogSystem log
INFO: RelativeClasspathResourceLoader : adding path 'META-INF'
Oct 9, 2009 10:03:36 AM org.apache.myfaces.buildtools.maven2.plugin.builder.utils.ConsoleLogSystem log
INFO: Velocimacro : allowInlineLocal = true : VMs defined inline will be local to their defining template only.
[INFO] [myfaces-builder:make-config {execution: makemcctaglib}]
Oct 9, 2009 10:03:37 AM org.apache.myfaces.buildtools.maven2.plugin.builder.utils.ConsoleLogSystem log
INFO: FileResourceLoader : adding path '/local/continuum-1.1-beta-2/working-directory/71/myfaces-commons-converters/src/main/resources/META-INF'
Oct 9, 2009 10:03:37 AM org.apache.myfaces.buildtools.maven2.plugin.builder.utils.ConsoleLogSystem log
INFO: RelativeClasspathResourceLoader : adding path 'META-INF'
Oct 9, 2009 10:03:37 AM org.apache.myfaces.buildtools.maven2.plugin.builder.utils.ConsoleLogSystem log
INFO: Velocimacro : allowInlineLocal = true : VMs defined inline will be local to their defining template only.
[INFO] Preparing checkstyle:check
[INFO] [checkstyle:checkstyle]
[WARNING] File encoding has not been set, using platform encoding UTF-8, i.e. build is platform dependent!
[INFO] [checkstyle:check {execution: verify-style}]
[INFO] [remote-resources:process {execution: default}]
[INFO] [resources:resources]
[INFO] Using default encoding to copy filtered resources.
[INFO] [compiler:compile]
[INFO] Compiling 4 source files to /local/continuum-1.1-beta-2/working-directory/71/myfaces-commons-converters/target/classes
[INFO] [resources:testResources]
[INFO] Using default encoding to copy filtered resources.
[INFO] [compiler:testCompile]
[INFO] Nothing to compile - all classes are up to date
[INFO] [surefire:test]
[INFO] Surefire report directory: /local/continuum-1.1-beta-2/working-directory/71/myfaces-commons-converters/target/surefire-reports

-------------------------------------------------------
 T E S T S
-------------------------------------------------------
Running org.apache.myfaces.commons.converter.TypedNumberConverterTest
Tests run: 2, Failures: 0, Errors: 0, Skipped: 0, Time elapsed: 0.17 sec
Running org.apache.myfaces.commons.converter.EnumConverterTest
No Renderer found for component {Component-Path : [Class: javax.faces.component.UIInput,Id: txt_test]} (component-family=javax.faces.Input, renderer-type=javax.faces.Text)
Oct 9, 2009 10:03:38 AM javax.faces.component.UIComponentBase getRenderer
WARNING: No Renderer found for component {Component-Path : [Class: javax.faces.component.UIInput,Id: txt_test]} (component-family=javax.faces.Input, renderer-type=javax.faces.Text)
Tests run: 2, Failures: 0, Errors: 0, Skipped: 0, Time elapsed: 0.048 sec
Running org.apache.myfaces.commons.converter.BooleanConverterTest
Tests run: 2, Failures: 0, Errors: 0, Skipped: 0, Time elapsed: 0.011 sec
Running org.apache.myfaces.commons.test.CommonsConverterClassElementTestCase
Tests run: 1, Failures: 0, Errors: 0, Skipped: 0, Time elapsed: 0.349 sec
Running org.apache.myfaces.commons.test.CommonsConverterTagLibTestCase
Tests run: 3, Failures: 0, Errors: 0, Skipped: 0, Time elapsed: 0.214 sec

Results :

Tests run: 10, Failures: 0, Errors: 0, Skipped: 0

[INFO] [jar:jar]
[INFO] Building jar: /local/continuum-1.1-beta-2/working-directory/71/myfaces-commons-converters/target/myfaces-converters12-1.0.1-SNAPSHOT.jar
[INFO] [install:install]
[INFO] Installing /local/continuum-1.1-beta-2/working-directory/71/myfaces-commons-converters/target/myfaces-converters12-1.0.1-SNAPSHOT.jar to /export/home/mrmaven/.m2/repository/org/apache/myfaces/commons/myfaces-converters12/1.0.1-SNAPSHOT/myfaces-converters12-1.0.1-SNAPSHOT.jar
[INFO] Installing /local/continuum-1.1-beta-2/working-directory/71/myfaces-commons-converters/target/myfaces-converters12-1.0.1-SNAPSHOT-sources.jar to /export/home/mrmaven/.m2/repository/org/apache/myfaces/commons/myfaces-converters12/1.0.1-SNAPSHOT/myfaces-converters12-1.0.1-SNAPSHOT-sources.jar
[INFO] [deploy:deploy]
[INFO] Retrieving previous build number from apache-maven-snapshots
Uploading: scpexe://people.apache.org/www/people.apache.org/repo/m2-snapshot-repository/org/apache/myfaces/commons/myfaces-converters12/1.0.1-SNAPSHOT/myfaces-converters12-1.0.1-SNAPSHOT.jar
[INFO] Retrieving previous metadata from apache-maven-snapshots
[INFO] Uploading repository metadata for: 'snapshot org.apache.myfaces.commons:myfaces-converters12:1.0.1-SNAPSHOT'
[INFO] Uploading project information for myfaces-converters12 1.0.1-SNAPSHOT
[INFO] Retrieving previous metadata from apache-maven-snapshots
[INFO] Uploading repository metadata for: 'artifact org.apache.myfaces.commons:myfaces-converters12'
[INFO] Retrieving previous build number from apache-maven-snapshots
Uploading: scpexe://people.apache.org/www/people.apache.org/repo/m2-snapshot-repository/org/apache/myfaces/commons/myfaces-converters12/1.0.1-SNAPSHOT/myfaces-converters12-1.0.1-SNAPSHOT-sources.jar
[INFO] ------------------------------------------------------------------------
[INFO] Building Apache MyFaces Commons Components
[INFO]    task-segment: [clean, install, source:jar, deploy]
[INFO] ------------------------------------------------------------------------
[INFO] [clean:clean]
[INFO] Deleting directory /local/continuum-1.1-beta-2/working-directory/71/myfaces-commons-components/target
[INFO] [myfaces-builder:build-metadata {execution: default}]
Artifact: myfaces-api-1.2.6.jar have META-INF/myfaces-metadata.xml
[INFO] [myfaces-builder:make-components {execution: default}]
Oct 9, 2009 10:04:13 AM org.apache.myfaces.buildtools.maven2.plugin.builder.MakeComponentsMojo initVelocity
INFO: Using template from class loader: META-INF/componentClass12.vm
Oct 9, 2009 10:04:13 AM org.apache.myfaces.buildtools.maven2.plugin.builder.utils.ConsoleLogSystem log
INFO: FileResourceLoader : adding path '/local/continuum-1.1-beta-2/working-directory/71/myfaces-commons-components/src/main/resources/META-INF'
Oct 9, 2009 10:04:13 AM org.apache.myfaces.buildtools.maven2.plugin.builder.utils.ConsoleLogSystem log
INFO: RelativeClasspathResourceLoader : adding path 'META-INF'
Oct 9, 2009 10:04:13 AM org.apache.myfaces.buildtools.maven2.plugin.builder.utils.ConsoleLogSystem log
INFO: Velocimacro : allowInlineLocal = true : VMs defined inline will be local to their defining template only.
Oct 9, 2009 10:04:13 AM org.apache.myfaces.buildtools.maven2.plugin.builder.MakeComponentsMojo generateComponents
INFO: Generating component class:org.apache.myfaces.commons.renderOne.UIRenderOne
[INFO] [myfaces-builder:make-tags {execution: default}]
Oct 9, 2009 10:04:13 AM org.apache.myfaces.buildtools.maven2.plugin.builder.MakeTagsMojo initVelocity
INFO: Using template from class loader: META-INF/tagClass12.vm
Oct 9, 2009 10:04:13 AM org.apache.myfaces.buildtools.maven2.plugin.builder.utils.ConsoleLogSystem log
INFO: FileResourceLoader : adding path '/local/continuum-1.1-beta-2/working-directory/71/myfaces-commons-components/src/main/resources/META-INF'
Oct 9, 2009 10:04:13 AM org.apache.myfaces.buildtools.maven2.plugin.builder.utils.ConsoleLogSystem log
INFO: RelativeClasspathResourceLoader : adding path 'META-INF'
Oct 9, 2009 10:04:13 AM org.apache.myfaces.buildtools.maven2.plugin.builder.utils.ConsoleLogSystem log
INFO: Velocimacro : allowInlineLocal = true : VMs defined inline will be local to their defining template only.
Oct 9, 2009 10:04:13 AM org.apache.myfaces.buildtools.maven2.plugin.builder.MakeTagsMojo generateComponents
INFO: Generating tag class:org.apache.myfaces.commons.renderOne.UIRenderOneTag
[INFO] [myfaces-builder:make-config {execution: makefacesconfig}]
Oct 9, 2009 10:04:14 AM org.apache.myfaces.buildtools.maven2.plugin.builder.utils.ConsoleLogSystem log
INFO: FileResourceLoader : adding path '/local/continuum-1.1-beta-2/working-directory/71/myfaces-commons-components/src/main/resources/META-INF'
Oct 9, 2009 10:04:14 AM org.apache.myfaces.buildtools.maven2.plugin.builder.utils.ConsoleLogSystem log
INFO: RelativeClasspathResourceLoader : adding path 'META-INF'
Oct 9, 2009 10:04:14 AM org.apache.myfaces.buildtools.maven2.plugin.builder.utils.ConsoleLogSystem log
INFO: Velocimacro : allowInlineLocal = true : VMs defined inline will be local to their defining template only.
[INFO] [myfaces-builder:make-config {execution: maketld}]
Oct 9, 2009 10:04:14 AM org.apache.myfaces.buildtools.maven2.plugin.builder.utils.ConsoleLogSystem log
INFO: FileResourceLoader : adding path '/local/continuum-1.1-beta-2/working-directory/71/myfaces-commons-components/src/main/resources/META-INF'
Oct 9, 2009 10:04:14 AM org.apache.myfaces.buildtools.maven2.plugin.builder.utils.ConsoleLogSystem log
INFO: RelativeClasspathResourceLoader : adding path 'META-INF'
Oct 9, 2009 10:04:14 AM org.apache.myfaces.buildtools.maven2.plugin.builder.utils.ConsoleLogSystem log
INFO: Velocimacro : allowInlineLocal = true : VMs defined inline will be local to their defining template only.
[INFO] [myfaces-builder:make-config {execution: makemcctaglib}]
Oct 9, 2009 10:04:14 AM org.apache.myfaces.buildtools.maven2.plugin.builder.utils.ConsoleLogSystem log
INFO: FileResourceLoader : adding path '/local/continuum-1.1-beta-2/working-directory/71/myfaces-commons-components/src/main/resources/META-INF'
Oct 9, 2009 10:04:14 AM org.apache.myfaces.buildtools.maven2.plugin.builder.utils.ConsoleLogSystem log
INFO: RelativeClasspathResourceLoader : adding path 'META-INF'
Oct 9, 2009 10:04:14 AM org.apache.myfaces.buildtools.maven2.plugin.builder.utils.ConsoleLogSystem log
INFO: Velocimacro : allowInlineLocal = true : VMs defined inline will be local to their defining template only.
[INFO] Preparing checkstyle:check
[INFO] [checkstyle:checkstyle]
[WARNING] File encoding has not been set, using platform encoding UTF-8, i.e. build is platform dependent!
[INFO] [checkstyle:check {execution: verify-style}]
[INFO] [remote-resources:process {execution: default}]
[INFO] [resources:resources]
[INFO] Using default encoding to copy filtered resources.
[INFO] [compiler:compile]
[INFO] Compiling 10 source files to /local/continuum-1.1-beta-2/working-directory/71/myfaces-commons-components/target/classes
[INFO] [resources:testResources]
[INFO] Using default encoding to copy filtered resources.
[INFO] [compiler:testCompile]
[INFO] Nothing to compile - all classes are up to date
[INFO] [surefire:test]
[INFO] Surefire report directory: /local/continuum-1.1-beta-2/working-directory/71/myfaces-commons-components/target/surefire-reports

-------------------------------------------------------
 T E S T S
-------------------------------------------------------
There are no tests to run.

Results :

Tests run: 0, Failures: 0, Errors: 0, Skipped: 0

[INFO] [jar:jar]
[INFO] Building jar: /local/continuum-1.1-beta-2/working-directory/71/myfaces-commons-components/target/myfaces-components12-1.0.1-SNAPSHOT.jar
[INFO] [install:install]
[INFO] Installing /local/continuum-1.1-beta-2/working-directory/71/myfaces-commons-components/target/myfaces-components12-1.0.1-SNAPSHOT.jar to /export/home/mrmaven/.m2/repository/org/apache/myfaces/commons/myfaces-components12/1.0.1-SNAPSHOT/myfaces-components12-1.0.1-SNAPSHOT.jar
[INFO] Preparing source:jar
[INFO] [myfaces-builder:build-metadata {execution: default}]
Artifact: myfaces-api-1.2.6.jar have META-INF/myfaces-metadata.xml
[INFO] [myfaces-builder:make-components {execution: default}]
Oct 9, 2009 10:04:18 AM org.apache.myfaces.buildtools.maven2.plugin.builder.MakeComponentsMojo initVelocity
INFO: Using template from class loader: META-INF/componentClass12.vm
Oct 9, 2009 10:04:18 AM org.apache.myfaces.buildtools.maven2.plugin.builder.utils.ConsoleLogSystem log
INFO: FileResourceLoader : adding path '/local/continuum-1.1-beta-2/working-directory/71/myfaces-commons-components/src/main/resources/META-INF'
Oct 9, 2009 10:04:18 AM org.apache.myfaces.buildtools.maven2.plugin.builder.utils.ConsoleLogSystem log
INFO: RelativeClasspathResourceLoader : adding path 'META-INF'
Oct 9, 2009 10:04:18 AM org.apache.myfaces.buildtools.maven2.plugin.builder.utils.ConsoleLogSystem log
INFO: Velocimacro : allowInlineLocal = true : VMs defined inline will be local to their defining template only.
Oct 9, 2009 10:04:18 AM org.apache.myfaces.buildtools.maven2.plugin.builder.MakeComponentsMojo generateComponents
INFO: Generating component class:org.apache.myfaces.commons.renderOne.UIRenderOne
[INFO] [myfaces-builder:make-tags {execution: default}]
Oct 9, 2009 10:04:18 AM org.apache.myfaces.buildtools.maven2.plugin.builder.MakeTagsMojo initVelocity
INFO: Using template from class loader: META-INF/tagClass12.vm
Oct 9, 2009 10:04:18 AM org.apache.myfaces.buildtools.maven2.plugin.builder.utils.ConsoleLogSystem log
INFO: FileResourceLoader : adding path '/local/continuum-1.1-beta-2/working-directory/71/myfaces-commons-components/src/main/resources/META-INF'
Oct 9, 2009 10:04:18 AM org.apache.myfaces.buildtools.maven2.plugin.builder.utils.ConsoleLogSystem log
INFO: RelativeClasspathResourceLoader : adding path 'META-INF'
Oct 9, 2009 10:04:18 AM org.apache.myfaces.buildtools.maven2.plugin.builder.utils.ConsoleLogSystem log
INFO: Velocimacro : allowInlineLocal = true : VMs defined inline will be local to their defining template only.
Oct 9, 2009 10:04:18 AM org.apache.myfaces.buildtools.maven2.plugin.builder.MakeTagsMojo generateComponents
INFO: Generating tag class:org.apache.myfaces.commons.renderOne.UIRenderOneTag
[INFO] [myfaces-builder:make-config {execution: makefacesconfig}]
Oct 9, 2009 10:04:19 AM org.apache.myfaces.buildtools.maven2.plugin.builder.utils.ConsoleLogSystem log
INFO: FileResourceLoader : adding path '/local/continuum-1.1-beta-2/working-directory/71/myfaces-commons-components/src/main/resources/META-INF'
Oct 9, 2009 10:04:19 AM org.apache.myfaces.buildtools.maven2.plugin.builder.utils.ConsoleLogSystem log
INFO: RelativeClasspathResourceLoader : adding path 'META-INF'
Oct 9, 2009 10:04:19 AM org.apache.myfaces.buildtools.maven2.plugin.builder.utils.ConsoleLogSystem log
INFO: Velocimacro : allowInlineLocal = true : VMs defined inline will be local to their defining template only.
[INFO] [myfaces-builder:make-config {execution: maketld}]
Oct 9, 2009 10:04:19 AM org.apache.myfaces.buildtools.maven2.plugin.builder.utils.ConsoleLogSystem log
INFO: FileResourceLoader : adding path '/local/continuum-1.1-beta-2/working-directory/71/myfaces-commons-components/src/main/resources/META-INF'
Oct 9, 2009 10:04:19 AM org.apache.myfaces.buildtools.maven2.plugin.builder.utils.ConsoleLogSystem log
INFO: RelativeClasspathResourceLoader : adding path 'META-INF'
Oct 9, 2009 10:04:19 AM org.apache.myfaces.buildtools.maven2.plugin.builder.utils.ConsoleLogSystem log
INFO: Velocimacro : allowInlineLocal = true : VMs defined inline will be local to their defining template only.
[INFO] [myfaces-builder:make-config {execution: makemcctaglib}]
Oct 9, 2009 10:04:19 AM org.apache.myfaces.buildtools.maven2.plugin.builder.utils.ConsoleLogSystem log
INFO: FileResourceLoader : adding path '/local/continuum-1.1-beta-2/working-directory/71/myfaces-commons-components/src/main/resources/META-INF'
Oct 9, 2009 10:04:19 AM org.apache.myfaces.buildtools.maven2.plugin.builder.utils.ConsoleLogSystem log
INFO: RelativeClasspathResourceLoader : adding path 'META-INF'
Oct 9, 2009 10:04:19 AM org.apache.myfaces.buildtools.maven2.plugin.builder.utils.ConsoleLogSystem log
INFO: Velocimacro : allowInlineLocal = true : VMs defined inline will be local to their defining template only.
[INFO] [source:jar]
[INFO] Building jar: /local/continuum-1.1-beta-2/working-directory/71/myfaces-commons-components/target/myfaces-components12-1.0.1-SNAPSHOT-sources.jar
[INFO] [myfaces-builder:build-metadata {execution: default}]
Artifact: myfaces-api-1.2.6.jar have META-INF/myfaces-metadata.xml
[INFO] [myfaces-builder:make-components {execution: default}]
Oct 9, 2009 10:04:20 AM org.apache.myfaces.buildtools.maven2.plugin.builder.MakeComponentsMojo initVelocity
INFO: Using template from class loader: META-INF/componentClass12.vm
Oct 9, 2009 10:04:20 AM org.apache.myfaces.buildtools.maven2.plugin.builder.utils.ConsoleLogSystem log
INFO: FileResourceLoader : adding path '/local/continuum-1.1-beta-2/working-directory/71/myfaces-commons-components/src/main/resources/META-INF'
Oct 9, 2009 10:04:20 AM org.apache.myfaces.buildtools.maven2.plugin.builder.utils.ConsoleLogSystem log
INFO: RelativeClasspathResourceLoader : adding path 'META-INF'
Oct 9, 2009 10:04:20 AM org.apache.myfaces.buildtools.maven2.plugin.builder.utils.ConsoleLogSystem log
INFO: Velocimacro : allowInlineLocal = true : VMs defined inline will be local to their defining template only.
Oct 9, 2009 10:04:20 AM org.apache.myfaces.buildtools.maven2.plugin.builder.MakeComponentsMojo generateComponents
INFO: Generating component class:org.apache.myfaces.commons.renderOne.UIRenderOne
[INFO] [myfaces-builder:make-tags {execution: default}]
Oct 9, 2009 10:04:20 AM org.apache.myfaces.buildtools.maven2.plugin.builder.MakeTagsMojo initVelocity
INFO: Using template from class loader: META-INF/tagClass12.vm
Oct 9, 2009 10:04:20 AM org.apache.myfaces.buildtools.maven2.plugin.builder.utils.ConsoleLogSystem log
INFO: FileResourceLoader : adding path '/local/continuum-1.1-beta-2/working-directory/71/myfaces-commons-components/src/main/resources/META-INF'
Oct 9, 2009 10:04:20 AM org.apache.myfaces.buildtools.maven2.plugin.builder.utils.ConsoleLogSystem log
INFO: RelativeClasspathResourceLoader : adding path 'META-INF'
Oct 9, 2009 10:04:20 AM org.apache.myfaces.buildtools.maven2.plugin.builder.utils.ConsoleLogSystem log
INFO: Velocimacro : allowInlineLocal = true : VMs defined inline will be local to their defining template only.
Oct 9, 2009 10:04:20 AM org.apache.myfaces.buildtools.maven2.plugin.builder.MakeTagsMojo generateComponents
INFO: Generating tag class:org.apache.myfaces.commons.renderOne.UIRenderOneTag
[INFO] [myfaces-builder:make-config {execution: makefacesconfig}]
Oct 9, 2009 10:04:20 AM org.apache.myfaces.buildtools.maven2.plugin.builder.utils.ConsoleLogSystem log
INFO: FileResourceLoader : adding path '/local/continuum-1.1-beta-2/working-directory/71/myfaces-commons-components/src/main/resources/META-INF'
Oct 9, 2009 10:04:20 AM org.apache.myfaces.buildtools.maven2.plugin.builder.utils.ConsoleLogSystem log
INFO: RelativeClasspathResourceLoader : adding path 'META-INF'
Oct 9, 2009 10:04:20 AM org.apache.myfaces.buildtools.maven2.plugin.builder.utils.ConsoleLogSystem log
INFO: Velocimacro : allowInlineLocal = true : VMs defined inline will be local to their defining template only.
[INFO] [myfaces-builder:make-config {execution: maketld}]
Oct 9, 2009 10:04:20 AM org.apache.myfaces.buildtools.maven2.plugin.builder.utils.ConsoleLogSystem log
INFO: FileResourceLoader : adding path '/local/continuum-1.1-beta-2/working-directory/71/myfaces-commons-components/src/main/resources/META-INF'
Oct 9, 2009 10:04:20 AM org.apache.myfaces.buildtools.maven2.plugin.builder.utils.ConsoleLogSystem log
INFO: RelativeClasspathResourceLoader : adding path 'META-INF'
Oct 9, 2009 10:04:20 AM org.apache.myfaces.buildtools.maven2.plugin.builder.utils.ConsoleLogSystem log
INFO: Velocimacro : allowInlineLocal = true : VMs defined inline will be local to their defining template only.
[INFO] [myfaces-builder:make-config {execution: makemcctaglib}]
Oct 9, 2009 10:04:21 AM org.apache.myfaces.buildtools.maven2.plugin.builder.utils.ConsoleLogSystem log
INFO: FileResourceLoader : adding path '/local/continuum-1.1-beta-2/working-directory/71/myfaces-commons-components/src/main/resources/META-INF'
Oct 9, 2009 10:04:21 AM org.apache.myfaces.buildtools.maven2.plugin.builder.utils.ConsoleLogSystem log
INFO: RelativeClasspathResourceLoader : adding path 'META-INF'
Oct 9, 2009 10:04:21 AM org.apache.myfaces.buildtools.maven2.plugin.builder.utils.ConsoleLogSystem log
INFO: Velocimacro : allowInlineLocal = true : VMs defined inline will be local to their defining template only.
[INFO] Preparing checkstyle:check
[INFO] [checkstyle:checkstyle]
[WARNING] File encoding has not been set, using platform encoding UTF-8, i.e. build is platform dependent!
[INFO] [checkstyle:check {execution: verify-style}]
[INFO] [remote-resources:process {execution: default}]
[INFO] [resources:resources]
[INFO] Using default encoding to copy filtered resources.
[INFO] [compiler:compile]
[INFO] Compiling 2 source files to /local/continuum-1.1-beta-2/working-directory/71/myfaces-commons-components/target/classes
[INFO] [resources:testResources]
[INFO] Using default encoding to copy filtered resources.
[INFO] [compiler:testCompile]
[INFO] Nothing to compile - all classes are up to date
[INFO] [surefire:test]
[INFO] Surefire report directory: /local/continuum-1.1-beta-2/working-directory/71/myfaces-commons-components/target/surefire-reports

-------------------------------------------------------
 T E S T S
-------------------------------------------------------
There are no tests to run.

Results :

Tests run: 0, Failures: 0, Errors: 0, Skipped: 0

[INFO] [jar:jar]
[INFO] Building jar: /local/continuum-1.1-beta-2/working-directory/71/myfaces-commons-components/target/myfaces-components12-1.0.1-SNAPSHOT.jar
[INFO] [install:install]
[INFO] Installing /local/continuum-1.1-beta-2/working-directory/71/myfaces-commons-components/target/myfaces-components12-1.0.1-SNAPSHOT.jar to /export/home/mrmaven/.m2/repository/org/apache/myfaces/commons/myfaces-components12/1.0.1-SNAPSHOT/myfaces-components12-1.0.1-SNAPSHOT.jar
[INFO] Installing /local/continuum-1.1-beta-2/working-directory/71/myfaces-commons-components/target/myfaces-components12-1.0.1-SNAPSHOT-sources.jar to /export/home/mrmaven/.m2/repository/org/apache/myfaces/commons/myfaces-components12/1.0.1-SNAPSHOT/myfaces-components12-1.0.1-SNAPSHOT-sources.jar
[INFO] [deploy:deploy]
[INFO] Retrieving previous build number from apache-maven-snapshots
Uploading: scpexe://people.apache.org/www/people.apache.org/repo/m2-snapshot-repository/org/apache/myfaces/commons/myfaces-components12/1.0.1-SNAPSHOT/myfaces-components12-1.0.1-SNAPSHOT.jar
[INFO] Retrieving previous metadata from apache-maven-snapshots
[INFO] Uploading repository metadata for: 'snapshot org.apache.myfaces.commons:myfaces-components12:1.0.1-SNAPSHOT'
[INFO] Retrieving previous metadata from apache-maven-snapshots
[INFO] Uploading repository metadata for: 'artifact org.apache.myfaces.commons:myfaces-components12'
[INFO] Uploading project information for myfaces-components12 1.0.1-SNAPSHOT
[INFO] Retrieving previous build number from apache-maven-snapshots
Uploading: scpexe://people.apache.org/www/people.apache.org/repo/m2-snapshot-repository/org/apache/myfaces/commons/myfaces-components12/1.0.1-SNAPSHOT/myfaces-components12-1.0.1-SNAPSHOT-sources.jar
[INFO] ------------------------------------------------------------------------
[INFO] Building Apache MyFaces Commons Examples
[INFO]    task-segment: [clean, install, source:jar, deploy]
[INFO] ------------------------------------------------------------------------
[INFO] [clean:clean]
[INFO] Deleting directory /local/continuum-1.1-beta-2/working-directory/71/myfaces-commons-examples/target
[INFO] Preparing checkstyle:check
[INFO] snapshot org.apache.myfaces.commons:myfaces-validators12:1.0.1-SNAPSHOT: checking for updates from java.net
[INFO] snapshot org.apache.myfaces.commons:myfaces-validators12:1.0.1-SNAPSHOT: checking for updates from apache.snapshots
[INFO] snapshot org.apache.myfaces.commons:myfaces-converters12:1.0.1-SNAPSHOT: checking for updates from java.net
[INFO] snapshot org.apache.myfaces.commons:myfaces-converters12:1.0.1-SNAPSHOT: checking for updates from apache.snapshots
[INFO] snapshot org.apache.myfaces.commons:myfaces-components12:1.0.1-SNAPSHOT: checking for updates from java.net
[INFO] snapshot org.apache.myfaces.commons:myfaces-components12:1.0.1-SNAPSHOT: checking for updates from apache.snapshots
[INFO] [checkstyle:checkstyle]
[WARNING] File encoding has not been set, using platform encoding UTF-8, i.e. build is platform dependent!
[WARNING] Unable to locate Source XRef to link to - DISABLED
[INFO] [checkstyle:check {execution: verify-style}]
[INFO] [remote-resources:process {execution: default}]
[INFO] [resources:resources]
[INFO] Using default encoding to copy filtered resources.
[INFO] [compiler:compile]
[INFO] Compiling 8 source files to /local/continuum-1.1-beta-2/working-directory/71/myfaces-commons-examples/target/classes
[INFO] [resources:testResources]
[INFO] Using default encoding to copy filtered resources.
[INFO] [compiler:testCompile]
[INFO] No sources to compile
[INFO] [surefire:test]
[INFO] Surefire report directory: /local/continuum-1.1-beta-2/working-directory/71/myfaces-commons-examples/target/surefire-reports

-------------------------------------------------------
 T E S T S
-------------------------------------------------------
There are no tests to run.

Results :

Tests run: 0, Failures: 0, Errors: 0, Skipped: 0

[INFO] [war:war]
[INFO] Packaging webapp
[INFO] Assembling webapp[myfaces-commons-examples12] in [/local/continuum-1.1-beta-2/working-directory/71/myfaces-commons-examples/target/myfaces-commons-examples12]
[INFO] Processing war project
[INFO] Copying webapp resources[/local/continuum-1.1-beta-2/working-directory/71/myfaces-commons-examples/src/main/webapp]
[INFO] Webapp assembled in[792 msecs]
[INFO] Building war: /local/continuum-1.1-beta-2/working-directory/71/myfaces-commons-examples/target/myfaces-commons-examples12.war
[INFO] [install:install]
[INFO] Installing /local/continuum-1.1-beta-2/working-directory/71/myfaces-commons-examples/target/myfaces-commons-examples12.war to /export/home/mrmaven/.m2/repository/org/apache/myfaces/commons/myfaces-commons-examples12/1.0.1-SNAPSHOT/myfaces-commons-examples12-1.0.1-SNAPSHOT.war
[INFO] Preparing source:jar
[INFO] No goals needed for project - skipping
[INFO] [source:jar]
[INFO] Building jar: /local/continuum-1.1-beta-2/working-directory/71/myfaces-commons-examples/target/myfaces-commons-examples12-sources.jar
[INFO] Preparing checkstyle:check
[INFO] [checkstyle:checkstyle]
[WARNING] File encoding has not been set, using platform encoding UTF-8, i.e. build is platform dependent!
[WARNING] Unable to locate Source XRef to link to - DISABLED
[INFO] [checkstyle:check {execution: verify-style}]
[INFO] [remote-resources:process {execution: default}]
[INFO] [resources:resources]
[INFO] Using default encoding to copy filtered resources.
[INFO] [compiler:compile]
[INFO] Nothing to compile - all classes are up to date
[INFO] [resources:testResources]
[INFO] Using default encoding to copy filtered resources.
[INFO] [compiler:testCompile]
[INFO] No sources to compile
[INFO] [surefire:test]
[INFO] Surefire report directory: /local/continuum-1.1-beta-2/working-directory/71/myfaces-commons-examples/target/surefire-reports

-------------------------------------------------------
 T E S T S
-------------------------------------------------------
There are no tests to run.

Results :

Tests run: 0, Failures: 0, Errors: 0, Skipped: 0

[INFO] [war:war]
[INFO] Packaging webapp
[INFO] Assembling webapp[myfaces-commons-examples12] in [/local/continuum-1.1-beta-2/working-directory/71/myfaces-commons-examples/target/myfaces-commons-examples12]
[INFO] Dependency[Dependency {groupId=org.apache.myfaces.core, artifactId=myfaces-api, version=1.2.6, type=jar}] has changed (was Dependency {groupId=org.apache.myfaces.core, artifactId=myfaces-api, version=1.2.6, type=jar}).
[INFO] Dependency[Dependency {groupId=org.apache.myfaces.core, artifactId=myfaces-impl, version=1.2.6, type=jar}] has changed (was Dependency {groupId=org.apache.myfaces.core, artifactId=myfaces-impl, version=1.2.6, type=jar}).
[INFO] Dependency[Dependency {groupId=org.apache.myfaces.commons, artifactId=myfaces-validators12, version=1.0.1-SNAPSHOT, type=jar}] has changed (was Dependency {groupId=org.apache.myfaces.commons, artifactId=myfaces-validators12, version=1.0.1-SNAPSHOT, type=jar}).
[INFO] Dependency[Dependency {groupId=org.apache.myfaces.commons, artifactId=myfaces-converters12, version=1.0.1-SNAPSHOT, type=jar}] has changed (was Dependency {groupId=org.apache.myfaces.commons, artifactId=myfaces-converters12, version=1.0.1-SNAPSHOT, type=jar}).
[INFO] Dependency[Dependency {groupId=org.apache.myfaces.commons, artifactId=myfaces-components12, version=1.0.1-SNAPSHOT, type=jar}] has changed (was Dependency {groupId=org.apache.myfaces.commons, artifactId=myfaces-components12, version=1.0.1-SNAPSHOT, type=jar}).
[INFO] Dependency[Dependency {groupId=com.lowagie, artifactId=itext, version=1.4.8, type=jar}] has changed (was Dependency {groupId=com.lowagie, artifactId=itext, version=1.4.8, type=jar}).
[INFO] Dependency[Dependency {groupId=poi, artifactId=poi, version=2.5.1-final-20040804, type=jar}] has changed (was Dependency {groupId=poi, artifactId=poi, version=2.5.1-final-20040804, type=jar}).
[INFO] Dependency[Dependency {groupId=jstl, artifactId=jstl, version=1.2, type=jar}] has changed (was Dependency {groupId=jstl, artifactId=jstl, version=1.2, type=jar}).
[INFO] Processing war project
[INFO] Copying webapp resources[/local/continuum-1.1-beta-2/working-directory/71/myfaces-commons-examples/src/main/webapp]
[INFO] Webapp assembled in[154 msecs]
[INFO] Building war: /local/continuum-1.1-beta-2/working-directory/71/myfaces-commons-examples/target/myfaces-commons-examples12.war
[INFO] [install:install]
[INFO] Installing /local/continuum-1.1-beta-2/working-directory/71/myfaces-commons-examples/target/myfaces-commons-examples12.war to /export/home/mrmaven/.m2/repository/org/apache/myfaces/commons/myfaces-commons-examples12/1.0.1-SNAPSHOT/myfaces-commons-examples12-1.0.1-SNAPSHOT.war
[INFO] Installing /local/continuum-1.1-beta-2/working-directory/71/myfaces-commons-examples/target/myfaces-commons-examples12-sources.jar to /export/home/mrmaven/.m2/repository/org/apache/myfaces/commons/myfaces-commons-examples12/1.0.1-SNAPSHOT/myfaces-commons-examples12-1.0.1-SNAPSHOT-sources.jar
[INFO] [deploy:deploy]
[INFO] Retrieving previous build number from apache-maven-snapshots
Uploading: scpexe://people.apache.org/www/people.apache.org/repo/m2-snapshot-repository/org/apache/myfaces/commons/myfaces-commons-examples12/1.0.1-SNAPSHOT/myfaces-commons-examples12-1.0.1-SNAPSHOT.war
[INFO] Retrieving previous metadata from apache-maven-snapshots
[INFO] Uploading repository metadata for: 'artifact org.apache.myfaces.commons:myfaces-commons-examples12'
[INFO] Uploading project information for myfaces-commons-examples12 1.0.1-SNAPSHOT
[INFO] Retrieving previous metadata from apache-maven-snapshots
[INFO] Uploading repository metadata for: 'snapshot org.apache.myfaces.commons:myfaces-commons-examples12:1.0.1-SNAPSHOT'
[INFO] Retrieving previous build number from apache-maven-snapshots
Uploading: scpexe://people.apache.org/www/people.apache.org/repo/m2-snapshot-repository/org/apache/myfaces/commons/myfaces-commons-examples12/1.0.1-SNAPSHOT/myfaces-commons-examples12-1.0.1-SNAPSHOT-sources.jar
[INFO] ------------------------------------------------------------------------
[INFO] Building Apache MyFaces Commons Facelets Examples
[INFO]    task-segment: [clean, install, source:jar, deploy]
[INFO] ------------------------------------------------------------------------
[INFO] [clean:clean]
[INFO] Deleting directory /local/continuum-1.1-beta-2/working-directory/71/myfaces-commons-facelets-examples/target
[INFO] Preparing checkstyle:check
[INFO] [checkstyle:checkstyle]
[WARNING] File encoding has not been set, using platform encoding UTF-8, i.e. build is platform dependent!
[WARNING] Unable to locate Source XRef to link to - DISABLED
[INFO] [checkstyle:check {execution: verify-style}]
[INFO] [remote-resources:process {execution: default}]
[INFO] [resources:resources]
[INFO] Using default encoding to copy filtered resources.
[INFO] [compiler:compile]
[INFO] Compiling 8 source files to /local/continuum-1.1-beta-2/working-directory/71/myfaces-commons-facelets-examples/target/classes
[INFO] [resources:testResources]
[INFO] Using default encoding to copy filtered resources.
[INFO] [compiler:testCompile]
[INFO] No sources to compile
[INFO] [surefire:test]
[INFO] Surefire report directory: /local/continuum-1.1-beta-2/working-directory/71/myfaces-commons-facelets-examples/target/surefire-reports

-------------------------------------------------------
 T E S T S
-------------------------------------------------------
There are no tests to run.

Results :

Tests run: 0, Failures: 0, Errors: 0, Skipped: 0

[INFO] [war:war]
[INFO] Packaging webapp
[INFO] Assembling webapp[myfaces-commons-facelets-examples12] in [/local/continuum-1.1-beta-2/working-directory/71/myfaces-commons-facelets-examples/target/myfaces-commons-facelets-examples12]
[INFO] Processing war project
[INFO] Copying webapp resources[/local/continuum-1.1-beta-2/working-directory/71/myfaces-commons-facelets-examples/src/main/webapp]
[INFO] Webapp assembled in[335 msecs]
[INFO] Building war: /local/continuum-1.1-beta-2/working-directory/71/myfaces-commons-facelets-examples/target/myfaces-commons-facelets-examples12.war
[INFO] [install:install]
[INFO] Installing /local/continuum-1.1-beta-2/working-directory/71/myfaces-commons-facelets-examples/target/myfaces-commons-facelets-examples12.war to /export/home/mrmaven/.m2/repository/org/apache/myfaces/commons/myfaces-commons-facelets-examples12/1.0.1-SNAPSHOT/myfaces-commons-facelets-examples12-1.0.1-SNAPSHOT.war
[INFO] Preparing source:jar
[INFO] No goals needed for project - skipping
[INFO] [source:jar]
[INFO] Building jar: /local/continuum-1.1-beta-2/working-directory/71/myfaces-commons-facelets-examples/target/myfaces-commons-facelets-examples12-sources.jar
[INFO] Preparing checkstyle:check
[INFO] [checkstyle:checkstyle]
[WARNING] File encoding has not been set, using platform encoding UTF-8, i.e. build is platform dependent!
[WARNING] Unable to locate Source XRef to link to - DISABLED
[INFO] [checkstyle:check {execution: verify-style}]
[INFO] [remote-resources:process {execution: default}]
[INFO] [resources:resources]
[INFO] Using default encoding to copy filtered resources.
[INFO] [compiler:compile]
[INFO] Nothing to compile - all classes are up to date
[INFO] [resources:testResources]
[INFO] Using default encoding to copy filtered resources.
[INFO] [compiler:testCompile]
[INFO] No sources to compile
[INFO] [surefire:test]
[INFO] Surefire report directory: /local/continuum-1.1-beta-2/working-directory/71/myfaces-commons-facelets-examples/target/surefire-reports

-------------------------------------------------------
 T E S T S
-------------------------------------------------------
There are no tests to run.

Results :

Tests run: 0, Failures: 0, Errors: 0, Skipped: 0

[INFO] [war:war]
[INFO] Packaging webapp
[INFO] Assembling webapp[myfaces-commons-facelets-examples12] in [/local/continuum-1.1-beta-2/working-directory/71/myfaces-commons-facelets-examples/target/myfaces-commons-facelets-examples12]
[INFO] Dependency[Dependency {groupId=com.sun.facelets, artifactId=jsf-facelets, version=1.1.14, type=jar}] has changed (was Dependency {groupId=com.sun.facelets, artifactId=jsf-facelets, version=1.1.14, type=jar}).
[INFO] Dependency[Dependency {groupId=org.apache.myfaces.core, artifactId=myfaces-api, version=1.2.6, type=jar}] has changed (was Dependency {groupId=org.apache.myfaces.core, artifactId=myfaces-api, version=1.2.6, type=jar}).
[INFO] Dependency[Dependency {groupId=org.apache.myfaces.core, artifactId=myfaces-impl, version=1.2.6, type=jar}] has changed (was Dependency {groupId=org.apache.myfaces.core, artifactId=myfaces-impl, version=1.2.6, type=jar}).
[INFO] Dependency[Dependency {groupId=org.apache.myfaces.commons, artifactId=myfaces-validators12, version=1.0.1-SNAPSHOT, type=jar}] has changed (was Dependency {groupId=org.apache.myfaces.commons, artifactId=myfaces-validators12, version=1.0.1-SNAPSHOT, type=jar}).
[INFO] Dependency[Dependency {groupId=org.apache.myfaces.commons, artifactId=myfaces-converters12, version=1.0.1-SNAPSHOT, type=jar}] has changed (was Dependency {groupId=org.apache.myfaces.commons, artifactId=myfaces-converters12, version=1.0.1-SNAPSHOT, type=jar}).
[INFO] Dependency[Dependency {groupId=org.apache.myfaces.commons, artifactId=myfaces-components12, version=1.0.1-SNAPSHOT, type=jar}] has changed (was Dependency {groupId=org.apache.myfaces.commons, artifactId=myfaces-components12, version=1.0.1-SNAPSHOT, type=jar}).
[INFO] Dependency[Dependency {groupId=com.lowagie, artifactId=itext, version=1.4.8, type=jar}] has changed (was Dependency {groupId=com.lowagie, artifactId=itext, version=1.4.8, type=jar}).
[INFO] Dependency[Dependency {groupId=poi, artifactId=poi, version=2.5.1-final-20040804, type=jar}] has changed (was Dependency {groupId=poi, artifactId=poi, version=2.5.1-final-20040804, type=jar}).
[INFO] Dependency[Dependency {groupId=jstl, artifactId=jstl, version=1.2, type=jar}] has changed (was Dependency {groupId=jstl, artifactId=jstl, version=1.2, type=jar}).
[INFO] Processing war project
[INFO] Copying webapp resources[/local/continuum-1.1-beta-2/working-directory/71/myfaces-commons-facelets-examples/src/main/webapp]
[INFO] Webapp assembled in[183 msecs]
[INFO] Building war: /local/continuum-1.1-beta-2/working-directory/71/myfaces-commons-facelets-examples/target/myfaces-commons-facelets-examples12.war
[INFO] [install:install]
[INFO] Installing /local/continuum-1.1-beta-2/working-directory/71/myfaces-commons-facelets-examples/target/myfaces-commons-facelets-examples12.war to /export/home/mrmaven/.m2/repository/org/apache/myfaces/commons/myfaces-commons-facelets-examples12/1.0.1-SNAPSHOT/myfaces-commons-facelets-examples12-1.0.1-SNAPSHOT.war
[INFO] Installing /local/continuum-1.1-beta-2/working-directory/71/myfaces-commons-facelets-examples/target/myfaces-commons-facelets-examples12-sources.jar to /export/home/mrmaven/.m2/repository/org/apache/myfaces/commons/myfaces-commons-facelets-examples12/1.0.1-SNAPSHOT/myfaces-commons-facelets-examples12-1.0.1-SNAPSHOT-sources.jar
[INFO] [deploy:deploy]
[INFO] Retrieving previous build number from apache-maven-snapshots
Uploading: scpexe://people.apache.org/www/people.apache.org/repo/m2-snapshot-repository/org/apache/myfaces/commons/myfaces-commons-facelets-examples12/1.0.1-SNAPSHOT/myfaces-commons-facelets-examples12-1.0.1-SNAPSHOT.war
[INFO] Retrieving previous metadata from apache-maven-snapshots
[INFO] Uploading repository metadata for: 'snapshot org.apache.myfaces.commons:myfaces-commons-facelets-examples12:1.0.1-SNAPSHOT'
[INFO] Uploading project information for myfaces-commons-facelets-examples12 1.0.1-SNAPSHOT
[INFO] Retrieving previous metadata from apache-maven-snapshots
[INFO] Uploading repository metadata for: 'artifact org.apache.myfaces.commons:myfaces-commons-facelets-examples12'
[INFO] Retrieving previous build number from apache-maven-snapshots
Uploading: scpexe://people.apache.org/www/people.apache.org/repo/m2-snapshot-repository/org/apache/myfaces/commons/myfaces-commons-facelets-examples12/1.0.1-SNAPSHOT/myfaces-commons-facelets-examples12-1.0.1-SNAPSHOT-sources.jar
[INFO] ------------------------------------------------------------------------
[INFO] Building Apache MyFaces Commons Agent Detection
[INFO]    task-segment: [clean, install, source:jar, deploy]
[INFO] ------------------------------------------------------------------------
[INFO] [clean:clean]
[INFO] Preparing checkstyle:check
[INFO] [checkstyle:checkstyle]
[WARNING] File encoding has not been set, using platform encoding UTF-8, i.e. build is platform dependent!
[WARNING] Unable to locate Source XRef to link to - DISABLED
[INFO] [checkstyle:check {execution: verify-style}]
[INFO] [remote-resources:process {execution: default}]
[INFO] [resources:resources]
[INFO] Using default encoding to copy filtered resources.
[INFO] [compiler:compile]
[INFO] Compiling 10 source files to /local/continuum-1.1-beta-2/working-directory/71/myfaces-commons-agent/target/classes
[INFO] [resources:testResources]
[INFO] Using default encoding to copy filtered resources.
[INFO] [compiler:testCompile]
[INFO] No sources to compile
[INFO] [surefire:test]
[INFO] Surefire report directory: /local/continuum-1.1-beta-2/working-directory/71/myfaces-commons-agent/target/surefire-reports

-------------------------------------------------------
 T E S T S
-------------------------------------------------------
There are no tests to run.

Results :

Tests run: 0, Failures: 0, Errors: 0, Skipped: 0

[INFO] [jar:jar]
[INFO] Building jar: /local/continuum-1.1-beta-2/working-directory/71/myfaces-commons-agent/target/myfaces-commons-agent-1.0.0-SNAPSHOT.jar
[INFO] [javadoc:jar {execution: attach-javadoc}]
[WARNING] -top option is not supported on Java version < 1.6. Ignore this option.
Loading source files for package org.apache.myfaces.commons.agent.impl...
Loading source files for package org.apache.myfaces.commons.agent...
Constructing Javadoc information...
Standard Doclet version 1.5.0_21
Building tree for all the packages and classes...
Generating /local/continuum-1.1-beta-2/working-directory/71/myfaces-commons-agent/target/apidocs/org/apache/myfaces/commons/agent/impl//AgentFactoryImpl.html...
Generating /local/continuum-1.1-beta-2/working-directory/71/myfaces-commons-agent/target/apidocs/org/apache/myfaces/commons/agent/impl//AgentImpl.html...
Generating /local/continuum-1.1-beta-2/working-directory/71/myfaces-commons-agent/target/apidocs/org/apache/myfaces/commons/agent//Agent.html...
Generating /local/continuum-1.1-beta-2/working-directory/71/myfaces-commons-agent/target/apidocs/org/apache/myfaces/commons/agent//AgentConstants.html...
Generating /local/continuum-1.1-beta-2/working-directory/71/myfaces-commons-agent/target/apidocs/org/apache/myfaces/commons/agent//AgentFactory.html...
Generating /local/continuum-1.1-beta-2/working-directory/71/myfaces-commons-agent/target/apidocs/org/apache/myfaces/commons/agent//CapabilityConstants.html...
Generating /local/continuum-1.1-beta-2/working-directory/71/myfaces-commons-agent/target/apidocs/org/apache/myfaces/commons/agent//CapabilityKey.html...
Generating /local/continuum-1.1-beta-2/working-directory/71/myfaces-commons-agent/target/apidocs/org/apache/myfaces/commons/agent//CapabilityMap.html...
Generating /local/continuum-1.1-beta-2/working-directory/71/myfaces-commons-agent/target/apidocs/org/apache/myfaces/commons/agent//CapabilityValue.html...
Generating /local/continuum-1.1-beta-2/working-directory/71/myfaces-commons-agent/target/apidocs/org/apache/myfaces/commons/agent//XhtmlAgentConstants.html...
Generating /local/continuum-1.1-beta-2/working-directory/71/myfaces-commons-agent/target/apidocs/overview-frame.html...
Generating /local/continuum-1.1-beta-2/working-directory/71/myfaces-commons-agent/target/apidocs/org/apache/myfaces/commons/agent//package-frame.html...
Generating /local/continuum-1.1-beta-2/working-directory/71/myfaces-commons-agent/target/apidocs/org/apache/myfaces/commons/agent//package-summary.html...
Generating /local/continuum-1.1-beta-2/working-directory/71/myfaces-commons-agent/target/apidocs/org/apache/myfaces/commons/agent//package-tree.html...
Generating /local/continuum-1.1-beta-2/working-directory/71/myfaces-commons-agent/target/apidocs/org/apache/myfaces/commons/agent/impl//package-frame.html...
Generating /local/continuum-1.1-beta-2/working-directory/71/myfaces-commons-agent/target/apidocs/org/apache/myfaces/commons/agent/impl//package-summary.html...
Generating /local/continuum-1.1-beta-2/working-directory/71/myfaces-commons-agent/target/apidocs/org/apache/myfaces/commons/agent/impl//package-tree.html...
Generating /local/continuum-1.1-beta-2/working-directory/71/myfaces-commons-agent/target/apidocs/constant-values.html...
Generating /local/continuum-1.1-beta-2/working-directory/71/myfaces-commons-agent/target/apidocs/org/apache/myfaces/commons/agent/impl/class-use//AgentFactoryImpl.html...
Generating /local/continuum-1.1-beta-2/working-directory/71/myfaces-commons-agent/target/apidocs/org/apache/myfaces/commons/agent/impl/class-use//AgentImpl.html...
Generating /local/continuum-1.1-beta-2/working-directory/71/myfaces-commons-agent/target/apidocs/org/apache/myfaces/commons/agent/class-use//CapabilityConstants.html...
Generating /local/continuum-1.1-beta-2/working-directory/71/myfaces-commons-agent/target/apidocs/org/apache/myfaces/commons/agent/class-use//CapabilityValue.html...
Generating /local/continuum-1.1-beta-2/working-directory/71/myfaces-commons-agent/target/apidocs/org/apache/myfaces/commons/agent/class-use//AgentFactory.html...
Generating /local/continuum-1.1-beta-2/working-directory/71/myfaces-commons-agent/target/apidocs/org/apache/myfaces/commons/agent/class-use//Agent.html...
Generating /local/continuum-1.1-beta-2/working-directory/71/myfaces-commons-agent/target/apidocs/org/apache/myfaces/commons/agent/class-use//AgentConstants.html...
Generating /local/continuum-1.1-beta-2/working-directory/71/myfaces-commons-agent/target/apidocs/org/apache/myfaces/commons/agent/class-use//CapabilityKey.html...
Generating /local/continuum-1.1-beta-2/working-directory/71/myfaces-commons-agent/target/apidocs/org/apache/myfaces/commons/agent/class-use//CapabilityMap.html...
Generating /local/continuum-1.1-beta-2/working-directory/71/myfaces-commons-agent/target/apidocs/org/apache/myfaces/commons/agent/class-use//XhtmlAgentConstants.html...
Generating /local/continuum-1.1-beta-2/working-directory/71/myfaces-commons-agent/target/apidocs/org/apache/myfaces/commons/agent//package-use.html...
Generating /local/continuum-1.1-beta-2/working-directory/71/myfaces-commons-agent/target/apidocs/org/apache/myfaces/commons/agent/impl//package-use.html...
Building index for all the packages and classes...
Generating /local/continuum-1.1-beta-2/working-directory/71/myfaces-commons-agent/target/apidocs/overview-tree.html...
Generating /local/continuum-1.1-beta-2/working-directory/71/myfaces-commons-agent/target/apidocs/index-all.html...
Generating /local/continuum-1.1-beta-2/working-directory/71/myfaces-commons-agent/target/apidocs/deprecated-list.html...
Building index for all classes...
Generating /local/continuum-1.1-beta-2/working-directory/71/myfaces-commons-agent/target/apidocs/allclasses-frame.html...
Generating /local/continuum-1.1-beta-2/working-directory/71/myfaces-commons-agent/target/apidocs/allclasses-noframe.html...
Generating /local/continuum-1.1-beta-2/working-directory/71/myfaces-commons-agent/target/apidocs/index.html...
Generating /local/continuum-1.1-beta-2/working-directory/71/myfaces-commons-agent/target/apidocs/overview-summary.html...
Generating /local/continuum-1.1-beta-2/working-directory/71/myfaces-commons-agent/target/apidocs/help-doc.html...
Generating /local/continuum-1.1-beta-2/working-directory/71/myfaces-commons-agent/target/apidocs/stylesheet.css...
5 warnings
[WARNING] Javadoc Warnings
[WARNING] /local/continuum-1.1-beta-2/working-directory/71/myfaces-commons-agent/src/main/java/org/apache/myfaces/commons/agent/AgentFactory.java:45: warning - @return tag has no arguments.
[WARNING] /local/continuum-1.1-beta-2/working-directory/71/myfaces-commons-agent/src/main/java/org/apache/myfaces/commons/agent/CapabilityMap.java:184: warning - @return tag has no arguments.
[WARNING] /local/continuum-1.1-beta-2/working-directory/71/myfaces-commons-agent/src/main/java/org/apache/myfaces/commons/agent/CapabilityMap.java:160: warning - @return tag has no arguments.
[WARNING] /local/continuum-1.1-beta-2/working-directory/71/myfaces-commons-agent/src/main/java/org/apache/myfaces/commons/agent/CapabilityMap.java:120: warning - @return tag has no arguments.
[WARNING] /local/continuum-1.1-beta-2/working-directory/71/myfaces-commons-agent/src/main/java/org/apache/myfaces/commons/agent/CapabilityMap.java:176: warning - @return tag has no arguments.
[INFO] Building jar: /local/continuum-1.1-beta-2/working-directory/71/myfaces-commons-agent/target/myfaces-commons-agent-1.0.0-SNAPSHOT-javadoc.jar
[INFO] Preparing source:jar
[WARNING] Removing: check from forked lifecycle, to prevent recursive invocation.
[WARNING] Removing: jar from forked lifecycle, to prevent recursive invocation.
[INFO] No goals needed for project - skipping
[INFO] [source:jar {execution: attach-source}]
[INFO] Building jar: /local/continuum-1.1-beta-2/working-directory/71/myfaces-commons-agent/target/myfaces-commons-agent-1.0.0-SNAPSHOT-sources.jar
[INFO] [install:install]
[INFO] Installing /local/continuum-1.1-beta-2/working-directory/71/myfaces-commons-agent/target/myfaces-commons-agent-1.0.0-SNAPSHOT.jar to /export/home/mrmaven/.m2/repository/org/apache/myfaces/commons/myfaces-commons-agent/1.0.0-SNAPSHOT/myfaces-commons-agent-1.0.0-SNAPSHOT.jar
[INFO] Installing /local/continuum-1.1-beta-2/working-directory/71/myfaces-commons-agent/target/myfaces-commons-agent-1.0.0-SNAPSHOT-javadoc.jar to /export/home/mrmaven/.m2/repository/org/apache/myfaces/commons/myfaces-commons-agent/1.0.0-SNAPSHOT/myfaces-commons-agent-1.0.0-SNAPSHOT-javadoc.jar
[INFO] Installing /local/continuum-1.1-beta-2/working-directory/71/myfaces-commons-agent/target/myfaces-commons-agent-1.0.0-SNAPSHOT-sources.jar to /export/home/mrmaven/.m2/repository/org/apache/myfaces/commons/myfaces-commons-agent/1.0.0-SNAPSHOT/myfaces-commons-agent-1.0.0-SNAPSHOT-sources.jar
[INFO] Preparing source:jar
[WARNING] Removing: jar from forked lifecycle, to prevent recursive invocation.
[INFO] No goals needed for project - skipping
[INFO] [source:jar]
[INFO] Building jar: /local/continuum-1.1-beta-2/working-directory/71/myfaces-commons-agent/target/myfaces-commons-agent-1.0.0-SNAPSHOT-sources.jar
[INFO] Preparing checkstyle:check
[INFO] [checkstyle:checkstyle]
[WARNING] File encoding has not been set, using platform encoding UTF-8, i.e. build is platform dependent!
[WARNING] Unable to locate Source XRef to link to - DISABLED
[INFO] [checkstyle:check {execution: verify-style}]
[INFO] [remote-resources:process {execution: default}]
[INFO] [resources:resources]
[INFO] Using default encoding to copy filtered resources.
[INFO] [compiler:compile]
[INFO] Nothing to compile - all classes are up to date
[INFO] [resources:testResources]
[INFO] Using default encoding to copy filtered resources.
[INFO] [compiler:testCompile]
[INFO] No sources to compile
[INFO] [surefire:test]
[INFO] Surefire report directory: /local/continuum-1.1-beta-2/working-directory/71/myfaces-commons-agent/target/surefire-reports

-------------------------------------------------------
 T E S T S
-------------------------------------------------------
There are no tests to run.

Results :

Tests run: 0, Failures: 0, Errors: 0, Skipped: 0

[INFO] [jar:jar]
[INFO] Building jar: /local/continuum-1.1-beta-2/working-directory/71/myfaces-commons-agent/target/myfaces-commons-agent-1.0.0-SNAPSHOT.jar
[INFO] [javadoc:jar {execution: attach-javadoc}]
[WARNING] -top option is not supported on Java version < 1.6. Ignore this option.
Loading source files for package org.apache.myfaces.commons.agent.impl...
Loading source files for package org.apache.myfaces.commons.agent...
Constructing Javadoc information...
Standard Doclet version 1.5.0_21
Building tree for all the packages and classes...
Generating /local/continuum-1.1-beta-2/working-directory/71/myfaces-commons-agent/target/apidocs/org/apache/myfaces/commons/agent/impl//AgentFactoryImpl.html...
Generating /local/continuum-1.1-beta-2/working-directory/71/myfaces-commons-agent/target/apidocs/org/apache/myfaces/commons/agent/impl//AgentImpl.html...
Generating /local/continuum-1.1-beta-2/working-directory/71/myfaces-commons-agent/target/apidocs/org/apache/myfaces/commons/agent//Agent.html...
Generating /local/continuum-1.1-beta-2/working-directory/71/myfaces-commons-agent/target/apidocs/org/apache/myfaces/commons/agent//AgentConstants.html...
Generating /local/continuum-1.1-beta-2/working-directory/71/myfaces-commons-agent/target/apidocs/org/apache/myfaces/commons/agent//AgentFactory.html...
Generating /local/continuum-1.1-beta-2/working-directory/71/myfaces-commons-agent/target/apidocs/org/apache/myfaces/commons/agent//CapabilityConstants.html...
Generating /local/continuum-1.1-beta-2/working-directory/71/myfaces-commons-agent/target/apidocs/org/apache/myfaces/commons/agent//CapabilityKey.html...
Generating /local/continuum-1.1-beta-2/working-directory/71/myfaces-commons-agent/target/apidocs/org/apache/myfaces/commons/agent//CapabilityMap.html...
Generating /local/continuum-1.1-beta-2/working-directory/71/myfaces-commons-agent/target/apidocs/org/apache/myfaces/commons/agent//CapabilityValue.html...
Generating /local/continuum-1.1-beta-2/working-directory/71/myfaces-commons-agent/target/apidocs/org/apache/myfaces/commons/agent//XhtmlAgentConstants.html...
Generating /local/continuum-1.1-beta-2/working-directory/71/myfaces-commons-agent/target/apidocs/overview-frame.html...
Generating /local/continuum-1.1-beta-2/working-directory/71/myfaces-commons-agent/target/apidocs/org/apache/myfaces/commons/agent//package-frame.html...
Generating /local/continuum-1.1-beta-2/working-directory/71/myfaces-commons-agent/target/apidocs/org/apache/myfaces/commons/agent//package-summary.html...
Generating /local/continuum-1.1-beta-2/working-directory/71/myfaces-commons-agent/target/apidocs/org/apache/myfaces/commons/agent//package-tree.html...
Generating /local/continuum-1.1-beta-2/working-directory/71/myfaces-commons-agent/target/apidocs/org/apache/myfaces/commons/agent/impl//package-frame.html...
Generating /local/continuum-1.1-beta-2/working-directory/71/myfaces-commons-agent/target/apidocs/org/apache/myfaces/commons/agent/impl//package-summary.html...
Generating /local/continuum-1.1-beta-2/working-directory/71/myfaces-commons-agent/target/apidocs/org/apache/myfaces/commons/agent/impl//package-tree.html...
Generating /local/continuum-1.1-beta-2/working-directory/71/myfaces-commons-agent/target/apidocs/constant-values.html...
Generating /local/continuum-1.1-beta-2/working-directory/71/myfaces-commons-agent/target/apidocs/org/apache/myfaces/commons/agent/impl/class-use//AgentFactoryImpl.html...
Generating /local/continuum-1.1-beta-2/working-directory/71/myfaces-commons-agent/target/apidocs/org/apache/myfaces/commons/agent/impl/class-use//AgentImpl.html...
Generating /local/continuum-1.1-beta-2/working-directory/71/myfaces-commons-agent/target/apidocs/org/apache/myfaces/commons/agent/class-use//CapabilityConstants.html...
Generating /local/continuum-1.1-beta-2/working-directory/71/myfaces-commons-agent/target/apidocs/org/apache/myfaces/commons/agent/class-use//CapabilityValue.html...
Generating /local/continuum-1.1-beta-2/working-directory/71/myfaces-commons-agent/target/apidocs/org/apache/myfaces/commons/agent/class-use//AgentFactory.html...
Generating /local/continuum-1.1-beta-2/working-directory/71/myfaces-commons-agent/target/apidocs/org/apache/myfaces/commons/agent/class-use//Agent.html...
Generating /local/continuum-1.1-beta-2/working-directory/71/myfaces-commons-agent/target/apidocs/org/apache/myfaces/commons/agent/class-use//AgentConstants.html...
Generating /local/continuum-1.1-beta-2/working-directory/71/myfaces-commons-agent/target/apidocs/org/apache/myfaces/commons/agent/class-use//CapabilityKey.html...
Generating /local/continuum-1.1-beta-2/working-directory/71/myfaces-commons-agent/target/apidocs/org/apache/myfaces/commons/agent/class-use//CapabilityMap.html...
Generating /local/continuum-1.1-beta-2/working-directory/71/myfaces-commons-agent/target/apidocs/org/apache/myfaces/commons/agent/class-use//XhtmlAgentConstants.html...
Generating /local/continuum-1.1-beta-2/working-directory/71/myfaces-commons-agent/target/apidocs/org/apache/myfaces/commons/agent//package-use.html...
Generating /local/continuum-1.1-beta-2/working-directory/71/myfaces-commons-agent/target/apidocs/org/apache/myfaces/commons/agent/impl//package-use.html...
Building index for all the packages and classes...
Generating /local/continuum-1.1-beta-2/working-directory/71/myfaces-commons-agent/target/apidocs/overview-tree.html...
Generating /local/continuum-1.1-beta-2/working-directory/71/myfaces-commons-agent/target/apidocs/index-all.html...
Generating /local/continuum-1.1-beta-2/working-directory/71/myfaces-commons-agent/target/apidocs/deprecated-list.html...
Building index for all classes...
Generating /local/continuum-1.1-beta-2/working-directory/71/myfaces-commons-agent/target/apidocs/allclasses-frame.html...
Generating /local/continuum-1.1-beta-2/working-directory/71/myfaces-commons-agent/target/apidocs/allclasses-noframe.html...
Generating /local/continuum-1.1-beta-2/working-directory/71/myfaces-commons-agent/target/apidocs/index.html...
Generating /local/continuum-1.1-beta-2/working-directory/71/myfaces-commons-agent/target/apidocs/overview-summary.html...
Generating /local/continuum-1.1-beta-2/working-directory/71/myfaces-commons-agent/target/apidocs/help-doc.html...
Generating /local/continuum-1.1-beta-2/working-directory/71/myfaces-commons-agent/target/apidocs/stylesheet.css...
5 warnings
[WARNING] Javadoc Warnings
[WARNING] /local/continuum-1.1-beta-2/working-directory/71/myfaces-commons-agent/src/main/java/org/apache/myfaces/commons/agent/AgentFactory.java:45: warning - @return tag has no arguments.
[WARNING] /local/continuum-1.1-beta-2/working-directory/71/myfaces-commons-agent/src/main/java/org/apache/myfaces/commons/agent/CapabilityMap.java:184: warning - @return tag has no arguments.
[WARNING] /local/continuum-1.1-beta-2/working-directory/71/myfaces-commons-agent/src/main/java/org/apache/myfaces/commons/agent/CapabilityMap.java:160: warning - @return tag has no arguments.
[WARNING] /local/continuum-1.1-beta-2/working-directory/71/myfaces-commons-agent/src/main/java/org/apache/myfaces/commons/agent/CapabilityMap.java:120: warning - @return tag has no arguments.
[WARNING] /local/continuum-1.1-beta-2/working-directory/71/myfaces-commons-agent/src/main/java/org/apache/myfaces/commons/agent/CapabilityMap.java:176: warning - @return tag has no arguments.
[INFO] Building jar: /local/continuum-1.1-beta-2/working-directory/71/myfaces-commons-agent/target/myfaces-commons-agent-1.0.0-SNAPSHOT-javadoc.jar
[INFO] Preparing source:jar
[WARNING] Removing: check from forked lifecycle, to prevent recursive invocation.
[WARNING] Removing: jar from forked lifecycle, to prevent recursive invocation.
[INFO] No goals needed for project - skipping
[INFO] [source:jar {execution: attach-source}]
[INFO] Building jar: /local/continuum-1.1-beta-2/working-directory/71/myfaces-commons-agent/target/myfaces-commons-agent-1.0.0-SNAPSHOT-sources.jar
[INFO] [install:install]
[INFO] Installing /local/continuum-1.1-beta-2/working-directory/71/myfaces-commons-agent/target/myfaces-commons-agent-1.0.0-SNAPSHOT.jar to /export/home/mrmaven/.m2/repository/org/apache/myfaces/commons/myfaces-commons-agent/1.0.0-SNAPSHOT/myfaces-commons-agent-1.0.0-SNAPSHOT.jar
[INFO] Installing /local/continuum-1.1-beta-2/working-directory/71/myfaces-commons-agent/target/myfaces-commons-agent-1.0.0-SNAPSHOT-javadoc.jar to /export/home/mrmaven/.m2/repository/org/apache/myfaces/commons/myfaces-commons-agent/1.0.0-SNAPSHOT/myfaces-commons-agent-1.0.0-SNAPSHOT-javadoc.jar
[INFO] Installing /local/continuum-1.1-beta-2/working-directory/71/myfaces-commons-agent/target/myfaces-commons-agent-1.0.0-SNAPSHOT-sources.jar to /export/home/mrmaven/.m2/repository/org/apache/myfaces/commons/myfaces-commons-agent/1.0.0-SNAPSHOT/myfaces-commons-agent-1.0.0-SNAPSHOT-sources.jar
[INFO] Installing /local/continuum-1.1-beta-2/working-directory/71/myfaces-commons-agent/target/myfaces-commons-agent-1.0.0-SNAPSHOT-sources.jar to /export/home/mrmaven/.m2/repository/org/apache/myfaces/commons/myfaces-commons-agent/1.0.0-SNAPSHOT/myfaces-commons-agent-1.0.0-SNAPSHOT-sources.jar
[INFO] Installing /local/continuum-1.1-beta-2/working-directory/71/myfaces-commons-agent/target/myfaces-commons-agent-1.0.0-SNAPSHOT-javadoc.jar to /export/home/mrmaven/.m2/repository/org/apache/myfaces/commons/myfaces-commons-agent/1.0.0-SNAPSHOT/myfaces-commons-agent-1.0.0-SNAPSHOT-javadoc.jar
[INFO] Installing /local/continuum-1.1-beta-2/working-directory/71/myfaces-commons-agent/target/myfaces-commons-agent-1.0.0-SNAPSHOT-sources.jar to /export/home/mrmaven/.m2/repository/org/apache/myfaces/commons/myfaces-commons-agent/1.0.0-SNAPSHOT/myfaces-commons-agent-1.0.0-SNAPSHOT-sources.jar
[INFO] [deploy:deploy]
[INFO] Retrieving previous build number from apache-maven-snapshots
[INFO] repository metadata for: 'snapshot org.apache.myfaces.commons:myfaces-commons-agent:1.0.0-SNAPSHOT' could not be found on repository: apache-maven-snapshots, so will be created
Uploading: scpexe://people.apache.org/www/people.apache.org/repo/m2-snapshot-repository/org/apache/myfaces/commons/myfaces-commons-agent/1.0.0-SNAPSHOT/myfaces-commons-agent-1.0.0-SNAPSHOT.jar
[INFO] Retrieving previous metadata from apache-maven-snapshots
[INFO] repository metadata for: 'artifact org.apache.myfaces.commons:myfaces-commons-agent' could not be found on repository: apache-maven-snapshots, so will be created
[INFO] Uploading repository metadata for: 'artifact org.apache.myfaces.commons:myfaces-commons-agent'
[INFO] Retrieving previous metadata from apache-maven-snapshots
[INFO] repository metadata for: 'snapshot org.apache.myfaces.commons:myfaces-commons-agent:1.0.0-SNAPSHOT' could not be found on repository: apache-maven-snapshots, so will be created
[INFO] Uploading repository metadata for: 'snapshot org.apache.myfaces.commons:myfaces-commons-agent:1.0.0-SNAPSHOT'
[INFO] Uploading project information for myfaces-commons-agent 1.0.0-SNAPSHOT
[INFO] Retrieving previous build number from apache-maven-snapshots
Uploading: scpexe://people.apache.org/www/people.apache.org/repo/m2-snapshot-repository/org/apache/myfaces/commons/myfaces-commons-agent/1.0.0-SNAPSHOT/myfaces-commons-agent-1.0.0-SNAPSHOT-javadoc.jar
[INFO] Retrieving previous build number from apache-maven-snapshots
Uploading: scpexe://people.apache.org/www/people.apache.org/repo/m2-snapshot-repository/org/apache/myfaces/commons/myfaces-commons-agent/1.0.0-SNAPSHOT/myfaces-commons-agent-1.0.0-SNAPSHOT-sources.jar
[INFO] Retrieving previous build number from apache-maven-snapshots
Uploading: scpexe://people.apache.org/www/people.apache.org/repo/m2-snapshot-repository/org/apache/myfaces/commons/myfaces-commons-agent/1.0.0-SNAPSHOT/myfaces-commons-agent-1.0.0-SNAPSHOT-sources.jar
[INFO] Retrieving previous build number from apache-maven-snapshots
Uploading: scpexe://people.apache.org/www/people.apache.org/repo/m2-snapshot-repository/org/apache/myfaces/commons/myfaces-commons-agent/1.0.0-SNAPSHOT/myfaces-commons-agent-1.0.0-SNAPSHOT-javadoc.jar
[INFO] Retrieving previous build number from apache-maven-snapshots
Uploading: scpexe://people.apache.org/www/people.apache.org/repo/m2-snapshot-repository/org/apache/myfaces/commons/myfaces-commons-agent/1.0.0-SNAPSHOT/myfaces-commons-agent-1.0.0-SNAPSHOT-sources.jar
[INFO] ------------------------------------------------------------------------
[INFO] Building Apache MyFaces Common Async Lifecycle
[INFO]    task-segment: [clean, install, source:jar, deploy]
[INFO] ------------------------------------------------------------------------
[INFO] [clean:clean]
[INFO] Deleting directory /local/continuum-1.1-beta-2/working-directory/71/myfaces-async-lifecycle/target
[INFO] Preparing checkstyle:check
[INFO] [checkstyle:checkstyle]
[WARNING] File encoding has not been set, using platform encoding UTF-8, i.e. build is platform dependent!
[INFO] [checkstyle:check {execution: verify-style}]
[INFO] [remote-resources:process {execution: default}]
[INFO] [resources:resources]
[INFO] Using default encoding to copy filtered resources.
[INFO] [compiler:compile]
[INFO] Compiling 4 source files to /local/continuum-1.1-beta-2/working-directory/71/myfaces-async-lifecycle/target/classes
[INFO] [resources:testResources]
[INFO] Using default encoding to copy filtered resources.
[INFO] [compiler:testCompile]
[INFO] No sources to compile
[INFO] [surefire:test]
[INFO] Surefire report directory: /local/continuum-1.1-beta-2/working-directory/71/myfaces-async-lifecycle/target/surefire-reports

-------------------------------------------------------
 T E S T S
-------------------------------------------------------
There are no tests to run.

Results :

Tests run: 0, Failures: 0, Errors: 0, Skipped: 0

[INFO] [jar:jar]
[INFO] Building jar: /local/continuum-1.1-beta-2/working-directory/71/myfaces-async-lifecycle/target/myfaces-async-lifecycle-1.0.1-SNAPSHOT.jar
[INFO] [install:install]
[INFO] Installing /local/continuum-1.1-beta-2/working-directory/71/myfaces-async-lifecycle/target/myfaces-async-lifecycle-1.0.1-SNAPSHOT.jar to /export/home/mrmaven/.m2/repository/org/apache/myfaces/commons/myfaces-async-lifecycle/1.0.1-SNAPSHOT/myfaces-async-lifecycle-1.0.1-SNAPSHOT.jar
[INFO] Preparing source:jar
[INFO] No goals needed for project - skipping
[INFO] [source:jar]
[INFO] Building jar: /local/continuum-1.1-beta-2/working-directory/71/myfaces-async-lifecycle/target/myfaces-async-lifecycle-1.0.1-SNAPSHOT-sources.jar
[INFO] Preparing checkstyle:check
[INFO] [checkstyle:checkstyle]
[WARNING] File encoding has not been set, using platform encoding UTF-8, i.e. build is platform dependent!
[INFO] [checkstyle:check {execution: verify-style}]
[INFO] [remote-resources:process {execution: default}]
[INFO] [resources:resources]
[INFO] Using default encoding to copy filtered resources.
[INFO] [compiler:compile]
[INFO] Nothing to compile - all classes are up to date
[INFO] [resources:testResources]
[INFO] Using default encoding to copy filtered resources.
[INFO] [compiler:testCompile]
[INFO] No sources to compile
[INFO] [surefire:test]
[INFO] Surefire report directory: /local/continuum-1.1-beta-2/working-directory/71/myfaces-async-lifecycle/target/surefire-reports

-------------------------------------------------------
 T E S T S
-------------------------------------------------------
There are no tests to run.

Results :

Tests run: 0, Failures: 0, Errors: 0, Skipped: 0

[INFO] [jar:jar]
[INFO] [install:install]
[INFO] Installing /local/continuum-1.1-beta-2/working-directory/71/myfaces-async-lifecycle/target/myfaces-async-lifecycle-1.0.1-SNAPSHOT.jar to /export/home/mrmaven/.m2/repository/org/apache/myfaces/commons/myfaces-async-lifecycle/1.0.1-SNAPSHOT/myfaces-async-lifecycle-1.0.1-SNAPSHOT.jar
[INFO] Installing /local/continuum-1.1-beta-2/working-directory/71/myfaces-async-lifecycle/target/myfaces-async-lifecycle-1.0.1-SNAPSHOT-sources.jar to /export/home/mrmaven/.m2/repository/org/apache/myfaces/commons/myfaces-async-lifecycle/1.0.1-SNAPSHOT/myfaces-async-lifecycle-1.0.1-SNAPSHOT-sources.jar
[INFO] [deploy:deploy]
[INFO] Retrieving previous build number from apache-maven-snapshots
Uploading: scpexe://people.apache.org/www/people.apache.org/repo/m2-snapshot-repository/org/apache/myfaces/commons/myfaces-async-lifecycle/1.0.1-SNAPSHOT/myfaces-async-lifecycle-1.0.1-SNAPSHOT.jar
[INFO] Retrieving previous metadata from apache-maven-snapshots
[INFO] Uploading repository metadata for: 'snapshot org.apache.myfaces.commons:myfaces-async-lifecycle:1.0.1-SNAPSHOT'
[INFO] Retrieving previous metadata from apache-maven-snapshots
[INFO] Uploading repository metadata for: 'artifact org.apache.myfaces.commons:myfaces-async-lifecycle'
[INFO] Uploading project information for myfaces-async-lifecycle 1.0.1-SNAPSHOT
[INFO] Retrieving previous build number from apache-maven-snapshots
Uploading: scpexe://people.apache.org/www/people.apache.org/repo/m2-snapshot-repository/org/apache/myfaces/commons/myfaces-async-lifecycle/1.0.1-SNAPSHOT/myfaces-async-lifecycle-1.0.1-SNAPSHOT-sources.jar
[INFO] ------------------------------------------------------------------------
[INFO] Building Apache MyFaces Commons Site
[INFO]    task-segment: [clean, install, source:jar, deploy]
[INFO] ------------------------------------------------------------------------
[INFO] [clean:clean]
[INFO] [site:attach-descriptor]
[INFO] Parent project loaded from repository.
[INFO] [install:install]
[INFO] Installing /local/continuum-1.1-beta-2/working-directory/71/myfaces-commons-site/pom.xml to /export/home/mrmaven/.m2/repository/org/apache/myfaces/commons/myfaces-commons-site/1.0.1-SNAPSHOT/myfaces-commons-site-1.0.1-SNAPSHOT.pom
[INFO] Preparing source:jar
[INFO] No goals needed for project - skipping
[INFO] [source:jar]
[INFO] [site:attach-descriptor]
[INFO] Parent project loaded from repository.
[INFO] [install:install]
[INFO] Installing /local/continuum-1.1-beta-2/working-directory/71/myfaces-commons-site/pom.xml to /export/home/mrmaven/.m2/repository/org/apache/myfaces/commons/myfaces-commons-site/1.0.1-SNAPSHOT/myfaces-commons-site-1.0.1-SNAPSHOT.pom
[INFO] [deploy:deploy]
[INFO] Retrieving previous build number from apache-maven-snapshots
Uploading: scpexe://people.apache.org/www/people.apache.org/repo/m2-snapshot-repository/org/apache/myfaces/commons/myfaces-commons-site/1.0.1-SNAPSHOT/myfaces-commons-site-1.0.1-SNAPSHOT.pom
[INFO] Retrieving previous metadata from apache-maven-snapshots
[INFO] Uploading repository metadata for: 'artifact org.apache.myfaces.commons:myfaces-commons-site'
[INFO] Retrieving previous metadata from apache-maven-snapshots
[INFO] Uploading repository metadata for: 'snapshot org.apache.myfaces.commons:myfaces-commons-site:1.0.1-SNAPSHOT'
[INFO] Uploading site descriptor for myfaces-commons-site 1.0.1-SNAPSHOT site.xml
[INFO] ------------------------------------------------------------------------
[INFO] Building Apache MyFaces Common Jetty Continuation Lifecycle
[INFO]    task-segment: [clean, install, source:jar, deploy]
[INFO] ------------------------------------------------------------------------
[INFO] [clean:clean]
[INFO] Deleting directory /local/continuum-1.1-beta-2/working-directory/71/myfaces-jetty-continuation-lifecycle/target
[INFO] Preparing checkstyle:check
[INFO] [checkstyle:checkstyle]
[WARNING] File encoding has not been set, using platform encoding UTF-8, i.e. build is platform dependent!
[WARNING] Unable to locate Source XRef to link to - DISABLED
[INFO] [checkstyle:check {execution: verify-style}]
[INFO] [remote-resources:process {execution: default}]
[INFO] [resources:resources]
[INFO] Using default encoding to copy filtered resources.
[INFO] [compiler:compile]
[INFO] Compiling 6 source files to /local/continuum-1.1-beta-2/working-directory/71/myfaces-jetty-continuation-lifecycle/target/classes
[INFO] [resources:testResources]
[INFO] Using default encoding to copy filtered resources.
[INFO] [compiler:testCompile]
[INFO] No sources to compile
[INFO] [surefire:test]
[INFO] Surefire report directory: /local/continuum-1.1-beta-2/working-directory/71/myfaces-jetty-continuation-lifecycle/target/surefire-reports

-------------------------------------------------------
 T E S T S
-------------------------------------------------------
There are no tests to run.

Results :

Tests run: 0, Failures: 0, Errors: 0, Skipped: 0

[INFO] [jar:jar]
[INFO] Building jar: /local/continuum-1.1-beta-2/working-directory/71/myfaces-jetty-continuation-lifecycle/target/myfaces-jetty-continuation-lifecycle-1.0.1-SNAPSHOT.jar
[INFO] [install:install]
[INFO] Installing /local/continuum-1.1-beta-2/working-directory/71/myfaces-jetty-continuation-lifecycle/target/myfaces-jetty-continuation-lifecycle-1.0.1-SNAPSHOT.jar to /export/home/mrmaven/.m2/repository/org/apache/myfaces/commons/myfaces-jetty-continuation-lifecycle/1.0.1-SNAPSHOT/myfaces-jetty-continuation-lifecycle-1.0.1-SNAPSHOT.jar
[INFO] Preparing source:jar
[INFO] No goals needed for project - skipping
[INFO] [source:jar]
[INFO] Building jar: /local/continuum-1.1-beta-2/working-directory/71/myfaces-jetty-continuation-lifecycle/target/myfaces-jetty-continuation-lifecycle-1.0.1-SNAPSHOT-sources.jar
[INFO] Preparing checkstyle:check
[INFO] [checkstyle:checkstyle]
[WARNING] File encoding has not been set, using platform encoding UTF-8, i.e. build is platform dependent!
[WARNING] Unable to locate Source XRef to link to - DISABLED
[INFO] [checkstyle:check {execution: verify-style}]
[INFO] [remote-resources:process {execution: default}]
[INFO] [resources:resources]
[INFO] Using default encoding to copy filtered resources.
[INFO] [compiler:compile]
[INFO] Nothing to compile - all classes are up to date
[INFO] [resources:testResources]
[INFO] Using default encoding to copy filtered resources.
[INFO] [compiler:testCompile]
[INFO] No sources to compile
[INFO] [surefire:test]
[INFO] Surefire report directory: /local/continuum-1.1-beta-2/working-directory/71/myfaces-jetty-continuation-lifecycle/target/surefire-reports

-------------------------------------------------------
 T E S T S
-------------------------------------------------------
There are no tests to run.

Results :

Tests run: 0, Failures: 0, Errors: 0, Skipped: 0

[INFO] [jar:jar]
[INFO] [install:install]
[INFO] Installing /local/continuum-1.1-beta-2/working-directory/71/myfaces-jetty-continuation-lifecycle/target/myfaces-jetty-continuation-lifecycle-1.0.1-SNAPSHOT.jar to /export/home/mrmaven/.m2/repository/org/apache/myfaces/commons/myfaces-jetty-continuation-lifecycle/1.0.1-SNAPSHOT/myfaces-jetty-continuation-lifecycle-1.0.1-SNAPSHOT.jar
[INFO] Installing /local/continuum-1.1-beta-2/working-directory/71/myfaces-jetty-continuation-lifecycle/target/myfaces-jetty-continuation-lifecycle-1.0.1-SNAPSHOT-sources.jar to /export/home/mrmaven/.m2/repository/org/apache/myfaces/commons/myfaces-jetty-continuation-lifecycle/1.0.1-SNAPSHOT/myfaces-jetty-continuation-lifecycle-1.0.1-SNAPSHOT-sources.jar
[INFO] [deploy:deploy]
[INFO] Retrieving previous build number from apache-maven-snapshots
Uploading: scpexe://people.apache.org/www/people.apache.org/repo/m2-snapshot-repository/org/apache/myfaces/commons/myfaces-jetty-continuation-lifecycle/1.0.1-SNAPSHOT/myfaces-jetty-continuation-lifecycle-1.0.1-SNAPSHOT.jar
[INFO] Retrieving previous metadata from apache-maven-snapshots
[INFO] Uploading repository metadata for: 'artifact org.apache.myfaces.commons:myfaces-jetty-continuation-lifecycle'
[INFO] Uploading project information for myfaces-jetty-continuation-lifecycle 1.0.1-SNAPSHOT
[INFO] Retrieving previous metadata from apache-maven-snapshots
[INFO] Uploading repository metadata for: 'snapshot org.apache.myfaces.commons:myfaces-jetty-continuation-lifecycle:1.0.1-SNAPSHOT'
[INFO] Retrieving previous build number from apache-maven-snapshots
Uploading: scpexe://people.apache.org/www/people.apache.org/repo/m2-snapshot-repository/org/apache/myfaces/commons/myfaces-jetty-continuation-lifecycle/1.0.1-SNAPSHOT/myfaces-jetty-continuation-lifecycle-1.0.1-SNAPSHOT-sources.jar
[INFO] ------------------------------------------------------------------------
[INFO] Building Async Example Webapp
[INFO]    task-segment: [clean, install, source:jar, deploy]
[INFO] ------------------------------------------------------------------------
[INFO] [clean:clean]
[INFO] Deleting directory /local/continuum-1.1-beta-2/working-directory/71/myfaces-jetty-continuation-example/target
[INFO] Preparing checkstyle:check
[INFO] snapshot org.apache.myfaces.commons:myfaces-jetty-continuation-lifecycle:1.0.1-SNAPSHOT: checking for updates from java.net
[INFO] snapshot org.apache.myfaces.commons:myfaces-jetty-continuation-lifecycle:1.0.1-SNAPSHOT: checking for updates from apache.snapshots
[INFO] [checkstyle:checkstyle]
[WARNING] File encoding has not been set, using platform encoding UTF-8, i.e. build is platform dependent!
[WARNING] Unable to locate Source XRef to link to - DISABLED
[INFO] [checkstyle:check {execution: verify-style}]
[INFO] [remote-resources:process {execution: default}]
[INFO] [resources:resources]
[INFO] Using default encoding to copy filtered resources.
[INFO] [compiler:compile]
[INFO] Compiling 1 source file to /local/continuum-1.1-beta-2/working-directory/71/myfaces-jetty-continuation-example/target/classes
[INFO] [resources:testResources]
[INFO] Using default encoding to copy filtered resources.
[INFO] [compiler:testCompile]
[INFO] No sources to compile
[INFO] [surefire:test]
[INFO] Surefire report directory: /local/continuum-1.1-beta-2/working-directory/71/myfaces-jetty-continuation-example/target/surefire-reports

-------------------------------------------------------
 T E S T S
-------------------------------------------------------
There are no tests to run.

Results :

Tests run: 0, Failures: 0, Errors: 0, Skipped: 0

[INFO] [war:war]
[INFO] Packaging webapp
[INFO] Assembling webapp[myfaces-jetty-continuation-example] in [/local/continuum-1.1-beta-2/working-directory/71/myfaces-jetty-continuation-example/target/myfaces-jetty-continuation-example]
[INFO] Processing war project
[INFO] Copying webapp resources[/local/continuum-1.1-beta-2/working-directory/71/myfaces-jetty-continuation-example/src/main/webapp]
[INFO] Webapp assembled in[357 msecs]
[INFO] Building war: /local/continuum-1.1-beta-2/working-directory/71/myfaces-jetty-continuation-example/target/myfaces-jetty-continuation-example.war
[INFO] [install:install]
[INFO] Installing /local/continuum-1.1-beta-2/working-directory/71/myfaces-jetty-continuation-example/target/myfaces-jetty-continuation-example.war to /export/home/mrmaven/.m2/repository/org/apache/myfaces/commons/myfaces-jetty-continuation-example/1.0.1-SNAPSHOT/myfaces-jetty-continuation-example-1.0.1-SNAPSHOT.war
[INFO] Preparing source:jar
[INFO] No goals needed for project - skipping
[INFO] [source:jar]
[INFO] Building jar: /local/continuum-1.1-beta-2/working-directory/71/myfaces-jetty-continuation-example/target/myfaces-jetty-continuation-example-sources.jar
[INFO] Preparing checkstyle:check
[INFO] [checkstyle:checkstyle]
[WARNING] File encoding has not been set, using platform encoding UTF-8, i.e. build is platform dependent!
[WARNING] Unable to locate Source XRef to link to - DISABLED
[INFO] [checkstyle:check {execution: verify-style}]
[INFO] [remote-resources:process {execution: default}]
[INFO] [resources:resources]
[INFO] Using default encoding to copy filtered resources.
[INFO] [compiler:compile]
[INFO] Nothing to compile - all classes are up to date
[INFO] [resources:testResources]
[INFO] Using default encoding to copy filtered resources.
[INFO] [compiler:testCompile]
[INFO] No sources to compile
[INFO] [surefire:test]
[INFO] Surefire report directory: /local/continuum-1.1-beta-2/working-directory/71/myfaces-jetty-continuation-example/target/surefire-reports

-------------------------------------------------------
 T E S T S
-------------------------------------------------------
There are no tests to run.

Results :

Tests run: 0, Failures: 0, Errors: 0, Skipped: 0

[INFO] [war:war]
[INFO] Packaging webapp
[INFO] Assembling webapp[myfaces-jetty-continuation-example] in [/local/continuum-1.1-beta-2/working-directory/71/myfaces-jetty-continuation-example/target/myfaces-jetty-continuation-example]
[INFO] Dependency[Dependency {groupId=org.apache.myfaces.commons, artifactId=myfaces-jetty-continuation-lifecycle, version=1.0.1-SNAPSHOT, type=jar}] has changed (was Dependency {groupId=org.apache.myfaces.commons, artifactId=myfaces-jetty-continuation-lifecycle, version=1.0.1-SNAPSHOT, type=jar}).
[INFO] Dependency[Dependency {groupId=org.apache.myfaces.core, artifactId=myfaces-api, version=1.2.6, type=jar}] has changed (was Dependency {groupId=org.apache.myfaces.core, artifactId=myfaces-api, version=1.2.6, type=jar}).
[INFO] Dependency[Dependency {groupId=org.apache.myfaces.core, artifactId=myfaces-impl, version=1.2.6, type=jar}] has changed (was Dependency {groupId=org.apache.myfaces.core, artifactId=myfaces-impl, version=1.2.6, type=jar}).
[INFO] Dependency[Dependency {groupId=commons-collections, artifactId=commons-collections, version=3.2.1, type=jar}] has changed (was Dependency {groupId=commons-collections, artifactId=commons-collections, version=3.2.1, type=jar}).
[INFO] Processing war project
[INFO] Copying webapp resources[/local/continuum-1.1-beta-2/working-directory/71/myfaces-jetty-continuation-example/src/main/webapp]
[INFO] Webapp assembled in[170 msecs]
[INFO] Building war: /local/continuum-1.1-beta-2/working-directory/71/myfaces-jetty-continuation-example/target/myfaces-jetty-continuation-example.war
[INFO] [install:install]
[INFO] Installing /local/continuum-1.1-beta-2/working-directory/71/myfaces-jetty-continuation-example/target/myfaces-jetty-continuation-example.war to /export/home/mrmaven/.m2/repository/org/apache/myfaces/commons/myfaces-jetty-continuation-example/1.0.1-SNAPSHOT/myfaces-jetty-continuation-example-1.0.1-SNAPSHOT.war
[INFO] Installing /local/continuum-1.1-beta-2/working-directory/71/myfaces-jetty-continuation-example/target/myfaces-jetty-continuation-example-sources.jar to /export/home/mrmaven/.m2/repository/org/apache/myfaces/commons/myfaces-jetty-continuation-example/1.0.1-SNAPSHOT/myfaces-jetty-continuation-example-1.0.1-SNAPSHOT-sources.jar
[INFO] [deploy:deploy]
[INFO] Retrieving previous build number from apache-maven-snapshots
Uploading: scpexe://people.apache.org/www/people.apache.org/repo/m2-snapshot-repository/org/apache/myfaces/commons/myfaces-jetty-continuation-example/1.0.1-SNAPSHOT/myfaces-jetty-continuation-example-1.0.1-SNAPSHOT.war
[INFO] Retrieving previous metadata from apache-maven-snapshots
[INFO] Uploading repository metadata for: 'snapshot org.apache.myfaces.commons:myfaces-jetty-continuation-example:1.0.1-SNAPSHOT'
[INFO] Retrieving previous metadata from apache-maven-snapshots
[INFO] Uploading repository metadata for: 'artifact org.apache.myfaces.commons:myfaces-jetty-continuation-example'
[INFO] Uploading project information for myfaces-jetty-continuation-example 1.0.1-SNAPSHOT
[INFO] Retrieving previous build number from apache-maven-snapshots
Uploading: scpexe://people.apache.org/www/people.apache.org/repo/m2-snapshot-repository/org/apache/myfaces/commons/myfaces-jetty-continuation-example/1.0.1-SNAPSHOT/myfaces-jetty-continuation-example-1.0.1-SNAPSHOT-sources.jar
[INFO] ------------------------------------------------------------------------
[INFO] Building Apache MyFaces Common Weblogic Async Lifecycle
[INFO]    task-segment: [clean, install, source:jar, deploy]
[INFO] ------------------------------------------------------------------------
[INFO] [clean:clean]
[INFO] Preparing checkstyle:check
Downloading: http://download.java.net/maven/2/weblogic/wls-api/9.2.3/wls-api-9.2.3.pom
Downloading: http://repo1.maven.org/maven2/weblogic/wls-api/9.2.3/wls-api-9.2.3.pom
Downloading: http://download.java.net/maven/2/weblogic/wls-api/9.2.3/wls-api-9.2.3.jar
Downloading: http://repo1.maven.org/maven2/weblogic/wls-api/9.2.3/wls-api-9.2.3.jar
[INFO] ------------------------------------------------------------------------
[ERROR] BUILD ERROR
[INFO] ------------------------------------------------------------------------
[INFO] Failed to resolve artifact.

Missing:
----------
1) weblogic:wls-api:jar:9.2.3

  Try downloading the file manually from the project website.

  Then, install it using the command: 
      mvn install:install-file -DgroupId=weblogic -DartifactId=wls-api -Dversion=9.2.3 -Dpackaging=jar -Dfile=/path/to/file

  Alternatively, if you host your own repository you can deploy the file there: 
      mvn deploy:deploy-file -DgroupId=weblogic -DartifactId=wls-api -Dversion=9.2.3 -Dpackaging=jar -Dfile=/path/to/file -Durl=[url] -DrepositoryId=[id]

  Path to dependency: 
  	1) org.apache.myfaces.commons:myfaces-weblogic-async-lifecycle:jar:1.0.1-SNAPSHOT
  	2) weblogic:wls-api:jar:9.2.3

----------
1 required artifact is missing.

for artifact: 
  org.apache.myfaces.commons:myfaces-weblogic-async-lifecycle:jar:1.0.1-SNAPSHOT

from the specified remote repositories:
  central (http://repo1.maven.org/maven2),
  java.net (http://download.java.net/maven/2),
  apache.snapshots (http://people.apache.org/repo/m2-snapshot-repository)



[INFO] ------------------------------------------------------------------------
[INFO] For more information, run Maven with the -e switch
[INFO] ------------------------------------------------------------------------
[INFO] Total time: 9 minutes 4 seconds
[INFO] Finished at: Fri Oct 09 10:09:58 GMT+00:00 2009
[INFO] Final Memory: 44M/100M
[INFO] ------------------------------------------------------------------------

****************************************************************************



Mime
View raw message