myfaces-commits mailing list archives

Site index · List index
Message view « Date » · « Thread »
Top « Date » · « Thread »
From "Continuum@myfaces.zones.apache.org" <notificati...@myfaces.apache.org>
Subject [continuum] BUILD FAILURE: Apache MyFaces Extensions-Validator Module
Date Wed, 24 Mar 2010 09:19:02 GMT
Online report : http://myfaces.zones.apache.org:8080/continuum/buildResult.action?buildId=26058&projectId=216

Build statistics:
  State: Failed
  Previous State: Ok
  Started at: Wed 24 Mar 2010 09:18:41 +0000
  Finished at: Wed 24 Mar 2010 09:18:55 +0000
  Total time: 14s
  Build Trigger: Forced
  Build Number: 7
  Exit code: 1
  Building machine hostname: myfaces.zones.apache.org
  Operating system : SunOS(unknown)
  Java Home version : 
          java version "1.5.0_22"
          Java(TM) 2 Runtime Environment, Standard Edition (build 1.5.0_22-b03)
          Java HotSpot(TM) Server VM (build 1.5.0_22-b03, mixed mode)
        
  Builder version :
          Maven version: 2.0.10
          Java version: 1.5.0_22
          OS name: "sunos" version: "5.10" arch: "x86" Family: "unix"
    
****************************************************************************
SCM Changes:
****************************************************************************
No files changed

****************************************************************************
Dependencies Changes:
****************************************************************************
No dependencies changed

****************************************************************************
Test Summary:
****************************************************************************
Tests: 108
Failures: 0
Total time: 14405

****************************************************************************
Output:
****************************************************************************
[INFO] Scanning for projects...
[INFO] Reactor build order: 
[INFO]   Apache MyFaces Extensions-Validator Project Parent
[INFO]   MyFaces Extensions-Validator Core
[INFO]   MyFaces Extensions-Validator Validation-Modules
[INFO]   MyFaces Extensions-Validator Property-Validation-Module
[INFO]   MyFaces Extensions-Validator Bean-Validation-Integration-Module (JSR 303)
[INFO]   MyFaces Extensions-Validator Component-Support Modules
[INFO]   MyFaces Extensions-Validator Trinidad Support Module
[INFO]   MyFaces Extensions-Validator Generic Support Module
[INFO]   MyFaces Extensions-Validator Test-Modules
[INFO]   MyFaces Extensions-Validator Base-Test-Infrastructure
[INFO]   MyFaces Extensions-Validator Core-Tests
[INFO]   MyFaces Extensions-Validator Property-Validation-Tests
[INFO]   MyFaces Extensions-Validator Bean-Validation-Integration-Tests
[INFO]   MyFaces Extensions-Validator examples project
[INFO]   MyFaces Extensions-Validator examples hello world
[INFO]   MyFaces Extensions-Validator examples hello bean-validation
[INFO]   MyFaces Extensions-Validator examples feature-set 01
[INFO]   MyFaces Extensions-Validator examples feature-set 02
[INFO]   Apache MyFaces Extensions-Validator Module
[INFO] ------------------------------------------------------------------------
[INFO] Building Apache MyFaces Extensions-Validator Project Parent
[INFO]    task-segment: [clean, install, deploy]
[INFO] ------------------------------------------------------------------------
[INFO] [clean:clean]
[INFO] Deleting directory /local/continuum-1.1-beta-2/working-directory/216/parent/target
[INFO] [antrun:run {execution: javadoc.resources}]
[INFO] Executing tasks
     [copy] Copying 2 files to /local/continuum-1.1-beta-2/working-directory/216/parent/target/apidocs/META-INF
[INFO] Executed tasks
[INFO] [site:attach-descriptor]
[INFO] Preparing checkstyle:check
[INFO] Setting property: classpath.resource.loader.class => 'org.codehaus.plexus.velocity.ContextClassLoaderResourceLoader'.
[INFO] Setting property: velocimacro.messages.on => 'false'.
[INFO] Setting property: resource.loader => 'classpath'.
[INFO] Setting property: resource.manager.logwhenfound => 'false'.
[INFO] ************************************************************** 
[INFO] Starting Jakarta Velocity v1.4
[INFO] RuntimeInstance initializing.
[INFO] Default Properties File: org/apache/velocity/runtime/defaults/velocity.properties
[INFO] Default ResourceManager initializing. (class org.apache.velocity.runtime.resource.ResourceManagerImpl)
[INFO] Resource Loader Instantiated: org.codehaus.plexus.velocity.ContextClassLoaderResourceLoader
[INFO] ClasspathResourceLoader : initialization starting.
[INFO] ClasspathResourceLoader : initialization complete.
[INFO] ResourceCache : initialized. (class org.apache.velocity.runtime.resource.ResourceCacheImpl)
[INFO] Default ResourceManager initialization complete.
[INFO] Loaded System Directive: org.apache.velocity.runtime.directive.Literal
[INFO] Loaded System Directive: org.apache.velocity.runtime.directive.Macro
[INFO] Loaded System Directive: org.apache.velocity.runtime.directive.Parse
[INFO] Loaded System Directive: org.apache.velocity.runtime.directive.Include
[INFO] Loaded System Directive: org.apache.velocity.runtime.directive.Foreach
[INFO] Created: 20 parsers.
[INFO] Velocimacro : initialization starting.
[INFO] Velocimacro : adding VMs from VM library template : VM_global_library.vm
[ERROR] ResourceManager : unable to find resource 'VM_global_library.vm' in any resource loader.
[INFO] Velocimacro : error using  VM library template VM_global_library.vm : org.apache.velocity.exception.ResourceNotFoundException:
Unable to find resource 'VM_global_library.vm'
[INFO] Velocimacro :  VM library template macro registration complete.
[INFO] Velocimacro : allowInline = true : VMs can be defined inline in templates
[INFO] Velocimacro : allowInlineToOverride = false : VMs defined inline may NOT replace previous
VM definitions
[INFO] Velocimacro : allowInlineLocal = false : VMs defined inline will be  global in scope
if allowed.
[INFO] Velocimacro : initialization complete.
[INFO] Velocity successfully started.
[INFO] [checkstyle:checkstyle]
[INFO] Source directory does not exist - skipping report.
[INFO] [checkstyle:check {execution: verify-style}]
[INFO] Unable to perform checkstyle:check, unable to find checkstyle:checkstyle outputFile.
[INFO] [install:install]
[INFO] Installing /local/continuum-1.1-beta-2/working-directory/216/parent/pom.xml to /export/home/mrmaven/.m2/repository/org/apache/myfaces/extensions/validator/myfaces-extval-parent/1.2.4-SNAPSHOT/myfaces-extval-parent-1.2.4-SNAPSHOT.pom
[INFO] [antrun:run {execution: javadoc.resources}]
[INFO] Executing tasks
[INFO] Executed tasks
[INFO] [site:attach-descriptor]
[INFO] Preparing checkstyle:check
[INFO] [checkstyle:checkstyle]
[INFO] Source directory does not exist - skipping report.
[INFO] [checkstyle:check {execution: verify-style}]
[INFO] Unable to perform checkstyle:check, unable to find checkstyle:checkstyle outputFile.
[INFO] [install:install]
[INFO] Installing /local/continuum-1.1-beta-2/working-directory/216/parent/pom.xml to /export/home/mrmaven/.m2/repository/org/apache/myfaces/extensions/validator/myfaces-extval-parent/1.2.4-SNAPSHOT/myfaces-extval-parent-1.2.4-SNAPSHOT.pom
[INFO] [deploy:deploy]
[INFO] Retrieving previous build number from apache.snapshots
[INFO] ------------------------------------------------------------------------
[ERROR] BUILD ERROR
[INFO] ------------------------------------------------------------------------
[INFO] Error retrieving previous build number for artifact 'org.apache.myfaces.extensions.validator:myfaces-extval-parent:pom':
repository metadata for: 'snapshot org.apache.myfaces.extensions.validator:myfaces-extval-parent:1.2.4-SNAPSHOT'
could not be retrieved from repository: apache.snapshots due to an error: Exit code: 1 - WARNING:
DSA key found for host people.apache.org
in /export/home/mrmaven/.ssh/known_hosts:1
DSA key fingerprint 79:7c:cb:6a:44:47:b2:ef:5c:66:28:d7:40:0d:b1:f9.
Host key verification failed.


[INFO] ------------------------------------------------------------------------
[INFO] For more information, run Maven with the -e switch
[INFO] ------------------------------------------------------------------------
[INFO] Total time: 11 seconds
[INFO] Finished at: Wed Mar 24 09:18:54 GMT+00:00 2010
[INFO] Final Memory: 17M/75M
[INFO] ------------------------------------------------------------------------

****************************************************************************



Mime
View raw message