myfaces-commits mailing list archives

Site index · List index
Message view « Date » · « Thread »
Top « Date » · « Thread »
From "Continuum@myfaces.zones.apache.org" <notificati...@myfaces.apache.org>
Subject [continuum] BUILD FAILURE: Apache MyFaces Shared For JSF 1.2 - Project
Date Thu, 15 Apr 2010 07:02:55 GMT
Online report : http://myfaces.zones.apache.org:8080/continuum/buildResult.action?buildId=26074&projectId=47

Build statistics:
  State: Failed
  Previous State: Ok
  Started at: Thu 15 Apr 2010 07:02:35 +0000
  Finished at: Thu 15 Apr 2010 07:02:50 +0000
  Total time: 14s
  Build Trigger: Schedule
  Build Number: 62
  Exit code: 1
  Building machine hostname: myfaces.zones.apache.org
  Operating system : SunOS(unknown)
  Java Home version : 
          java version "1.5.0_22"
          Java(TM) 2 Runtime Environment, Standard Edition (build 1.5.0_22-b03)
          Java HotSpot(TM) Server VM (build 1.5.0_22-b03, mixed mode)
        
  Builder version :
          Maven version: 2.0.10
          Java version: 1.5.0_22
          OS name: "sunos" version: "5.10" arch: "x86" Family: "unix"
    
****************************************************************************
SCM Changes:
****************************************************************************
Changed: lu4242 @ Thu 11 Mar 2010 14:03:52 +0000
Comment: small fix on annotation javadoc
Files changed:
  /myfaces/shared/trunk_3.0.x/core/src/main/java/org/apache/myfaces/shared/util/StateUtils.java
( 921851 )

Changed: lu4242 @ Wed 17 Mar 2010 18:26:20 +0000
Comment: MYFACES-2290 Add OSGi bundle information and bundle classloader / activator (trying
to be nice with OSGi)
Files changed:
  /myfaces/shared/trunk_3.0.x/core/src/main/java/org/apache/myfaces/shared/webapp/webxml/WebXmlParser.java
( 924402 )

****************************************************************************
Dependencies Changes:
****************************************************************************
No dependencies changed

****************************************************************************
Test Summary:
****************************************************************************
Tests: 81
Failures: 0
Total time: 1364

****************************************************************************
Output:
****************************************************************************
[INFO] Scanning for projects...
[INFO] Reactor build order: 
[INFO]   Apache MyFaces Shared For JSF 1.2 - Project
[INFO]   Apache MyFaces Shared For JSF 1.2 - Core
[INFO]   MyFaces Shared Impl
[INFO]   MyFaces Shared Tomahawk
[INFO] ------------------------------------------------------------------------
[INFO] Building Apache MyFaces Shared For JSF 1.2 - Project
[INFO]    task-segment: [clean, deploy]
[INFO] ------------------------------------------------------------------------
[INFO] [clean:clean]
[INFO] Deleting directory /local/continuum-1.1-beta-2/working-directory/47/target
[INFO] [site:attach-descriptor]
[INFO] Unable to load parent project from a relative path: Could not find the model file '/local/continuum-1.1-beta-2/working-directory/47/../pom.xml'.
for project unknown
[INFO] Parent project loaded from repository.
[INFO] Preparing checkstyle:check
[INFO] Setting property: classpath.resource.loader.class => 'org.codehaus.plexus.velocity.ContextClassLoaderResourceLoader'.
[INFO] Setting property: velocimacro.messages.on => 'false'.
[INFO] Setting property: resource.loader => 'classpath'.
[INFO] Setting property: resource.manager.logwhenfound => 'false'.
[INFO] ************************************************************** 
[INFO] Starting Jakarta Velocity v1.4
[INFO] RuntimeInstance initializing.
[INFO] Default Properties File: org/apache/velocity/runtime/defaults/velocity.properties
[INFO] Default ResourceManager initializing. (class org.apache.velocity.runtime.resource.ResourceManagerImpl)
[INFO] Resource Loader Instantiated: org.codehaus.plexus.velocity.ContextClassLoaderResourceLoader
[INFO] ClasspathResourceLoader : initialization starting.
[INFO] ClasspathResourceLoader : initialization complete.
[INFO] ResourceCache : initialized. (class org.apache.velocity.runtime.resource.ResourceCacheImpl)
[INFO] Default ResourceManager initialization complete.
[INFO] Loaded System Directive: org.apache.velocity.runtime.directive.Literal
[INFO] Loaded System Directive: org.apache.velocity.runtime.directive.Macro
[INFO] Loaded System Directive: org.apache.velocity.runtime.directive.Parse
[INFO] Loaded System Directive: org.apache.velocity.runtime.directive.Include
[INFO] Loaded System Directive: org.apache.velocity.runtime.directive.Foreach
[INFO] Created: 20 parsers.
[INFO] Velocimacro : initialization starting.
[INFO] Velocimacro : adding VMs from VM library template : VM_global_library.vm
[ERROR] ResourceManager : unable to find resource 'VM_global_library.vm' in any resource loader.
[INFO] Velocimacro : error using  VM library template VM_global_library.vm : org.apache.velocity.exception.ResourceNotFoundException:
Unable to find resource 'VM_global_library.vm'
[INFO] Velocimacro :  VM library template macro registration complete.
[INFO] Velocimacro : allowInline = true : VMs can be defined inline in templates
[INFO] Velocimacro : allowInlineToOverride = false : VMs defined inline may NOT replace previous
VM definitions
[INFO] Velocimacro : allowInlineLocal = false : VMs defined inline will be  global in scope
if allowed.
[INFO] Velocimacro : initialization complete.
[INFO] Velocity successfully started.
[INFO] [checkstyle:checkstyle]
[INFO] Source directory does not exist - skipping report.
[INFO] [checkstyle:check {execution: verify-style}]
[INFO] Unable to perform checkstyle:check, unable to find checkstyle:checkstyle outputFile.
[INFO] [install:install]
[INFO] Installing /local/continuum-1.1-beta-2/working-directory/47/pom.xml to /export/home/mrmaven/.m2/repository/org/apache/myfaces/shared/myfaces-shared-project/3.0.8-SNAPSHOT/myfaces-shared-project-3.0.8-SNAPSHOT.pom
[INFO] [deploy:deploy]
[INFO] Retrieving previous build number from apache-maven-snapshots
[INFO] ------------------------------------------------------------------------
[ERROR] BUILD ERROR
[INFO] ------------------------------------------------------------------------
[INFO] Error retrieving previous build number for artifact 'org.apache.myfaces.shared:myfaces-shared-project:pom':
repository metadata for: 'snapshot org.apache.myfaces.shared:myfaces-shared-project:3.0.8-SNAPSHOT'
could not be retrieved from repository: apache-maven-snapshots due to an error: Exit code:
1 - WARNING: DSA key found for host people.apache.org
in /export/home/mrmaven/.ssh/known_hosts:1
DSA key fingerprint 79:7c:cb:6a:44:47:b2:ef:5c:66:28:d7:40:0d:b1:f9.
Host key verification failed.


[INFO] ------------------------------------------------------------------------
[INFO] For more information, run Maven with the -e switch
[INFO] ------------------------------------------------------------------------
[INFO] Total time: 12 seconds
[INFO] Finished at: Thu Apr 15 07:02:49 GMT+00:00 2010
[INFO] Final Memory: 16M/75M
[INFO] ------------------------------------------------------------------------

****************************************************************************



Mime
View raw message