myfaces-commits mailing list archives

Site index · List index
Message view « Date » · « Thread »
Top « Date » · « Thread »
From "Continuum@myfaces.zones.apache.org" <comm...@myfaces.apache.org>
Subject [continuum] BUILD FAILURE: Apache Trinidad Maven Tag Documentation Report
Date Thu, 15 Apr 2010 07:09:32 GMT
Online report : http://myfaces.zones.apache.org:8080/continuum/buildResult.action?buildId=26089&projectId=248

Build statistics:
  State: Failed
  Previous State: Ok
  Started at: Thu 15 Apr 2010 07:09:21 +0000
  Finished at: Thu 15 Apr 2010 07:09:31 +0000
  Total time: 10s
  Build Trigger: Schedule
  Build Number: 2
  Exit code: 1
  Building machine hostname: myfaces.zones.apache.org
  Operating system : SunOS(unknown)
  Java Home version : 
          java version "1.5.0_22"
          Java(TM) 2 Runtime Environment, Standard Edition (build 1.5.0_22-b03)
          Java HotSpot(TM) Server VM (build 1.5.0_22-b03, mixed mode)
        
  Builder version :
          Maven version: 2.0.10
          Java version: 1.5.0_22
          OS name: "sunos" version: "5.10" arch: "x86" Family: "unix"
    
****************************************************************************
SCM Changes:
****************************************************************************
Changed: no author @ no date
Comment: no comment
Files changed:
  src/main/java/org/apache/myfaces/trinidadbuild/plugin/tagdoc/TagdocReport.java ( no revision
)
  pom.xml ( no revision )

****************************************************************************
Dependencies Changes:
****************************************************************************
No dependencies changed

****************************************************************************
Test Summary:
****************************************************************************
Tests: 0
Failures: 0
Total time: 0

****************************************************************************
Output:
****************************************************************************
[INFO] Scanning for projects...
[INFO] ------------------------------------------------------------------------
[INFO] Building Apache Trinidad Maven Tag Documentation Report
[INFO]    task-segment: [clean, install]
[INFO] ------------------------------------------------------------------------
[INFO] [clean:clean]
[INFO] Deleting directory /local/continuum-1.1-beta-2/working-directory/248/target
[INFO] snapshot org.apache.myfaces.trinidadbuild:maven-faces-plugin:1.2.13-SNAPSHOT: checking
for updates from java.net
[INFO] snapshot org.apache.myfaces.trinidadbuild:maven-faces-plugin:1.2.13-SNAPSHOT: checking
for updates from apache.snapshots
[WARNING] repository metadata for: 'snapshot org.apache.myfaces.trinidadbuild:maven-faces-plugin:1.2.13-SNAPSHOT'
could not be retrieved from repository: apache.snapshots due to an error: Error transferring
file
[INFO] Repository 'apache.snapshots' will be blacklisted
[INFO] [plugin:descriptor]
[INFO] Using 2 extractors.
[INFO] Applying extractor for language: java
[INFO] Extractor for language: java found 1 mojo descriptors.
[INFO] Applying extractor for language: bsh
[INFO] Extractor for language: bsh found 0 mojo descriptors.
[INFO] Setting property: classpath.resource.loader.class => 'org.codehaus.plexus.velocity.ContextClassLoaderResourceLoader'.
[INFO] Setting property: velocimacro.messages.on => 'false'.
[INFO] Setting property: resource.loader => 'classpath'.
[INFO] Setting property: resource.manager.logwhenfound => 'false'.
[INFO] [remote-resources:process {execution: default}]
[INFO] [resources:resources]
[INFO] Using default encoding to copy filtered resources.
[INFO] [compiler:compile]
[INFO] Compiling 1 source file to /local/continuum-1.1-beta-2/working-directory/248/target/classes
[INFO] ------------------------------------------------------------------------
[ERROR] BUILD FAILURE
[INFO] ------------------------------------------------------------------------
[INFO] Compilation failure

/local/continuum-1.1-beta-2/working-directory/248/src/main/java/org/apache/myfaces/trinidadbuild/plugin/tagdoc/TagdocReport.java:[325,33]
cannot find symbol
symbol  : method isEmpty()
location: class java.lang.String

/local/continuum-1.1-beta-2/working-directory/248/src/main/java/org/apache/myfaces/trinidadbuild/plugin/tagdoc/TagdocReport.java:[387,35]
cannot find symbol
symbol  : method isEmpty()
location: class java.lang.String

/local/continuum-1.1-beta-2/working-directory/248/src/main/java/org/apache/myfaces/trinidadbuild/plugin/tagdoc/TagdocReport.java:[701,35]
cannot find symbol
symbol  : method isEmpty()
location: class java.lang.String


[INFO] ------------------------------------------------------------------------
[INFO] For more information, run Maven with the -e switch
[INFO] ------------------------------------------------------------------------
[INFO] Total time: 8 seconds
[INFO] Finished at: Thu Apr 15 07:09:31 GMT+00:00 2010
[INFO] Final Memory: 17M/69M
[INFO] ------------------------------------------------------------------------

****************************************************************************



Mime
View raw message