myfaces-commits mailing list archives

Site index · List index
Message view « Date » · « Thread »
Top « Date » · « Thread »
From "Continuum@myfaces.zones.apache.org" <notificati...@myfaces.apache.org>
Subject [continuum] BUILD FAILURE: Apache MyFaces Portlet Bridge Site
Date Sat, 10 Jul 2010 08:03:14 GMT
Online report : http://myfaces.zones.apache.org:8080/continuum/buildResult.action?buildId=26384&projectId=135

Build statistics:
  State: Failed
  Previous State: Ok
  Started at: Sat 10 Jul 2010 08:02:28 +0000
  Finished at: Sat 10 Jul 2010 08:03:12 +0000
  Total time: 44s
  Build Trigger: Schedule
  Build Number: 12
  Exit code: 1
  Building machine hostname: myfaces.zones.apache.org
  Operating system : SunOS(unknown)
  Java Home version : 
          java version "1.5.0_22"
          Java(TM) 2 Runtime Environment, Standard Edition (build 1.5.0_22-b03)
          Java HotSpot(TM) Server VM (build 1.5.0_22-b03, mixed mode)
        
  Builder version :
          Maven version: 2.0.10
          Java version: 1.5.0_22
          OS name: "sunos" version: "5.10" arch: "x86" Family: "unix"
    
****************************************************************************
SCM Changes:
****************************************************************************
Changed: sobryan @ Thu 3 Jun 2010 22:39:10 +0000
Comment: Touched pom
Files changed:
  /myfaces/portlet-bridge/site/trunk/pom.xml ( 951182 )

Changed: mfreedman @ Tue 6 Jul 2010 23:30:11 +0000
Comment: Updated to reflect posting the 1.0 production version.
Files changed:
  /myfaces/portlet-bridge/site/trunk/pom.xml ( 961041 )
  /myfaces/portlet-bridge/site/trunk/src/site/apt/bridges.apt ( 961041 )
  /myfaces/portlet-bridge/site/trunk/src/site/apt/download.apt ( 961041 )
  /myfaces/portlet-bridge/site/trunk/src/site/apt/index.apt ( 961041 )

****************************************************************************
Dependencies Changes:
****************************************************************************
No dependencies changed

****************************************************************************
Test Summary:
****************************************************************************
Tests: 0
Failures: 0
Total time: 0

****************************************************************************
Output:
****************************************************************************
[INFO] Scanning for projects...
[INFO] ------------------------------------------------------------------------
[INFO] Building Apache MyFaces Portlet Bridge Site
[INFO]    task-segment: [clean, install, site-deploy]
[INFO] ------------------------------------------------------------------------
[INFO] [clean:clean]
[INFO] Deleting directory /local/continuum-1.1-beta-2/working-directory/135/target
[INFO] Setting property: classpath.resource.loader.class => 'org.codehaus.plexus.velocity.ContextClassLoaderResourceLoader'.
[INFO] Setting property: velocimacro.messages.on => 'false'.
[INFO] Setting property: resource.loader => 'classpath'.
[INFO] Setting property: resource.manager.logwhenfound => 'false'.
[INFO] [remote-resources:process {execution: default}]
[INFO] [site:attach-descriptor]
[INFO] Unable to load parent project from a relative path: Could not find the model file '/local/continuum-1.1-beta-2/working-directory/pom.xml'.
for project unknown
[INFO] Parent project loaded from repository.
[INFO] [install:install]
[INFO] Installing /local/continuum-1.1-beta-2/working-directory/135/pom.xml to /export/home/mrmaven/.m2/repository/org/apache/myfaces/portlet-bridge/portlet-bridge-site/1.0.0-SNAPSHOT/portlet-bridge-site-1.0.0-SNAPSHOT.pom
[INFO] Setting property: classpath.resource.loader.class => 'org.codehaus.plexus.velocity.ContextClassLoaderResourceLoader'.
[INFO] Setting property: velocimacro.messages.on => 'false'.
[INFO] Setting property: resource.loader => 'classpath'.
[INFO] Setting property: resource.manager.logwhenfound => 'false'.
[INFO] ************************************************************** 
[INFO] Starting Jakarta Velocity v1.4
[INFO] RuntimeInstance initializing.
[INFO] Default Properties File: org/apache/velocity/runtime/defaults/velocity.properties
[INFO] Default ResourceManager initializing. (class org.apache.velocity.runtime.resource.ResourceManagerImpl)
[INFO] Resource Loader Instantiated: org.codehaus.plexus.velocity.ContextClassLoaderResourceLoader
[INFO] ClasspathResourceLoader : initialization starting.
[INFO] ClasspathResourceLoader : initialization complete.
[INFO] ResourceCache : initialized. (class org.apache.velocity.runtime.resource.ResourceCacheImpl)
[INFO] Default ResourceManager initialization complete.
[INFO] Loaded System Directive: org.apache.velocity.runtime.directive.Literal
[INFO] Loaded System Directive: org.apache.velocity.runtime.directive.Macro
[INFO] Loaded System Directive: org.apache.velocity.runtime.directive.Parse
[INFO] Loaded System Directive: org.apache.velocity.runtime.directive.Include
[INFO] Loaded System Directive: org.apache.velocity.runtime.directive.Foreach
[INFO] Created: 20 parsers.
[INFO] Velocimacro : initialization starting.
[INFO] Velocimacro : adding VMs from VM library template : VM_global_library.vm
[ERROR] ResourceManager : unable to find resource 'VM_global_library.vm' in any resource loader.
[INFO] Velocimacro : error using  VM library template VM_global_library.vm : org.apache.velocity.exception.ResourceNotFoundException:
Unable to find resource 'VM_global_library.vm'
[INFO] Velocimacro :  VM library template macro registration complete.
[INFO] Velocimacro : allowInline = true : VMs can be defined inline in templates
[INFO] Velocimacro : allowInlineToOverride = false : VMs defined inline may NOT replace previous
VM definitions
[INFO] Velocimacro : allowInlineLocal = false : VMs defined inline will be  global in scope
if allowed.
[INFO] Velocimacro : initialization complete.
[INFO] Velocity successfully started.
[INFO] Setting property: classpath.resource.loader.class => 'org.codehaus.plexus.velocity.ContextClassLoaderResourceLoader'.
[INFO] Setting property: velocimacro.messages.on => 'false'.
[INFO] Setting property: resource.loader => 'classpath'.
[INFO] Setting property: resource.manager.logwhenfound => 'false'.
[INFO] Setting property: classpath.resource.loader.class => 'org.codehaus.plexus.velocity.ContextClassLoaderResourceLoader'.
[INFO] Setting property: velocimacro.messages.on => 'false'.
[INFO] Setting property: resource.loader => 'classpath'.
[INFO] Setting property: resource.manager.logwhenfound => 'false'.
[INFO] ************************************************************** 
[INFO] Starting Jakarta Velocity v1.4
[INFO] RuntimeInstance initializing.
[INFO] Default Properties File: org/apache/velocity/runtime/defaults/velocity.properties
[INFO] Default ResourceManager initializing. (class org.apache.velocity.runtime.resource.ResourceManagerImpl)
[INFO] Resource Loader Instantiated: org.codehaus.plexus.velocity.ContextClassLoaderResourceLoader
[INFO] ClasspathResourceLoader : initialization starting.
[INFO] ClasspathResourceLoader : initialization complete.
[INFO] ResourceCache : initialized. (class org.apache.velocity.runtime.resource.ResourceCacheImpl)
[INFO] Default ResourceManager initialization complete.
[INFO] Loaded System Directive: org.apache.velocity.runtime.directive.Literal
[INFO] Loaded System Directive: org.apache.velocity.runtime.directive.Macro
[INFO] Loaded System Directive: org.apache.velocity.runtime.directive.Parse
[INFO] Loaded System Directive: org.apache.velocity.runtime.directive.Include
[INFO] Loaded System Directive: org.apache.velocity.runtime.directive.Foreach
[INFO] Created: 20 parsers.
[INFO] Velocimacro : initialization starting.
[INFO] Velocimacro : adding VMs from VM library template : VM_global_library.vm
[ERROR] ResourceManager : unable to find resource 'VM_global_library.vm' in any resource loader.
[INFO] Velocimacro : error using  VM library template VM_global_library.vm : org.apache.velocity.exception.ResourceNotFoundException:
Unable to find resource 'VM_global_library.vm'
[INFO] Velocimacro :  VM library template macro registration complete.
[INFO] Velocimacro : allowInline = true : VMs can be defined inline in templates
[INFO] Velocimacro : allowInlineToOverride = false : VMs defined inline may NOT replace previous
VM definitions
[INFO] Velocimacro : allowInlineLocal = false : VMs defined inline will be  global in scope
if allowed.
[INFO] Velocimacro : initialization complete.
[INFO] Velocity successfully started.
[INFO] Preparing findbugs:findbugs
[INFO] [remote-resources:process {execution: default}]
[INFO] Preparing jdepend:generate
[INFO] [remote-resources:process {execution: default}]
[INFO] [site:site]
[INFO] Unable to load parent project from a relative path: Could not find the model file '/local/continuum-1.1-beta-2/working-directory/pom.xml'.
for project unknown
[INFO] Parent project loaded from repository.
[INFO] Parent project loaded from repository.
[INFO] Parent project loaded from repository.
[INFO] Unable to load parent project from a relative path: Could not find the model file '/local/continuum-1.1-beta-2/working-directory/pom.xml'.
for project unknown
[INFO] Parent project loaded from repository.
[INFO] snapshot org.apache.myfaces.maven:myfaces-site-skin:1-SNAPSHOT: checking for updates
from java.net
[INFO] snapshot org.apache.myfaces.maven:myfaces-site-skin:1-SNAPSHOT: checking for updates
from apache.snapshots
[INFO] Skipped "About" report, file "index.html" already exists for the English version.
[INFO] Generating "Issue Tracking" report.
[INFO] Generating "Project Summary" report.
[INFO] Generating "Mailing Lists" report.
[INFO] Generating "CPD Report" report.
[WARNING] Unable to locate Source XRef to link to - DISABLED
[INFO] Generating "Source Repository" report.
[INFO] Generating "Continuous Integration" report.
[INFO] Generating "Dependencies" report.
[INFO] Generating "Project Team" report.
[INFO] Generating "Project License" report.
[INFO] Generating "PMD Report" report.
[WARNING] Unable to locate Source XRef to link to - DISABLED
[INFO] [site:deploy]
scpexe://minotaur.apache.org/www/myfaces.apache.org/portlet-bridge - Session: Opened  
Using private key: /export/home/mrmaven/.m2/identity
Executing command: /bin/sh -c ssh -i /export/home/mrmaven/.m2/identity -o 'BatchMode yes'
schof@minotaur.apache.org 'mkdir -p /www/myfaces.apache.org/portlet-bridge/.'

WARNING: DSA key found for host minotaur.apache.org
in /export/home/mrmaven/.ssh/known_hosts:2
DSA key fingerprint 79:7c:cb:6a:44:47:b2:ef:5c:66:28:d7:40:0d:b1:f9.
Host key verification failed.

scpexe://minotaur.apache.org/www/myfaces.apache.org/portlet-bridge - Session: Disconnecting
 
scpexe://minotaur.apache.org/www/myfaces.apache.org/portlet-bridge - Session: Disconnected
[INFO] ------------------------------------------------------------------------
[ERROR] BUILD ERROR
[INFO] ------------------------------------------------------------------------
[INFO] Error uploading site

Embedded error: Error performing commands for file transfer
Exit code 255 - WARNING: DSA key found for host minotaur.apache.org
in /export/home/mrmaven/.ssh/known_hosts:2
DSA key fingerprint 79:7c:cb:6a:44:47:b2:ef:5c:66:28:d7:40:0d:b1:f9.
Host key verification failed.

[INFO] ------------------------------------------------------------------------
[INFO] For more information, run Maven with the -e switch
[INFO] ------------------------------------------------------------------------
[INFO] Total time: 41 seconds
[INFO] Finished at: Sat Jul 10 08:03:12 GMT+00:00 2010
[INFO] Final Memory: 35M/97M
[INFO] ------------------------------------------------------------------------

****************************************************************************



Mime
View raw message