myfaces-commits mailing list archives

Site index · List index
Message view « Date » · « Thread »
Top « Date » · « Thread »
From Apache Hudson Server <hud...@hudson.apache.org>
Subject Build failed in Hudson: tobago-trunk #2
Date Tue, 24 Aug 2010 21:29:29 GMT
See <https://hudson.apache.org/hudson/job/tobago-trunk/2/>

------------------------------------------
[...truncated 4648 lines...]
[INFO] [install:install {execution: default-install}]
[INFO] Installing <https://hudson.apache.org/hudson/job/tobago-trunk/ws/trunk/tobago-example/tobago-example-portlet/target/tobago-example-portlet-1.5.0-alpha-2-SNAPSHOT.war>
to /home/hudson/.m2/repository/org/apache/myfaces/tobago/tobago-example-portlet/1.5.0-alpha-2-SNAPSHOT/tobago-example-portlet-1.5.0-alpha-2-SNAPSHOT.war
[HUDSON] Archiving <https://hudson.apache.org/hudson/job/tobago-trunk/ws/trunk/tobago-example/tobago-example-portlet/target/tobago-example-portlet-1.5.0-alpha-2-SNAPSHOT.war>
to /home/hudson/hudson/jobs/tobago-trunk/modules/org.apache.myfaces.tobago$tobago-example-portlet/builds/2010-08-24_21-16-31/archive/org.apache.myfaces.tobago/tobago-example-portlet/1.5.0-alpha-2-SNAPSHOT/tobago-example-portlet-1.5.0-alpha-2-SNAPSHOT.war
[INFO] ------------------------------------------------------------------------
[INFO] Building Tobago Example Sandbox
[INFO]    task-segment: [clean, checkstyle:check, install]
[INFO] ------------------------------------------------------------------------
[INFO] [clean:clean {execution: default-clean}]
[INFO] Preparing checkstyle:check
[INFO] snapshot org.apache.myfaces.tobago:tobago-sandbox:1.5.0-alpha-2-SNAPSHOT: checking
for updates from java.net
[HUDSON] Archiving <https://hudson.apache.org/hudson/job/tobago-trunk/ws/trunk/tobago-example/tobago-example-sandbox/pom.xml>
to /home/hudson/hudson/jobs/tobago-trunk/modules/org.apache.myfaces.tobago$tobago-example-sandbox/builds/2010-08-24_21-16-31/archive/org.apache.myfaces.tobago/tobago-example-sandbox/1.5.0-alpha-2-SNAPSHOT/pom.xml
[INFO] [checkstyle:checkstyle {execution: checkstyle}]
[INFO] [checkstyle:check {execution: default-cli}]
[INFO] [enforcer:enforce {execution: enforce}]
[INFO] [apt:process {execution: tobago-facelet-sandbox-taglib}]
[INFO] Nothing to process - all processor-generated files are up to date
[INFO] [build-helper:add-source {execution: default}]
[INFO] Source directory: <https://hudson.apache.org/hudson/job/tobago-trunk/ws/trunk/tobago-example/tobago-example-sandbox/src/main/java-jsf-1.2>
added.
[INFO] [remote-resources:process {execution: default}]
[INFO] [resources:resources {execution: default-resources}]
[INFO] Using 'UTF-8' encoding to copy filtered resources.
[INFO] Copying 1 resource
[INFO] skip non existing resourceDirectory <https://hudson.apache.org/hudson/job/tobago-trunk/ws/trunk/tobago-example/tobago-example-sandbox/target/generated-sources>
[INFO] Copying 3 resources
[INFO] [compiler:compile {execution: default-compile}]
[INFO] Compiling 1 source file to <https://hudson.apache.org/hudson/job/tobago-trunk/ws/trunk/tobago-example/tobago-example-sandbox/target/classes>
[INFO] [resources:testResources {execution: default-testResources}]
[INFO] Using 'UTF-8' encoding to copy filtered resources.
[INFO] skip non existing resourceDirectory <https://hudson.apache.org/hudson/job/tobago-trunk/ws/trunk/tobago-example/tobago-example-sandbox/src/test/resources>
[INFO] Copying 3 resources
[INFO] [compiler:testCompile {execution: default-testCompile}]
[INFO] No sources to compile
[INFO] [surefire:test {execution: default-test}]
[INFO] Surefire report directory: <https://hudson.apache.org/hudson/job/tobago-trunk/ws/trunk/tobago-example/tobago-example-sandbox/target/surefire-reports>

-------------------------------------------------------
 T E S T S
-------------------------------------------------------
There are no tests to run.

Results :

Tests run: 0, Failures: 0, Errors: 0, Skipped: 0

[HUDSON] Recording test results
[INFO] [war:war {execution: default-war}]
[INFO] Exploding webapp...
[INFO] Assembling webapp tobago-example-sandbox in <https://hudson.apache.org/hudson/job/tobago-trunk/ws/trunk/tobago-example/tobago-example-sandbox/target/tobago-example-sandbox>
[INFO] Copy webapp webResources to <https://hudson.apache.org/hudson/job/tobago-trunk/ws/trunk/tobago-example/tobago-example-sandbox/target/tobago-example-sandbox>
[INFO] Generating war <https://hudson.apache.org/hudson/job/tobago-trunk/ws/trunk/tobago-example/tobago-example-sandbox/target/tobago-example-sandbox.war>
[INFO] Building war: <https://hudson.apache.org/hudson/job/tobago-trunk/ws/trunk/tobago-example/tobago-example-sandbox/target/tobago-example-sandbox.war>
[INFO] [install:install {execution: default-install}]
[INFO] Installing <https://hudson.apache.org/hudson/job/tobago-trunk/ws/trunk/tobago-example/tobago-example-sandbox/target/tobago-example-sandbox.war>
to /home/hudson/.m2/repository/org/apache/myfaces/tobago/tobago-example-sandbox/1.5.0-alpha-2-SNAPSHOT/tobago-example-sandbox-1.5.0-alpha-2-SNAPSHOT.war
[HUDSON] Archiving <https://hudson.apache.org/hudson/job/tobago-trunk/ws/trunk/tobago-example/tobago-example-sandbox/target/tobago-example-sandbox.war>
to /home/hudson/hudson/jobs/tobago-trunk/modules/org.apache.myfaces.tobago$tobago-example-sandbox/builds/2010-08-24_21-16-31/archive/org.apache.myfaces.tobago/tobago-example-sandbox/1.5.0-alpha-2-SNAPSHOT/tobago-example-sandbox.war
[INFO] ------------------------------------------------------------------------
[INFO] Building Tobago Example Security
[INFO]    task-segment: [clean, checkstyle:check, install]
[INFO] ------------------------------------------------------------------------
[INFO] [clean:clean {execution: default-clean}]
[INFO] Preparing checkstyle:check
[HUDSON] Archiving <https://hudson.apache.org/hudson/job/tobago-trunk/ws/trunk/tobago-example/tobago-example-security/pom.xml>
to /home/hudson/hudson/jobs/tobago-trunk/modules/org.apache.myfaces.tobago$tobago-example-security/builds/2010-08-24_21-16-31/archive/org.apache.myfaces.tobago/tobago-example-security/1.5.0-alpha-2-SNAPSHOT/pom.xml
[INFO] [checkstyle:checkstyle {execution: checkstyle}]
[INFO] [checkstyle:check {execution: default-cli}]
[INFO] [enforcer:enforce {execution: enforce}]
[INFO] [build-helper:add-source {execution: default}]
[INFO] Source directory: <https://hudson.apache.org/hudson/job/tobago-trunk/ws/trunk/tobago-example/tobago-example-security/src/main/java-jsf-1.2>
added.
[INFO] [remote-resources:process {execution: default}]
[INFO] [resources:resources {execution: default-resources}]
[INFO] Using 'UTF-8' encoding to copy filtered resources.
[INFO] skip non existing resourceDirectory <https://hudson.apache.org/hudson/job/tobago-trunk/ws/trunk/tobago-example/tobago-example-security/src/main/resources>
[INFO] Copying 3 resources
[INFO] [compiler:compile {execution: default-compile}]
[INFO] Compiling 1 source file to <https://hudson.apache.org/hudson/job/tobago-trunk/ws/trunk/tobago-example/tobago-example-security/target/classes>
[INFO] [resources:testResources {execution: default-testResources}]
[INFO] Using 'UTF-8' encoding to copy filtered resources.
[INFO] skip non existing resourceDirectory <https://hudson.apache.org/hudson/job/tobago-trunk/ws/trunk/tobago-example/tobago-example-security/src/test/resources>
[INFO] Copying 3 resources
[INFO] [compiler:testCompile {execution: default-testCompile}]
[INFO] No sources to compile
[INFO] [surefire:test {execution: default-test}]
[INFO] Surefire report directory: <https://hudson.apache.org/hudson/job/tobago-trunk/ws/trunk/tobago-example/tobago-example-security/target/surefire-reports>

-------------------------------------------------------
 T E S T S
-------------------------------------------------------
There are no tests to run.

Results :

Tests run: 0, Failures: 0, Errors: 0, Skipped: 0

[HUDSON] Recording test results
[INFO] [war:war {execution: default-war}]
[INFO] Exploding webapp...
[INFO] Assembling webapp tobago-example-security in <https://hudson.apache.org/hudson/job/tobago-trunk/ws/trunk/tobago-example/tobago-example-security/target/tobago-example-security>
[INFO] Copy webapp webResources to <https://hudson.apache.org/hudson/job/tobago-trunk/ws/trunk/tobago-example/tobago-example-security/target/tobago-example-security>
[INFO] Generating war <https://hudson.apache.org/hudson/job/tobago-trunk/ws/trunk/tobago-example/tobago-example-security/target/tobago-example-security.war>
[INFO] Building war: <https://hudson.apache.org/hudson/job/tobago-trunk/ws/trunk/tobago-example/tobago-example-security/target/tobago-example-security.war>
[INFO] [install:install {execution: default-install}]
[INFO] Installing <https://hudson.apache.org/hudson/job/tobago-trunk/ws/trunk/tobago-example/tobago-example-security/target/tobago-example-security.war>
to /home/hudson/.m2/repository/org/apache/myfaces/tobago/tobago-example-security/1.5.0-alpha-2-SNAPSHOT/tobago-example-security-1.5.0-alpha-2-SNAPSHOT.war
[HUDSON] Archiving <https://hudson.apache.org/hudson/job/tobago-trunk/ws/trunk/tobago-example/tobago-example-security/target/tobago-example-security.war>
to /home/hudson/hudson/jobs/tobago-trunk/modules/org.apache.myfaces.tobago$tobago-example-security/builds/2010-08-24_21-16-31/archive/org.apache.myfaces.tobago/tobago-example-security/1.5.0-alpha-2-SNAPSHOT/tobago-example-security.war
[INFO] ------------------------------------------------------------------------
[INFO] Building Tobago Example Assembly
[INFO]    task-segment: [clean, checkstyle:check, install]
[INFO] ------------------------------------------------------------------------
Downloading: http://repo1.maven.org/maven2/org/apache/myfaces/maven/wagon-maven-plugin/1.0.1/wagon-maven-plugin-1.0.1.pom

Downloading: http://repo1.maven.org/maven2/org/apache/myfaces/maven/wagon-maven-plugin/1.0.1/wagon-maven-plugin-1.0.1.jar

[INFO] [clean:clean {execution: default-clean}]
[INFO] Preparing checkstyle:check
[HUDSON] Archiving <https://hudson.apache.org/hudson/job/tobago-trunk/ws/trunk/tobago-example/tobago-example-assembly/pom.xml>
to /home/hudson/hudson/jobs/tobago-trunk/modules/org.apache.myfaces.tobago$tobago-example-assembly/builds/2010-08-24_21-16-31/archive/org.apache.myfaces.tobago/tobago-example-assembly/1.5.0-alpha-2-SNAPSHOT/pom.xml
[INFO] [checkstyle:checkstyle {execution: checkstyle}]
[INFO] Source directory does not exist - skipping report.
[INFO] [checkstyle:check {execution: default-cli}]
[INFO] Unable to perform checkstyle:check, unable to find checkstyle:checkstyle outputFile.
[INFO] [enforcer:enforce {execution: enforce}]
[INFO] [build-helper:add-source {execution: default}]
[INFO] Source directory: <https://hudson.apache.org/hudson/job/tobago-trunk/ws/trunk/tobago-example/tobago-example-assembly/src/main/java-jsf-1.2>
added.
[INFO] [remote-resources:process {execution: default}]
[INFO] [site:attach-descriptor {execution: default-attach-descriptor}]
[INFO] [install:install {execution: default-install}]
[INFO] Installing <https://hudson.apache.org/hudson/job/tobago-trunk/ws/trunk/tobago-example/tobago-example-assembly/pom.xml>
to /home/hudson/.m2/repository/org/apache/myfaces/tobago/tobago-example-assembly/1.5.0-alpha-2-SNAPSHOT/tobago-example-assembly-1.5.0-alpha-2-SNAPSHOT.pom
[HUDSON] Archiving /home/hudson/.m2/repository/org/apache/myfaces/tobago/tobago-example-assembly/1.5.0-alpha-2-SNAPSHOT/tobago-example-assembly-1.5.0-alpha-2-SNAPSHOT.pom
to /home/hudson/hudson/jobs/tobago-trunk/modules/org.apache.myfaces.tobago$tobago-example-assembly/builds/2010-08-24_21-16-31/archive/org.apache.myfaces.tobago/tobago-example-assembly/1.5.0-alpha-2-SNAPSHOT/tobago-example-assembly-1.5.0-alpha-2-SNAPSHOT.pom
[INFO] ------------------------------------------------------------------------
[INFO] Building Tobago Theme Example
[INFO]    task-segment: [clean, checkstyle:check, install]
[INFO] ------------------------------------------------------------------------
[INFO] [clean:clean {execution: default-clean}]
[INFO] Preparing checkstyle:check
[HUDSON] Archiving <https://hudson.apache.org/hudson/job/tobago-trunk/ws/trunk/tobago-example/tobago-theme-example/pom.xml>
to /home/hudson/hudson/jobs/tobago-trunk/modules/org.apache.myfaces.tobago$tobago-theme-example/builds/2010-08-24_21-16-31/archive/org.apache.myfaces.tobago/tobago-theme-example/1.5.0-alpha-2-SNAPSHOT/pom.xml
[INFO] [checkstyle:checkstyle {execution: checkstyle}]
[INFO] [checkstyle:check {execution: default-cli}]
[INFO] [enforcer:enforce {execution: enforce}]
[INFO] [build-helper:add-source {execution: default}]
[INFO] Source directory: <https://hudson.apache.org/hudson/job/tobago-trunk/ws/trunk/tobago-example/tobago-theme-example/src/main/java-jsf-1.2>
added.
[INFO] [remote-resources:process {execution: default}]
[INFO] [resources:resources {execution: default-resources}]
[INFO] Using 'UTF-8' encoding to copy filtered resources.
[INFO] Copying 5 resources
[INFO] Copying 3 resources
[INFO] [compiler:compile {execution: default-compile}]
[INFO] Compiling 1 source file to <https://hudson.apache.org/hudson/job/tobago-trunk/ws/trunk/tobago-example/tobago-theme-example/target/classes>
[INFO] [resources:testResources {execution: default-testResources}]
[INFO] Using 'UTF-8' encoding to copy filtered resources.
[INFO] skip non existing resourceDirectory <https://hudson.apache.org/hudson/job/tobago-trunk/ws/trunk/tobago-example/tobago-theme-example/src/test/resources>
[INFO] Copying 3 resources
[INFO] [compiler:testCompile {execution: default-testCompile}]
[INFO] No sources to compile
[INFO] [surefire:test {execution: default-test}]
[INFO] Surefire report directory: <https://hudson.apache.org/hudson/job/tobago-trunk/ws/trunk/tobago-example/tobago-theme-example/target/surefire-reports>

-------------------------------------------------------
 T E S T S
-------------------------------------------------------
There are no tests to run.

Results :

Tests run: 0, Failures: 0, Errors: 0, Skipped: 0

[HUDSON] Recording test results
[INFO] [jar:jar {execution: default-jar}]
[INFO] Building jar: <https://hudson.apache.org/hudson/job/tobago-trunk/ws/trunk/tobago-example/tobago-theme-example/target/tobago-theme-example-1.5.0-alpha-2-SNAPSHOT.jar>
[INFO] [install:install {execution: default-install}]
[INFO] Installing <https://hudson.apache.org/hudson/job/tobago-trunk/ws/trunk/tobago-example/tobago-theme-example/target/tobago-theme-example-1.5.0-alpha-2-SNAPSHOT.jar>
to /home/hudson/.m2/repository/org/apache/myfaces/tobago/tobago-theme-example/1.5.0-alpha-2-SNAPSHOT/tobago-theme-example-1.5.0-alpha-2-SNAPSHOT.jar
[HUDSON] Archiving <https://hudson.apache.org/hudson/job/tobago-trunk/ws/trunk/tobago-example/tobago-theme-example/target/tobago-theme-example-1.5.0-alpha-2-SNAPSHOT.jar>
to /home/hudson/hudson/jobs/tobago-trunk/modules/org.apache.myfaces.tobago$tobago-theme-example/builds/2010-08-24_21-16-31/archive/org.apache.myfaces.tobago/tobago-theme-example/1.5.0-alpha-2-SNAPSHOT/tobago-theme-example-1.5.0-alpha-2-SNAPSHOT.jar
[INFO] ------------------------------------------------------------------------
[INFO] Building Tobago Example Seam
[INFO]    task-segment: [clean, checkstyle:check, install]
[INFO] ------------------------------------------------------------------------
[INFO] [clean:clean {execution: default-clean}]
[INFO] Preparing checkstyle:check
Downloading: http://repository.jboss.org/maven2/org/apache/openjpa/openjpa-persistence-jdbc/1.2.0/openjpa-persistence-jdbc-1.2.0.pom
[INFO] Unable to find resource 'org.apache.openjpa:openjpa-persistence-jdbc:pom:1.2.0' in
repository repository.jboss.org (http://repository.jboss.org/maven2)
Downloading: https://maven-repository.dev.java.net/nonav/repository/org.apache.openjpa/poms/openjpa-persistence-jdbc-1.2.0.pom
379b downloaded  (openjpa-persistence-jdbc-1.2.0.pom)
[WARNING] *** CHECKSUM FAILED - Checksum failed on download: local = '2af63a8b4e3d81e9c2b9095d9894fbb84c5dd1d7';
remote = '<!DOCTYPE' - RETRYING
Downloading: https://maven-repository.dev.java.net/nonav/repository/org.apache.openjpa/poms/openjpa-persistence-jdbc-1.2.0.pom
379b downloaded  (openjpa-persistence-jdbc-1.2.0.pom)
[WARNING] *** CHECKSUM FAILED - Checksum failed on download: local = '2af63a8b4e3d81e9c2b9095d9894fbb84c5dd1d7';
remote = '<!DOCTYPE' - IGNORING
[WARNING] POM for 'org.apache.openjpa:openjpa-persistence-jdbc:pom:1.2.0:compile' is invalid.

Its dependencies (if any) will NOT be available to the current build.
Downloading: http://repository.jboss.org/maven2/org/jboss/seam/jboss-seam/2.1.0.GA/jboss-seam-2.1.0.GA.pom
8K downloaded  (jboss-seam-2.1.0.GA.pom)
Downloading: http://repository.jboss.org/maven2/org/jboss/seam/parent/2.1.0.GA/parent-2.1.0.GA.pom
2K downloaded  (parent-2.1.0.GA.pom)
Downloading: http://repository.jboss.org/maven2/org/jboss/seam/root/2.1.0.GA/root-2.1.0.GA.pom
38K downloaded  (root-2.1.0.GA.pom)
Downloading: http://repository.jboss.org/maven2/org/jboss/el/jboss-el/1.0_02.CR2/jboss-el-1.0_02.CR2.pom
609b downloaded  (jboss-el-1.0_02.CR2.pom)
Downloading: http://repository.jboss.org/maven2/org/jboss/seam/jboss-seam-ui/2.1.0.GA/jboss-seam-ui-2.1.0.GA.pom
5K downloaded  (jboss-seam-ui-2.1.0.GA.pom)
Downloading: http://repository.jboss.org/maven2/org/jboss/seam/jboss-seam-jul/2.1.0.GA/jboss-seam-jul-2.1.0.GA.pom
851b downloaded  (jboss-seam-jul-2.1.0.GA.pom)
Downloading: http://repository.jboss.org/maven2/org/hibernate/hibernate-validator/3.1.0.GA/hibernate-validator-3.1.0.GA.pom
2K downloaded  (hibernate-validator-3.1.0.GA.pom)
Downloading: http://repository.jboss.org/maven2/org/jbpm/jbpm-jpdl/3.2.3/jbpm-jpdl-3.2.3.pom
779b downloaded  (jbpm-jpdl-3.2.3.pom)
Downloading: http://repository.jboss.org/maven2/org/jboss/el/jboss-el/1.0_02.CR2/jboss-el-1.0_02.CR2.jar
Downloading: http://repository.jboss.org/maven2/org/jboss/seam/jboss-seam/2.1.0.GA/jboss-seam-2.1.0.GA.jar
Downloading: http://repository.jboss.org/maven2/org/apache/openjpa/openjpa-persistence-jdbc/1.2.0/openjpa-persistence-jdbc-1.2.0.jar
Downloading: http://repository.jboss.org/maven2/org/jbpm/jbpm-jpdl/3.2.3/jbpm-jpdl-3.2.3.jar
Downloading: http://repository.jboss.org/maven2/org/hibernate/hibernate-validator/3.1.0.GA/hibernate-validator-3.1.0.GA.jar
[INFO] Unable to find resource 'org.apache.openjpa:openjpa-persistence-jdbc:jar:1.2.0' in
repository repository.jboss.org (http://repository.jboss.org/maven2)
Downloading: https://maven-repository.dev.java.net/nonav/repository/org.apache.openjpa/jars/openjpa-persistence-jdbc-1.2.0.jar
379b downloaded  (openjpa-persistence-jdbc-1.2.0.jar)
[WARNING] *** CHECKSUM FAILED - Checksum failed on download: local = '29bd8be9ad763336329e67117a7ad1fc7f4476c7';
remote = '<!DOCTYPE' - RETRYING
Downloading: https://maven-repository.dev.java.net/nonav/repository/org.apache.openjpa/jars/openjpa-persistence-jdbc-1.2.0.jar
379b downloaded  (openjpa-persistence-jdbc-1.2.0.jar)
[WARNING] *** CHECKSUM FAILED - Checksum failed on download: local = '29bd8be9ad763336329e67117a7ad1fc7f4476c7';
remote = '<!DOCTYPE' - IGNORING
61K downloaded  (hibernate-validator-3.1.0.GA.jar)
131K downloaded  (jboss-el-1.0_02.CR2.jar)
659K downloaded  (jbpm-jpdl-3.2.3.jar)
1044K downloaded  (jboss-seam-2.1.0.GA.jar)
Downloading: http://repository.jboss.org/maven2/org/jboss/seam/jboss-seam-ui/2.1.0.GA/jboss-seam-ui-2.1.0.GA.jar
254K downloaded  (jboss-seam-ui-2.1.0.GA.jar)
Downloading: http://repository.jboss.org/maven2/org/jboss/seam/jboss-seam-jul/2.1.0.GA/jboss-seam-jul-2.1.0.GA.jar
2K downloaded  (jboss-seam-jul-2.1.0.GA.jar)
[HUDSON] Archiving <https://hudson.apache.org/hudson/job/tobago-trunk/ws/trunk/tobago-example/tobago-example-seam/pom.xml>
to /home/hudson/hudson/jobs/tobago-trunk/modules/org.apache.myfaces.tobago$tobago-example-seam/builds/2010-08-24_21-16-31/archive/org.apache.myfaces.tobago/tobago-example-seam/1.5.0-alpha-2-SNAPSHOT/pom.xml
[INFO] [checkstyle:checkstyle {execution: checkstyle}]
[INFO] [checkstyle:check {execution: default-cli}]
[INFO] [enforcer:enforce {execution: enforce}]
[INFO] [build-helper:add-source {execution: default}]
[INFO] Source directory: <https://hudson.apache.org/hudson/job/tobago-trunk/ws/trunk/tobago-example/tobago-example-seam/src/main/java-jsf-1.2>
added.
[INFO] [remote-resources:process {execution: default}]
[WARNING] Invalid project model for artifact [openjpa-persistence-jdbc:org.apache.openjpa:1.2.0].
It will be ignored by the remote resources Mojo.
[INFO] [resources:resources {execution: default-resources}]
[INFO] Using 'UTF-8' encoding to copy filtered resources.
[INFO] Copying 7 resources
[INFO] Copying 3 resources
[INFO] [compiler:compile {execution: default-compile}]
[INFO] Compiling 2 source files to <https://hudson.apache.org/hudson/job/tobago-trunk/ws/trunk/tobago-example/tobago-example-seam/target/classes>
[INFO] ------------------------------------------------------------------------
[ERROR] BUILD FAILURE
[INFO] ------------------------------------------------------------------------
[INFO] Compilation failure
error: error reading /home/hudson/.m2/repository/org/apache/openjpa/openjpa-persistence-jdbc/1.2.0/openjpa-persistence-jdbc-1.2.0.jar;
error in opening zip file

[INFO] ------------------------------------------------------------------------
[INFO] For more information, run Maven with the -e switch
[INFO] ------------------------------------------------------------------------
[INFO] Total time: 12 minutes 50 seconds
[INFO] Finished at: Tue Aug 24 21:29:28 UTC 2010
[INFO] Final Memory: 84M/227M
[INFO] ------------------------------------------------------------------------
Sending e-mails to: commits@myfaces.apache.org
channel stopped


Mime
View raw message