myfaces-commits mailing list archives

Site index · List index
Message view « Date » · « Thread »
Top « Date » · « Thread »
From Apache Hudson Server <hud...@hudson.apache.org>
Subject Build failed in Hudson: tobago-trunk » Tobago Example Seam #2
Date Tue, 24 Aug 2010 21:29:29 GMT
See <https://hudson.apache.org/hudson/job/tobago-trunk/org.apache.myfaces.tobago$tobago-example-seam/2/>

------------------------------------------
[INFO] ------------------------------------------------------------------------
[INFO] Building Tobago Example Seam
[INFO]    task-segment: [clean, checkstyle:check, install]
[INFO] ------------------------------------------------------------------------
[INFO] [clean:clean {execution: default-clean}]
[INFO] Preparing checkstyle:check
Downloading: http://repository.jboss.org/maven2/org/apache/openjpa/openjpa-persistence-jdbc/1.2.0/openjpa-persistence-jdbc-1.2.0.pom
[INFO] Unable to find resource 'org.apache.openjpa:openjpa-persistence-jdbc:pom:1.2.0' in
repository repository.jboss.org (http://repository.jboss.org/maven2)
Downloading: https://maven-repository.dev.java.net/nonav/repository/org.apache.openjpa/poms/openjpa-persistence-jdbc-1.2.0.pom
379b downloaded  (openjpa-persistence-jdbc-1.2.0.pom)
[WARNING] *** CHECKSUM FAILED - Checksum failed on download: local = '2af63a8b4e3d81e9c2b9095d9894fbb84c5dd1d7';
remote = '<!DOCTYPE' - RETRYING
Downloading: https://maven-repository.dev.java.net/nonav/repository/org.apache.openjpa/poms/openjpa-persistence-jdbc-1.2.0.pom
379b downloaded  (openjpa-persistence-jdbc-1.2.0.pom)
[WARNING] *** CHECKSUM FAILED - Checksum failed on download: local = '2af63a8b4e3d81e9c2b9095d9894fbb84c5dd1d7';
remote = '<!DOCTYPE' - IGNORING
[WARNING] POM for 'org.apache.openjpa:openjpa-persistence-jdbc:pom:1.2.0:compile' is invalid.

Its dependencies (if any) will NOT be available to the current build.
Downloading: http://repository.jboss.org/maven2/org/jboss/seam/jboss-seam/2.1.0.GA/jboss-seam-2.1.0.GA.pom
8K downloaded  (jboss-seam-2.1.0.GA.pom)
Downloading: http://repository.jboss.org/maven2/org/jboss/seam/parent/2.1.0.GA/parent-2.1.0.GA.pom
2K downloaded  (parent-2.1.0.GA.pom)
Downloading: http://repository.jboss.org/maven2/org/jboss/seam/root/2.1.0.GA/root-2.1.0.GA.pom
38K downloaded  (root-2.1.0.GA.pom)
Downloading: http://repository.jboss.org/maven2/org/jboss/el/jboss-el/1.0_02.CR2/jboss-el-1.0_02.CR2.pom
609b downloaded  (jboss-el-1.0_02.CR2.pom)
Downloading: http://repository.jboss.org/maven2/org/jboss/seam/jboss-seam-ui/2.1.0.GA/jboss-seam-ui-2.1.0.GA.pom
5K downloaded  (jboss-seam-ui-2.1.0.GA.pom)
Downloading: http://repository.jboss.org/maven2/org/jboss/seam/jboss-seam-jul/2.1.0.GA/jboss-seam-jul-2.1.0.GA.pom
851b downloaded  (jboss-seam-jul-2.1.0.GA.pom)
Downloading: http://repository.jboss.org/maven2/org/hibernate/hibernate-validator/3.1.0.GA/hibernate-validator-3.1.0.GA.pom
2K downloaded  (hibernate-validator-3.1.0.GA.pom)
Downloading: http://repository.jboss.org/maven2/org/jbpm/jbpm-jpdl/3.2.3/jbpm-jpdl-3.2.3.pom
779b downloaded  (jbpm-jpdl-3.2.3.pom)
Downloading: http://repository.jboss.org/maven2/org/jboss/el/jboss-el/1.0_02.CR2/jboss-el-1.0_02.CR2.jar
Downloading: http://repository.jboss.org/maven2/org/jboss/seam/jboss-seam/2.1.0.GA/jboss-seam-2.1.0.GA.jar
Downloading: http://repository.jboss.org/maven2/org/apache/openjpa/openjpa-persistence-jdbc/1.2.0/openjpa-persistence-jdbc-1.2.0.jar
Downloading: http://repository.jboss.org/maven2/org/jbpm/jbpm-jpdl/3.2.3/jbpm-jpdl-3.2.3.jar
Downloading: http://repository.jboss.org/maven2/org/hibernate/hibernate-validator/3.1.0.GA/hibernate-validator-3.1.0.GA.jar
[INFO] Unable to find resource 'org.apache.openjpa:openjpa-persistence-jdbc:jar:1.2.0' in
repository repository.jboss.org (http://repository.jboss.org/maven2)
Downloading: https://maven-repository.dev.java.net/nonav/repository/org.apache.openjpa/jars/openjpa-persistence-jdbc-1.2.0.jar
379b downloaded  (openjpa-persistence-jdbc-1.2.0.jar)
[WARNING] *** CHECKSUM FAILED - Checksum failed on download: local = '29bd8be9ad763336329e67117a7ad1fc7f4476c7';
remote = '<!DOCTYPE' - RETRYING
Downloading: https://maven-repository.dev.java.net/nonav/repository/org.apache.openjpa/jars/openjpa-persistence-jdbc-1.2.0.jar
379b downloaded  (openjpa-persistence-jdbc-1.2.0.jar)
[WARNING] *** CHECKSUM FAILED - Checksum failed on download: local = '29bd8be9ad763336329e67117a7ad1fc7f4476c7';
remote = '<!DOCTYPE' - IGNORING
61K downloaded  (hibernate-validator-3.1.0.GA.jar)
131K downloaded  (jboss-el-1.0_02.CR2.jar)
659K downloaded  (jbpm-jpdl-3.2.3.jar)
1044K downloaded  (jboss-seam-2.1.0.GA.jar)
Downloading: http://repository.jboss.org/maven2/org/jboss/seam/jboss-seam-ui/2.1.0.GA/jboss-seam-ui-2.1.0.GA.jar
254K downloaded  (jboss-seam-ui-2.1.0.GA.jar)
Downloading: http://repository.jboss.org/maven2/org/jboss/seam/jboss-seam-jul/2.1.0.GA/jboss-seam-jul-2.1.0.GA.jar
2K downloaded  (jboss-seam-jul-2.1.0.GA.jar)
[HUDSON] Archiving <https://hudson.apache.org/hudson/job/tobago-trunk/org.apache.myfaces.tobago$tobago-example-seam/ws/pom.xml>
to /home/hudson/hudson/jobs/tobago-trunk/modules/org.apache.myfaces.tobago$tobago-example-seam/builds/2010-08-24_21-16-31/archive/org.apache.myfaces.tobago/tobago-example-seam/1.5.0-alpha-2-SNAPSHOT/pom.xml
[INFO] [checkstyle:checkstyle {execution: checkstyle}]
[INFO] [checkstyle:check {execution: default-cli}]
[INFO] [enforcer:enforce {execution: enforce}]
[INFO] [build-helper:add-source {execution: default}]
[INFO] Source directory: <https://hudson.apache.org/hudson/job/tobago-trunk/org.apache.myfaces.tobago$tobago-example-seam/ws/src/main/java-jsf-1.2>
added.
[INFO] [remote-resources:process {execution: default}]
[WARNING] Invalid project model for artifact [openjpa-persistence-jdbc:org.apache.openjpa:1.2.0].
It will be ignored by the remote resources Mojo.
[INFO] [resources:resources {execution: default-resources}]
[INFO] Using 'UTF-8' encoding to copy filtered resources.
[INFO] Copying 7 resources
[INFO] Copying 3 resources
[INFO] [compiler:compile {execution: default-compile}]
[INFO] Compiling 2 source files to <https://hudson.apache.org/hudson/job/tobago-trunk/org.apache.myfaces.tobago$tobago-example-seam/ws/target/classes>
[INFO] ------------------------------------------------------------------------
[ERROR] BUILD FAILURE
[INFO] ------------------------------------------------------------------------
[INFO] Compilation failure
error: error reading /home/hudson/.m2/repository/org/apache/openjpa/openjpa-persistence-jdbc/1.2.0/openjpa-persistence-jdbc-1.2.0.jar;
error in opening zip file

[INFO] ------------------------------------------------------------------------
[INFO] For more information, run Maven with the -e switch
[INFO] ------------------------------------------------------------------------
[INFO] Total time: 12 minutes 50 seconds
[INFO] Finished at: Tue Aug 24 21:29:28 UTC 2010
[INFO] Final Memory: 84M/227M
[INFO] ------------------------------------------------------------------------


Mime
View raw message