myfaces-commits mailing list archives

Site index · List index
Message view « Date » · « Thread »
Top « Date » · « Thread »
From Apache Hudson Server <hud...@hudson.apache.org>
Subject Build failed in Hudson: ExtVal for JSF 2.0 (nightly) #1
Date Thu, 26 Aug 2010 04:19:01 GMT
See <https://hudson.apache.org/hudson/job/ExtVal%20for%20JSF%202.0%20(nightly)/1/>

------------------------------------------
[...truncated 765 lines...]
[INFO] ************************************************************** 
[INFO] Starting Jakarta Velocity v1.4
[INFO] RuntimeInstance initializing.
[INFO] Default Properties File: org/apache/velocity/runtime/defaults/velocity.properties
[INFO] Default ResourceManager initializing. (class org.apache.velocity.runtime.resource.ResourceManagerImpl)
[INFO] Resource Loader Instantiated: org.codehaus.plexus.velocity.ContextClassLoaderResourceLoader
[INFO] ClasspathResourceLoader : initialization starting.
[INFO] ClasspathResourceLoader : initialization complete.
[INFO] ResourceCache : initialized. (class org.apache.velocity.runtime.resource.ResourceCacheImpl)
[INFO] Default ResourceManager initialization complete.
[INFO] Loaded System Directive: org.apache.velocity.runtime.directive.Literal
[INFO] Loaded System Directive: org.apache.velocity.runtime.directive.Macro
[INFO] Loaded System Directive: org.apache.velocity.runtime.directive.Parse
[INFO] Loaded System Directive: org.apache.velocity.runtime.directive.Include
[INFO] Loaded System Directive: org.apache.velocity.runtime.directive.Foreach
[INFO] Created: 20 parsers.
[INFO] Velocimacro : initialization starting.
[INFO] Velocimacro : adding VMs from VM library template : VM_global_library.vm
[ERROR] ResourceManager : unable to find resource 'VM_global_library.vm' in any resource loader.
[INFO] Velocimacro : error using  VM library template VM_global_library.vm : org.apache.velocity.exception.ResourceNotFoundException:
Unable to find resource 'VM_global_library.vm'
[INFO] Velocimacro :  VM library template macro registration complete.
[INFO] Velocimacro : allowInline = true : VMs can be defined inline in templates
[INFO] Velocimacro : allowInlineToOverride = false : VMs defined inline may NOT replace previous
VM definitions
[INFO] Velocimacro : allowInlineLocal = false : VMs defined inline will be  global in scope
if allowed.
[INFO] Velocimacro : initialization complete.
[INFO] Velocity successfully started.
[HUDSON] Archiving <https://hudson.apache.org/hudson/job/ExtVal%20for%20JSF%202.0%20(nightly)/ws/branch_for_jsf_2_0/parent/pom.xml>
to /home/hudson/hudson/jobs/ExtVal for JSF 2.0 (nightly)/modules/org.apache.myfaces.extensions.validator$myfaces-extval-parent/builds/2010-08-26_04-11-04/archive/org.apache.myfaces.extensions.validator/myfaces-extval-parent/2.0.4-SNAPSHOT/pom.xml
[INFO] [checkstyle:checkstyle {execution: checkstyle}]
[INFO] Source directory does not exist - skipping report.
[INFO] [checkstyle:check {execution: verify-style}]
[INFO] Unable to perform checkstyle:check, unable to find checkstyle:checkstyle outputFile.
[INFO] [install:install {execution: default-install}]
[INFO] Installing <https://hudson.apache.org/hudson/job/ExtVal%20for%20JSF%202.0%20(nightly)/ws/branch_for_jsf_2_0/parent/pom.xml>
to /export/home/hudson/.m2/repository/org/apache/myfaces/extensions/validator/myfaces-extval-parent/2.0.4-SNAPSHOT/myfaces-extval-parent-2.0.4-SNAPSHOT.pom
[HUDSON] Archiving /export/home/hudson/.m2/repository/org/apache/myfaces/extensions/validator/myfaces-extval-parent/2.0.4-SNAPSHOT/myfaces-extval-parent-2.0.4-SNAPSHOT.pom
to /home/hudson/hudson/jobs/ExtVal for JSF 2.0 (nightly)/modules/org.apache.myfaces.extensions.validator$myfaces-extval-parent/builds/2010-08-26_04-11-04/archive/org.apache.myfaces.extensions.validator/myfaces-extval-parent/2.0.4-SNAPSHOT/myfaces-extval-parent-2.0.4-SNAPSHOT.pom
[INFO] ------------------------------------------------------------------------
[INFO] Building MyFaces Extensions-Validator Core
[INFO]    task-segment: [clean, install]
[INFO] ------------------------------------------------------------------------
[INFO] [clean:clean {execution: default-clean}]
Downloading: http://download.java.net/maven/2//org/apache/myfaces/core/myfaces-api/2.0.1/myfaces-api-2.0.1.pom
[INFO] Unable to find resource 'org.apache.myfaces.core:myfaces-api:pom:2.0.1' in repository
maven2-repository.dev.java.net (http://download.java.net/maven/2/)
Downloading: http://repo1.maven.org/maven2/org/apache/myfaces/core/myfaces-api/2.0.1/myfaces-api-2.0.1.pom

Downloading: http://repository.jboss.org/maven2//org/apache/myfaces/core/myfaces-core-project/2.0.1/myfaces-core-project-2.0.1.pom
[INFO] Unable to find resource 'org.apache.myfaces.core:myfaces-core-project:pom:2.0.1' in
repository jboss releases (http://repository.jboss.org/maven2/)
Downloading: http://download.java.net/maven/2//org/apache/myfaces/core/myfaces-core-project/2.0.1/myfaces-core-project-2.0.1.pom
[INFO] Unable to find resource 'org.apache.myfaces.core:myfaces-core-project:pom:2.0.1' in
repository maven2-repository.dev.java.net (http://download.java.net/maven/2/)
Downloading: http://repo1.maven.org/maven2/org/apache/myfaces/core/myfaces-core-project/2.0.1/myfaces-core-project-2.0.1.pom

Downloading: http://download.java.net/maven/2//org/apache/myfaces/core/myfaces-api/2.0.1/myfaces-api-2.0.1.jar
[INFO] Unable to find resource 'org.apache.myfaces.core:myfaces-api:jar:2.0.1' in repository
maven2-repository.dev.java.net (http://download.java.net/maven/2/)
Downloading: http://repo1.maven.org/maven2/org/apache/myfaces/core/myfaces-api/2.0.1/myfaces-api-2.0.1.jar

[INFO] [antrun:run {execution: javadoc.resources}]
[INFO] Executing tasks
[INFO] Executed tasks
[INFO] [resources:resources {execution: default-resources}]
[INFO] Using default encoding to copy filtered resources.
[INFO] [compiler:compile {execution: default-compile}]
[INFO] Compiling 208 source files to <https://hudson.apache.org/hudson/job/ExtVal%20for%20JSF%202.0%20(nightly)/ws/branch_for_jsf_2_0/core/target/classes>
[INFO] [resources:testResources {execution: default-testResources}]
[INFO] Using default encoding to copy filtered resources.
[INFO] [compiler:testCompile {execution: default-testCompile}]
[INFO] No sources to compile
[INFO] [surefire:test {execution: default-test}]
[INFO] No tests to run.
[HUDSON] Recording test results
[INFO] [jar:jar {execution: default-jar}]
[INFO] Building jar: <https://hudson.apache.org/hudson/job/ExtVal%20for%20JSF%202.0%20(nightly)/ws/branch_for_jsf_2_0/core/target/myfaces-extval-core-2.0.4-SNAPSHOT.jar>
[INFO] Preparing source:jar
[WARNING] Removing: jar from forked lifecycle, to prevent recursive invocation.
[HUDSON] Archiving <https://hudson.apache.org/hudson/job/ExtVal%20for%20JSF%202.0%20(nightly)/ws/branch_for_jsf_2_0/core/pom.xml>
to /home/hudson/hudson/jobs/ExtVal for JSF 2.0 (nightly)/modules/org.apache.myfaces.extensions.validator$myfaces-extval-core/builds/2010-08-26_04-11-04/archive/org.apache.myfaces.extensions.validator/myfaces-extval-core/2.0.4-SNAPSHOT/pom.xml
[HUDSON] Archiving <https://hudson.apache.org/hudson/job/ExtVal%20for%20JSF%202.0%20(nightly)/ws/branch_for_jsf_2_0/core/target/myfaces-extval-core-2.0.4-SNAPSHOT.jar>
to /home/hudson/hudson/jobs/ExtVal for JSF 2.0 (nightly)/modules/org.apache.myfaces.extensions.validator$myfaces-extval-core/builds/2010-08-26_04-11-04/archive/org.apache.myfaces.extensions.validator/myfaces-extval-core/2.0.4-SNAPSHOT/myfaces-extval-core-2.0.4-SNAPSHOT.jar
[INFO] [antrun:run {execution: javadoc.resources}]
[INFO] Executing tasks
[INFO] Executed tasks
[INFO] [source:jar {execution: attach-sources}]
[INFO] Building jar: <https://hudson.apache.org/hudson/job/ExtVal%20for%20JSF%202.0%20(nightly)/ws/branch_for_jsf_2_0/core/target/myfaces-extval-core-2.0.4-SNAPSHOT-sources.jar>
[INFO] Preparing checkstyle:check
[HUDSON] Archiving <https://hudson.apache.org/hudson/job/ExtVal%20for%20JSF%202.0%20(nightly)/ws/branch_for_jsf_2_0/core/target/myfaces-extval-core-2.0.4-SNAPSHOT-sources.jar>
to /home/hudson/hudson/jobs/ExtVal for JSF 2.0 (nightly)/modules/org.apache.myfaces.extensions.validator$myfaces-extval-core/builds/2010-08-26_04-11-04/archive/org.apache.myfaces.extensions.validator/myfaces-extval-core/2.0.4-SNAPSHOT/myfaces-extval-core-2.0.4-SNAPSHOT-sources.jar
[INFO] [checkstyle:checkstyle {execution: checkstyle}]
[WARNING] File encoding has not been set, using platform encoding ISO646-US, i.e. build is
platform dependent!
[INFO] [checkstyle:check {execution: verify-style}]
[INFO] [install:install {execution: default-install}]
[INFO] Installing <https://hudson.apache.org/hudson/job/ExtVal%20for%20JSF%202.0%20(nightly)/ws/branch_for_jsf_2_0/core/target/myfaces-extval-core-2.0.4-SNAPSHOT.jar>
to /export/home/hudson/.m2/repository/org/apache/myfaces/extensions/validator/myfaces-extval-core/2.0.4-SNAPSHOT/myfaces-extval-core-2.0.4-SNAPSHOT.jar
[INFO] Installing <https://hudson.apache.org/hudson/job/ExtVal%20for%20JSF%202.0%20(nightly)/ws/branch_for_jsf_2_0/core/target/myfaces-extval-core-2.0.4-SNAPSHOT-sources.jar>
to /export/home/hudson/.m2/repository/org/apache/myfaces/extensions/validator/myfaces-extval-core/2.0.4-SNAPSHOT/myfaces-extval-core-2.0.4-SNAPSHOT-sources.jar
[INFO] ------------------------------------------------------------------------
[INFO] Building MyFaces Extensions-Validator Validation-Modules
[INFO]    task-segment: [clean, install]
[INFO] ------------------------------------------------------------------------
[INFO] [clean:clean {execution: default-clean}]
[INFO] [antrun:run {execution: javadoc.resources}]
[INFO] Executing tasks
[INFO] Executed tasks
[INFO] [site:attach-descriptor {execution: default-attach-descriptor}]
[INFO] Preparing checkstyle:check
[HUDSON] Archiving <https://hudson.apache.org/hudson/job/ExtVal%20for%20JSF%202.0%20(nightly)/ws/branch_for_jsf_2_0/validation-modules/pom.xml>
to /home/hudson/hudson/jobs/ExtVal for JSF 2.0 (nightly)/modules/org.apache.myfaces.extensions.validator.validation-modules$validation-modules-project/builds/2010-08-26_04-11-04/archive/org.apache.myfaces.extensions.validator.validation-modules/validation-modules-project/2.0.4-SNAPSHOT/pom.xml
[INFO] [checkstyle:checkstyle {execution: checkstyle}]
[INFO] Source directory does not exist - skipping report.
[INFO] [checkstyle:check {execution: verify-style}]
[INFO] Unable to perform checkstyle:check, unable to find checkstyle:checkstyle outputFile.
[INFO] [install:install {execution: default-install}]
[INFO] Installing <https://hudson.apache.org/hudson/job/ExtVal%20for%20JSF%202.0%20(nightly)/ws/branch_for_jsf_2_0/validation-modules/pom.xml>
to /export/home/hudson/.m2/repository/org/apache/myfaces/extensions/validator/validation-modules/validation-modules-project/2.0.4-SNAPSHOT/validation-modules-project-2.0.4-SNAPSHOT.pom
[HUDSON] Archiving /export/home/hudson/.m2/repository/org/apache/myfaces/extensions/validator/validation-modules/validation-modules-project/2.0.4-SNAPSHOT/validation-modules-project-2.0.4-SNAPSHOT.pom
to /home/hudson/hudson/jobs/ExtVal for JSF 2.0 (nightly)/modules/org.apache.myfaces.extensions.validator.validation-modules$validation-modules-project/builds/2010-08-26_04-11-04/archive/org.apache.myfaces.extensions.validator.validation-modules/validation-modules-project/2.0.4-SNAPSHOT/validation-modules-project-2.0.4-SNAPSHOT.pom
[INFO] ------------------------------------------------------------------------
[INFO] Building MyFaces Extensions-Validator Property-Validation-Module
[INFO]    task-segment: [clean, install]
[INFO] ------------------------------------------------------------------------
[INFO] [clean:clean {execution: default-clean}]
[INFO] [antrun:run {execution: javadoc.resources}]
[INFO] Executing tasks
[INFO] Executed tasks
[INFO] [resources:resources {execution: default-resources}]
[INFO] Using default encoding to copy filtered resources.
[INFO] [compiler:compile {execution: default-compile}]
[INFO] Compiling 83 source files to <https://hudson.apache.org/hudson/job/ExtVal%20for%20JSF%202.0%20(nightly)/ws/branch_for_jsf_2_0/validation-modules/property-validation/target/classes>
[INFO] [resources:testResources {execution: default-testResources}]
[INFO] Using default encoding to copy filtered resources.
[INFO] [compiler:testCompile {execution: default-testCompile}]
[INFO] No sources to compile
[INFO] [surefire:test {execution: default-test}]
[INFO] No tests to run.
[HUDSON] Recording test results
[INFO] [jar:jar {execution: default-jar}]
[INFO] Building jar: <https://hudson.apache.org/hudson/job/ExtVal%20for%20JSF%202.0%20(nightly)/ws/branch_for_jsf_2_0/validation-modules/property-validation/target/myfaces-extval-property-validation-2.0.4-SNAPSHOT.jar>
[INFO] Preparing source:jar
[WARNING] Removing: jar from forked lifecycle, to prevent recursive invocation.
[HUDSON] Archiving <https://hudson.apache.org/hudson/job/ExtVal%20for%20JSF%202.0%20(nightly)/ws/branch_for_jsf_2_0/validation-modules/property-validation/pom.xml>
to /home/hudson/hudson/jobs/ExtVal for JSF 2.0 (nightly)/modules/org.apache.myfaces.extensions.validator.validation-modules$myfaces-extval-property-validation/builds/2010-08-26_04-11-04/archive/org.apache.myfaces.extensions.validator.validation-modules/myfaces-extval-property-validation/2.0.4-SNAPSHOT/pom.xml
[HUDSON] Archiving <https://hudson.apache.org/hudson/job/ExtVal%20for%20JSF%202.0%20(nightly)/ws/branch_for_jsf_2_0/validation-modules/property-validation/target/myfaces-extval-property-validation-2.0.4-SNAPSHOT.jar>
to /home/hudson/hudson/jobs/ExtVal for JSF 2.0 (nightly)/modules/org.apache.myfaces.extensions.validator.validation-modules$myfaces-extval-property-validation/builds/2010-08-26_04-11-04/archive/org.apache.myfaces.extensions.validator.validation-modules/myfaces-extval-property-validation/2.0.4-SNAPSHOT/myfaces-extval-property-validation-2.0.4-SNAPSHOT.jar
[INFO] [antrun:run {execution: javadoc.resources}]
[INFO] Executing tasks
[INFO] Executed tasks
[INFO] [source:jar {execution: attach-sources}]
[INFO] Building jar: <https://hudson.apache.org/hudson/job/ExtVal%20for%20JSF%202.0%20(nightly)/ws/branch_for_jsf_2_0/validation-modules/property-validation/target/myfaces-extval-property-validation-2.0.4-SNAPSHOT-sources.jar>
[INFO] Preparing checkstyle:check
[HUDSON] Archiving <https://hudson.apache.org/hudson/job/ExtVal%20for%20JSF%202.0%20(nightly)/ws/branch_for_jsf_2_0/validation-modules/property-validation/target/myfaces-extval-property-validation-2.0.4-SNAPSHOT-sources.jar>
to /home/hudson/hudson/jobs/ExtVal for JSF 2.0 (nightly)/modules/org.apache.myfaces.extensions.validator.validation-modules$myfaces-extval-property-validation/builds/2010-08-26_04-11-04/archive/org.apache.myfaces.extensions.validator.validation-modules/myfaces-extval-property-validation/2.0.4-SNAPSHOT/myfaces-extval-property-validation-2.0.4-SNAPSHOT-sources.jar
[INFO] [checkstyle:checkstyle {execution: checkstyle}]
[WARNING] File encoding has not been set, using platform encoding ISO646-US, i.e. build is
platform dependent!
[INFO] [checkstyle:check {execution: verify-style}]
[INFO] [install:install {execution: default-install}]
[INFO] Installing <https://hudson.apache.org/hudson/job/ExtVal%20for%20JSF%202.0%20(nightly)/ws/branch_for_jsf_2_0/validation-modules/property-validation/target/myfaces-extval-property-validation-2.0.4-SNAPSHOT.jar>
to /export/home/hudson/.m2/repository/org/apache/myfaces/extensions/validator/validation-modules/myfaces-extval-property-validation/2.0.4-SNAPSHOT/myfaces-extval-property-validation-2.0.4-SNAPSHOT.jar
[INFO] Installing <https://hudson.apache.org/hudson/job/ExtVal%20for%20JSF%202.0%20(nightly)/ws/branch_for_jsf_2_0/validation-modules/property-validation/target/myfaces-extval-property-validation-2.0.4-SNAPSHOT-sources.jar>
to /export/home/hudson/.m2/repository/org/apache/myfaces/extensions/validator/validation-modules/myfaces-extval-property-validation/2.0.4-SNAPSHOT/myfaces-extval-property-validation-2.0.4-SNAPSHOT-sources.jar
[INFO] ------------------------------------------------------------------------
[INFO] Building MyFaces Extensions-Validator Bean-Validation-Integration-Module (JSR 303)
[INFO]    task-segment: [clean, install]
[INFO] ------------------------------------------------------------------------
[INFO] [clean:clean {execution: default-clean}]
[INFO] [antrun:run {execution: javadoc.resources}]
[INFO] Executing tasks
[INFO] Executed tasks
[INFO] [resources:resources {execution: default-resources}]
[INFO] Using default encoding to copy filtered resources.
[INFO] [compiler:compile {execution: default-compile}]
[INFO] Compiling 42 source files to <https://hudson.apache.org/hudson/job/ExtVal%20for%20JSF%202.0%20(nightly)/ws/branch_for_jsf_2_0/validation-modules/bean-validation/target/classes>
[INFO] [resources:testResources {execution: default-testResources}]
[INFO] Using default encoding to copy filtered resources.
[INFO] [compiler:testCompile {execution: default-testCompile}]
[INFO] No sources to compile
[INFO] [surefire:test {execution: default-test}]
[INFO] No tests to run.
[HUDSON] Recording test results
[INFO] [jar:jar {execution: default-jar}]
[INFO] Building jar: <https://hudson.apache.org/hudson/job/ExtVal%20for%20JSF%202.0%20(nightly)/ws/branch_for_jsf_2_0/validation-modules/bean-validation/target/myfaces-extval-bean-validation-2.0.4-SNAPSHOT.jar>
[INFO] Preparing source:jar
[WARNING] Removing: jar from forked lifecycle, to prevent recursive invocation.
[HUDSON] Archiving <https://hudson.apache.org/hudson/job/ExtVal%20for%20JSF%202.0%20(nightly)/ws/branch_for_jsf_2_0/validation-modules/bean-validation/pom.xml>
to /home/hudson/hudson/jobs/ExtVal for JSF 2.0 (nightly)/modules/org.apache.myfaces.extensions.validator.validation-modules$myfaces-extval-bean-validation/builds/2010-08-26_04-11-04/archive/org.apache.myfaces.extensions.validator.validation-modules/myfaces-extval-bean-validation/2.0.4-SNAPSHOT/pom.xml
[HUDSON] Archiving <https://hudson.apache.org/hudson/job/ExtVal%20for%20JSF%202.0%20(nightly)/ws/branch_for_jsf_2_0/validation-modules/bean-validation/target/myfaces-extval-bean-validation-2.0.4-SNAPSHOT.jar>
to /home/hudson/hudson/jobs/ExtVal for JSF 2.0 (nightly)/modules/org.apache.myfaces.extensions.validator.validation-modules$myfaces-extval-bean-validation/builds/2010-08-26_04-11-04/archive/org.apache.myfaces.extensions.validator.validation-modules/myfaces-extval-bean-validation/2.0.4-SNAPSHOT/myfaces-extval-bean-validation-2.0.4-SNAPSHOT.jar
[INFO] [antrun:run {execution: javadoc.resources}]
[INFO] Executing tasks
[INFO] Executed tasks
[INFO] [source:jar {execution: attach-sources}]
[INFO] Building jar: <https://hudson.apache.org/hudson/job/ExtVal%20for%20JSF%202.0%20(nightly)/ws/branch_for_jsf_2_0/validation-modules/bean-validation/target/myfaces-extval-bean-validation-2.0.4-SNAPSHOT-sources.jar>
[INFO] Preparing checkstyle:check
[HUDSON] Archiving <https://hudson.apache.org/hudson/job/ExtVal%20for%20JSF%202.0%20(nightly)/ws/branch_for_jsf_2_0/validation-modules/bean-validation/target/myfaces-extval-bean-validation-2.0.4-SNAPSHOT-sources.jar>
to /home/hudson/hudson/jobs/ExtVal for JSF 2.0 (nightly)/modules/org.apache.myfaces.extensions.validator.validation-modules$myfaces-extval-bean-validation/builds/2010-08-26_04-11-04/archive/org.apache.myfaces.extensions.validator.validation-modules/myfaces-extval-bean-validation/2.0.4-SNAPSHOT/myfaces-extval-bean-validation-2.0.4-SNAPSHOT-sources.jar
[INFO] [checkstyle:checkstyle {execution: checkstyle}]
[WARNING] File encoding has not been set, using platform encoding ISO646-US, i.e. build is
platform dependent!
[INFO] [checkstyle:check {execution: verify-style}]
[INFO] [install:install {execution: default-install}]
[INFO] Installing <https://hudson.apache.org/hudson/job/ExtVal%20for%20JSF%202.0%20(nightly)/ws/branch_for_jsf_2_0/validation-modules/bean-validation/target/myfaces-extval-bean-validation-2.0.4-SNAPSHOT.jar>
to /export/home/hudson/.m2/repository/org/apache/myfaces/extensions/validator/validation-modules/myfaces-extval-bean-validation/2.0.4-SNAPSHOT/myfaces-extval-bean-validation-2.0.4-SNAPSHOT.jar
[INFO] Installing <https://hudson.apache.org/hudson/job/ExtVal%20for%20JSF%202.0%20(nightly)/ws/branch_for_jsf_2_0/validation-modules/bean-validation/target/myfaces-extval-bean-validation-2.0.4-SNAPSHOT-sources.jar>
to /export/home/hudson/.m2/repository/org/apache/myfaces/extensions/validator/validation-modules/myfaces-extval-bean-validation/2.0.4-SNAPSHOT/myfaces-extval-bean-validation-2.0.4-SNAPSHOT-sources.jar
[INFO] ------------------------------------------------------------------------
[INFO] Building MyFaces Extensions-Validator Component-Support Modules
[INFO]    task-segment: [clean, install]
[INFO] ------------------------------------------------------------------------
[INFO] [clean:clean {execution: default-clean}]
[INFO] [antrun:run {execution: javadoc.resources}]
[INFO] Executing tasks
[INFO] Executed tasks
[INFO] [site:attach-descriptor {execution: default-attach-descriptor}]
[INFO] Preparing checkstyle:check
[HUDSON] Archiving <https://hudson.apache.org/hudson/job/ExtVal%20for%20JSF%202.0%20(nightly)/ws/branch_for_jsf_2_0/component-support/pom.xml>
to /home/hudson/hudson/jobs/ExtVal for JSF 2.0 (nightly)/modules/org.apache.myfaces.extensions.validator.component-support-modules$component-support-modules-project/builds/2010-08-26_04-11-04/archive/org.apache.myfaces.extensions.validator.component-support-modules/component-support-modules-project/2.0.4-SNAPSHOT/pom.xml
[INFO] [checkstyle:checkstyle {execution: checkstyle}]
[INFO] Source directory does not exist - skipping report.
[INFO] [checkstyle:check {execution: verify-style}]
[INFO] Unable to perform checkstyle:check, unable to find checkstyle:checkstyle outputFile.
[INFO] [install:install {execution: default-install}]
[INFO] Installing <https://hudson.apache.org/hudson/job/ExtVal%20for%20JSF%202.0%20(nightly)/ws/branch_for_jsf_2_0/component-support/pom.xml>
to /export/home/hudson/.m2/repository/org/apache/myfaces/extensions/validator/component-support-modules/component-support-modules-project/2.0.4-SNAPSHOT/component-support-modules-project-2.0.4-SNAPSHOT.pom
[HUDSON] Archiving /export/home/hudson/.m2/repository/org/apache/myfaces/extensions/validator/component-support-modules/component-support-modules-project/2.0.4-SNAPSHOT/component-support-modules-project-2.0.4-SNAPSHOT.pom
to /home/hudson/hudson/jobs/ExtVal for JSF 2.0 (nightly)/modules/org.apache.myfaces.extensions.validator.component-support-modules$component-support-modules-project/builds/2010-08-26_04-11-04/archive/org.apache.myfaces.extensions.validator.component-support-modules/component-support-modules-project/2.0.4-SNAPSHOT/component-support-modules-project-2.0.4-SNAPSHOT.pom
[INFO] ------------------------------------------------------------------------
[INFO] Building MyFaces Extensions-Validator Trinidad Support Module
[INFO]    task-segment: [clean, install]
[INFO] ------------------------------------------------------------------------
[INFO] [clean:clean {execution: default-clean}]
Downloading: http://download.java.net/maven/2//org/apache/myfaces/trinidad/trinidad-api/2.0.0-alpha-2/trinidad-api-2.0.0-alpha-2.pom
[INFO] Unable to find resource 'org.apache.myfaces.trinidad:trinidad-api:pom:2.0.0-alpha-2'
in repository maven2-repository.dev.java.net (http://download.java.net/maven/2/)
Downloading: http://repo1.maven.org/maven2/org/apache/myfaces/trinidad/trinidad-api/2.0.0-alpha-2/trinidad-api-2.0.0-alpha-2.pom

Downloading: http://download.java.net/maven/2//org/apache/myfaces/trinidad/trinidad/2.0.0-alpha-2/trinidad-2.0.0-alpha-2.pom
[INFO] Unable to find resource 'org.apache.myfaces.trinidad:trinidad:pom:2.0.0-alpha-2' in
repository maven2-repository.dev.java.net (http://download.java.net/maven/2/)
Downloading: http://repo1.maven.org/maven2/org/apache/myfaces/trinidad/trinidad/2.0.0-alpha-2/trinidad-2.0.0-alpha-2.pom

Downloading: http://download.java.net/maven/2//org/apache/myfaces/trinidad/trinidad-impl/2.0.0-alpha-2/trinidad-impl-2.0.0-alpha-2.pom
[INFO] Unable to find resource 'org.apache.myfaces.trinidad:trinidad-impl:pom:2.0.0-alpha-2'
in repository maven2-repository.dev.java.net (http://download.java.net/maven/2/)
Downloading: http://repo1.maven.org/maven2/org/apache/myfaces/trinidad/trinidad-impl/2.0.0-alpha-2/trinidad-impl-2.0.0-alpha-2.pom

Downloading: http://download.java.net/maven/2//org/apache/myfaces/trinidad/trinidad-api/2.0.0-alpha-2/trinidad-api-2.0.0-alpha-2.jar
[INFO] Unable to find resource 'org.apache.myfaces.trinidad:trinidad-api:jar:2.0.0-alpha-2'
in repository maven2-repository.dev.java.net (http://download.java.net/maven/2/)
Downloading: http://repo1.maven.org/maven2/org/apache/myfaces/trinidad/trinidad-api/2.0.0-alpha-2/trinidad-api-2.0.0-alpha-2.jar

Downloading: http://download.java.net/maven/2//org/apache/myfaces/trinidad/trinidad-impl/2.0.0-alpha-2/trinidad-impl-2.0.0-alpha-2.jar
[INFO] Unable to find resource 'org.apache.myfaces.trinidad:trinidad-impl:jar:2.0.0-alpha-2'
in repository maven2-repository.dev.java.net (http://download.java.net/maven/2/)
Downloading: http://repo1.maven.org/maven2/org/apache/myfaces/trinidad/trinidad-impl/2.0.0-alpha-2/trinidad-impl-2.0.0-alpha-2.jar

[INFO] [antrun:run {execution: javadoc.resources}]
[INFO] Executing tasks
[INFO] Executed tasks
[INFO] [resources:resources {execution: default-resources}]
[INFO] Using default encoding to copy filtered resources.
[INFO] [compiler:compile {execution: default-compile}]
[INFO] Compiling 25 source files to <https://hudson.apache.org/hudson/job/ExtVal%20for%20JSF%202.0%20(nightly)/ws/branch_for_jsf_2_0/component-support/trinidad-support/target/classes>
[HUDSON] Archiving <https://hudson.apache.org/hudson/job/ExtVal%20for%20JSF%202.0%20(nightly)/ws/branch_for_jsf_2_0/component-support/trinidad-support/pom.xml>
to /home/hudson/hudson/jobs/ExtVal for JSF 2.0 (nightly)/modules/org.apache.myfaces.extensions.validator.component-support-modules$myfaces-extval-trinidad-support/builds/2010-08-26_04-11-04/archive/org.apache.myfaces.extensions.validator.component-support-modules/myfaces-extval-trinidad-support/2.0.4-SNAPSHOT/pom.xml
[INFO] ------------------------------------------------------------------------
[ERROR] BUILD FAILURE
[INFO] ------------------------------------------------------------------------
[INFO] Compilation failure
<https://hudson.apache.org/hudson/job/ExtVal%20for%20JSF%202.0%20(nightly)/ws/branch_for_jsf_2_0/component-support/trinidad-support/src/main/java/org/apache/myfaces/extensions/validator/trinidad/initializer/component/LengthInitializer.java>:[28,-1]
cannot access org.apache.myfaces.trinidad.validator.ClientValidator
bad class file: /export/home/hudson/.m2/repository/org/apache/myfaces/trinidad/trinidad-api/2.0.0-alpha-2/trinidad-api-2.0.0-alpha-2.jar(org/apache/myfaces/trinidad/validator/ClientValidator.class)
class file has wrong version 50.0, should be 49.0


[INFO] ------------------------------------------------------------------------
[INFO] For more information, run Maven with the -e switch
[INFO] ------------------------------------------------------------------------
[INFO] Total time: 6 minutes 55 seconds
[INFO] Finished at: Thu Aug 26 04:19:55 GMT+00:00 2010
[INFO] Final Memory: 28M/221M
[INFO] ------------------------------------------------------------------------
Sending e-mails to: commits@myfaces.apache.org
channel stopped


Mime
View raw message