myfaces-commits mailing list archives

Site index · List index
Message view « Date » · « Thread »
Top « Date » · « Thread »
From Apache Hudson Server <hud...@hudson.apache.org>
Subject Build failed in Hudson: myfaces-current-2.0 #1
Date Thu, 26 Aug 2010 16:24:10 GMT
See <https://hudson.apache.org/hudson/job/myfaces-current-2.0/1/>

------------------------------------------
[...truncated 2236 lines...]
Discovered a new module org.apache.myfaces:myfaces-base Build Project
Discovered a new module org.apache.myfaces.shared:myfaces-shared-project Apache MyFaces Shared
For JSF 2.0 - Project
Discovered a new module org.apache.myfaces.shared:myfaces-shared-core Apache MyFaces Shared
For JSF 2.0 - Core
Discovered a new module org.apache.myfaces.shared:myfaces-shared-impl MyFaces Shared Impl
Discovered a new module org.apache.myfaces.shared:myfaces-shared-tomahawk MyFaces Shared Tomahawk
Discovered a new module org.apache.myfaces.core:myfaces-core-project Apache MyFaces JSF-2.0
Core Project
Discovered a new module org.apache.myfaces.core:myfaces-api Apache MyFaces JSF Core-2.0 API
Discovered a new module org.apache.myfaces.core:myfaces-impl-ee6 Apache MyFaces JSF-2.0 Core
Impl for Java EE 6
Discovered a new module org.apache.myfaces.core:myfaces-impl Apache MyFaces JSF-2.0 Core Impl
[current20] $ /home/hudson/tools/java/latest1.6/bin/java -cp /home/hudson/hudson-slave/maven-agent.jar:/home/hudson/tools/maven/latest/boot/classworlds-1.1.jar
hudson.maven.agent.Main /home/hudson/tools/maven/latest /home/hudson/hudson-slave/slave.jar
/home/hudson/hudson-slave/maven-interceptor.jar 38479 /home/hudson/hudson-slave/maven2.1-interceptor.jar
<===[HUDSON REMOTING CAPACITY]===>channel started
   Executing Maven:  -B -f <https://hudson.apache.org/hudson/job/myfaces-current-2.0/ws/current20/pom.xml>
install
[INFO] Scanning for projects...
[INFO] Reactor build order: 
[INFO]   Apache MyFaces JSF-2.0 Core Project
[INFO]   Apache MyFaces JSF Core-2.0 API
[INFO]   Apache MyFaces Shared For JSF 2.0 - Project
[INFO]   Apache MyFaces Shared For JSF 2.0 - Core
[INFO]   MyFaces Shared Impl
[INFO]   MyFaces Shared Tomahawk
[INFO]   Apache MyFaces JSF-2.0 Core Impl for Java EE 6
[INFO]   Apache MyFaces JSF-2.0 Core Impl
[INFO]   Build Project
Downloading: http://repository.apache.org/snapshots/org/apache/myfaces/buildtools/myfaces-javascript-plugin/1.0.1/myfaces-javascript-plugin-1.0.1.pom
[INFO] Unable to find resource 'org.apache.myfaces.buildtools:myfaces-javascript-plugin:pom:1.0.1'
in repository apache.snapshots (http://people.apache.org/repo/m2-snapshot-repository)
Downloading: http://snapshots.repository.codehaus.org//org/apache/myfaces/buildtools/myfaces-javascript-plugin/1.0.1/myfaces-javascript-plugin-1.0.1.pom
[INFO] Unable to find resource 'org.apache.myfaces.buildtools:myfaces-javascript-plugin:pom:1.0.1'
in repository Codehaus Snapshots (http://snapshots.repository.codehaus.org/)
Downloading: http://repo1.maven.org/maven2/org/apache/myfaces/buildtools/myfaces-javascript-plugin/1.0.1/myfaces-javascript-plugin-1.0.1.pom

Downloading: http://repository.apache.org/snapshots/org/apache/myfaces/buildtools/myfaces-plugin-parent/1.0.2/myfaces-plugin-parent-1.0.2.pom
[INFO] Unable to find resource 'org.apache.myfaces.buildtools:myfaces-plugin-parent:pom:1.0.2'
in repository apache.snapshots (http://people.apache.org/repo/m2-snapshot-repository)
Downloading: http://snapshots.repository.codehaus.org//org/apache/myfaces/buildtools/myfaces-plugin-parent/1.0.2/myfaces-plugin-parent-1.0.2.pom
[INFO] Unable to find resource 'org.apache.myfaces.buildtools:myfaces-plugin-parent:pom:1.0.2'
in repository Codehaus Snapshots (http://snapshots.repository.codehaus.org/)
Downloading: http://repo1.maven.org/maven2/org/apache/myfaces/buildtools/myfaces-plugin-parent/1.0.2/myfaces-plugin-parent-1.0.2.pom

Downloading: http://repository.apache.org/snapshots/org/apache/myfaces/buildtools/myfaces-javascript-plugin/1.0.1/myfaces-javascript-plugin-1.0.1.jar
[INFO] Unable to find resource 'org.apache.myfaces.buildtools:myfaces-javascript-plugin:maven-plugin:1.0.1'
in repository apache.snapshots (http://people.apache.org/repo/m2-snapshot-repository)
Downloading: http://snapshots.repository.codehaus.org//org/apache/myfaces/buildtools/myfaces-javascript-plugin/1.0.1/myfaces-javascript-plugin-1.0.1.jar
[INFO] Unable to find resource 'org.apache.myfaces.buildtools:myfaces-javascript-plugin:maven-plugin:1.0.1'
in repository Codehaus Snapshots (http://snapshots.repository.codehaus.org/)
Downloading: http://repo1.maven.org/maven2/org/apache/myfaces/buildtools/myfaces-javascript-plugin/1.0.1/myfaces-javascript-plugin-1.0.1.jar

Downloading: http://repository.apache.org/snapshots/com/yahoo/platform/yui/yuicompressor/2.2.5/yuicompressor-2.2.5.pom
[INFO] Unable to find resource 'com.yahoo.platform.yui:yuicompressor:pom:2.2.5' in repository
apache.snapshots (http://people.apache.org/repo/m2-snapshot-repository)
Downloading: http://snapshots.repository.codehaus.org//com/yahoo/platform/yui/yuicompressor/2.2.5/yuicompressor-2.2.5.pom
[INFO] Unable to find resource 'com.yahoo.platform.yui:yuicompressor:pom:2.2.5' in repository
Codehaus Snapshots (http://snapshots.repository.codehaus.org/)
Downloading: http://repo1.maven.org/maven2/com/yahoo/platform/yui/yuicompressor/2.2.5/yuicompressor-2.2.5.pom

Downloading: http://repository.apache.org/snapshots/commons-jxpath/commons-jxpath/1.2/commons-jxpath-1.2.pom
[INFO] Unable to find resource 'commons-jxpath:commons-jxpath:pom:1.2' in repository apache.snapshots
(http://people.apache.org/repo/m2-snapshot-repository)
Downloading: http://snapshots.repository.codehaus.org//commons-jxpath/commons-jxpath/1.2/commons-jxpath-1.2.pom
[INFO] Unable to find resource 'commons-jxpath:commons-jxpath:pom:1.2' in repository Codehaus
Snapshots (http://snapshots.repository.codehaus.org/)
Downloading: http://repo1.maven.org/maven2/commons-jxpath/commons-jxpath/1.2/commons-jxpath-1.2.pom

Downloading: http://repository.apache.org/snapshots/xerces/xerces/1.2.3/xerces-1.2.3.pom
[INFO] Unable to find resource 'xerces:xerces:pom:1.2.3' in repository apache.snapshots (http://people.apache.org/repo/m2-snapshot-repository)
Downloading: http://snapshots.repository.codehaus.org//xerces/xerces/1.2.3/xerces-1.2.3.pom
[INFO] Unable to find resource 'xerces:xerces:pom:1.2.3' in repository Codehaus Snapshots
(http://snapshots.repository.codehaus.org/)
Downloading: http://repository.jboss.org/maven2//xerces/xerces/1.2.3/xerces-1.2.3.pom
[INFO] Unable to find resource 'xerces:xerces:pom:1.2.3' in repository jboss releases (http://repository.jboss.org/maven2/)
Downloading: http://download.java.net/maven/2/xerces/xerces/1.2.3/xerces-1.2.3.pom
[INFO] Unable to find resource 'xerces:xerces:pom:1.2.3' in repository java.net (http://download.java.net/maven/2)
Downloading: http://repo1.maven.org/maven2/xerces/xerces/1.2.3/xerces-1.2.3.pom

Downloading: http://repository.apache.org/snapshots/servletapi/servletapi/2.2/servletapi-2.2.pom
[INFO] Unable to find resource 'servletapi:servletapi:pom:2.2' in repository apache.snapshots
(http://people.apache.org/repo/m2-snapshot-repository)
Downloading: http://snapshots.repository.codehaus.org//servletapi/servletapi/2.2/servletapi-2.2.pom
[INFO] Unable to find resource 'servletapi:servletapi:pom:2.2' in repository Codehaus Snapshots
(http://snapshots.repository.codehaus.org/)
Downloading: http://repository.jboss.org/maven2//servletapi/servletapi/2.2/servletapi-2.2.pom
[INFO] Unable to find resource 'servletapi:servletapi:pom:2.2' in repository jboss releases
(http://repository.jboss.org/maven2/)
Downloading: http://download.java.net/maven/2/servletapi/servletapi/2.2/servletapi-2.2.pom
[INFO] Unable to find resource 'servletapi:servletapi:pom:2.2' in repository java.net (http://download.java.net/maven/2)
Downloading: http://repo1.maven.org/maven2/servletapi/servletapi/2.2/servletapi-2.2.pom

Downloading: http://repository.apache.org/snapshots/jdom/jdom/b9/jdom-b9.pom
[INFO] Unable to find resource 'jdom:jdom:pom:b9' in repository apache.snapshots (http://people.apache.org/repo/m2-snapshot-repository)
Downloading: http://snapshots.repository.codehaus.org//jdom/jdom/b9/jdom-b9.pom
[INFO] Unable to find resource 'jdom:jdom:pom:b9' in repository Codehaus Snapshots (http://snapshots.repository.codehaus.org/)
Downloading: http://repository.jboss.org/maven2//jdom/jdom/b9/jdom-b9.pom
[INFO] Unable to find resource 'jdom:jdom:pom:b9' in repository jboss releases (http://repository.jboss.org/maven2/)
Downloading: http://download.java.net/maven/2/jdom/jdom/b9/jdom-b9.pom
[INFO] Unable to find resource 'jdom:jdom:pom:b9' in repository java.net (http://download.java.net/maven/2)
Downloading: http://repo1.maven.org/maven2/jdom/jdom/b9/jdom-b9.pom

Downloading: http://repository.apache.org/snapshots/commons-beanutils/commons-beanutils/1.4/commons-beanutils-1.4.pom
[INFO] Unable to find resource 'commons-beanutils:commons-beanutils:pom:1.4' in repository
apache.snapshots (http://people.apache.org/repo/m2-snapshot-repository)
Downloading: http://snapshots.repository.codehaus.org//commons-beanutils/commons-beanutils/1.4/commons-beanutils-1.4.pom
[INFO] Unable to find resource 'commons-beanutils:commons-beanutils:pom:1.4' in repository
Codehaus Snapshots (http://snapshots.repository.codehaus.org/)
Downloading: http://repository.jboss.org/maven2//commons-beanutils/commons-beanutils/1.4/commons-beanutils-1.4.pom
[INFO] Unable to find resource 'commons-beanutils:commons-beanutils:pom:1.4' in repository
jboss releases (http://repository.jboss.org/maven2/)
Downloading: http://download.java.net/maven/2/commons-beanutils/commons-beanutils/1.4/commons-beanutils-1.4.pom
[INFO] Unable to find resource 'commons-beanutils:commons-beanutils:pom:1.4' in repository
java.net (http://download.java.net/maven/2)
Downloading: http://repo1.maven.org/maven2/commons-beanutils/commons-beanutils/1.4/commons-beanutils-1.4.pom

Downloading: http://repository.apache.org/snapshots/xerces/xerces/1.2.3/xerces-1.2.3.jar
Downloading: http://repository.apache.org/snapshots/jdom/jdom/b9/jdom-b9.jar
Downloading: http://repository.apache.org/snapshots/com/yahoo/platform/yui/yuicompressor/2.2.5/yuicompressor-2.2.5.jar
Downloading: http://repository.apache.org/snapshots/commons-beanutils/commons-beanutils/1.4/commons-beanutils-1.4.jar
Downloading: http://repository.apache.org/snapshots/commons-jxpath/commons-jxpath/1.2/commons-jxpath-1.2.jar
[INFO] Unable to find resource 'com.yahoo.platform.yui:yuicompressor:jar:2.2.5' in repository
apache.snapshots (http://people.apache.org/repo/m2-snapshot-repository)
Downloading: http://snapshots.repository.codehaus.org//com/yahoo/platform/yui/yuicompressor/2.2.5/yuicompressor-2.2.5.jar
[INFO] Unable to find resource 'commons-jxpath:commons-jxpath:jar:1.2' in repository apache.snapshots
(http://people.apache.org/repo/m2-snapshot-repository)
Downloading: http://snapshots.repository.codehaus.org//commons-jxpath/commons-jxpath/1.2/commons-jxpath-1.2.jar
[INFO] Unable to find resource 'xerces:xerces:jar:1.2.3' in repository apache.snapshots (http://people.apache.org/repo/m2-snapshot-repository)
Downloading: http://snapshots.repository.codehaus.org//xerces/xerces/1.2.3/xerces-1.2.3.jar
[INFO] Unable to find resource 'commons-beanutils:commons-beanutils:jar:1.4' in repository
apache.snapshots (http://people.apache.org/repo/m2-snapshot-repository)
Downloading: http://snapshots.repository.codehaus.org//commons-beanutils/commons-beanutils/1.4/commons-beanutils-1.4.jar
[INFO] Unable to find resource 'jdom:jdom:jar:b9' in repository apache.snapshots (http://people.apache.org/repo/m2-snapshot-repository)
Downloading: http://snapshots.repository.codehaus.org//jdom/jdom/b9/jdom-b9.jar
[INFO] Unable to find resource 'com.yahoo.platform.yui:yuicompressor:jar:2.2.5' in repository
Codehaus Snapshots (http://snapshots.repository.codehaus.org/)
Downloading: http://repo1.maven.org/maven2/com/yahoo/platform/yui/yuicompressor/2.2.5/yuicompressor-2.2.5.jar
[INFO] Unable to find resource 'xerces:xerces:jar:1.2.3' in repository Codehaus Snapshots
(http://snapshots.repository.codehaus.org/)
Downloading: http://repository.jboss.org/maven2//xerces/xerces/1.2.3/xerces-1.2.3.jar
[INFO] Unable to find resource 'commons-beanutils:commons-beanutils:jar:1.4' in repository
Codehaus Snapshots (http://snapshots.repository.codehaus.org/)
Downloading: http://repository.jboss.org/maven2//commons-beanutils/commons-beanutils/1.4/commons-beanutils-1.4.jar
[INFO] Unable to find resource 'commons-jxpath:commons-jxpath:jar:1.2' in repository Codehaus
Snapshots (http://snapshots.repository.codehaus.org/)
Downloading: http://repo1.maven.org/maven2/commons-jxpath/commons-jxpath/1.2/commons-jxpath-1.2.jar
[INFO] Unable to find resource 'jdom:jdom:jar:b9' in repository Codehaus Snapshots (http://snapshots.repository.codehaus.org/)
Downloading: http://repository.jboss.org/maven2//jdom/jdom/b9/jdom-b9.jar
[INFO] Unable to find resource 'xerces:xerces:jar:1.2.3' in repository jboss releases (http://repository.jboss.org/maven2/)
Downloading: http://download.java.net/maven/2/xerces/xerces/1.2.3/xerces-1.2.3.jar
[INFO] Unable to find resource 'jdom:jdom:jar:b9' in repository jboss releases (http://repository.jboss.org/maven2/)
Downloading: http://download.java.net/maven/2/jdom/jdom/b9/jdom-b9.jar
[INFO] Unable to find resource 'xerces:xerces:jar:1.2.3' in repository java.net (http://download.java.net/maven/2)
Downloading: http://repo1.maven.org/maven2/xerces/xerces/1.2.3/xerces-1.2.3.jar
[INFO] Unable to find resource 'jdom:jdom:jar:b9' in repository java.net (http://download.java.net/maven/2)
Downloading: http://repo1.maven.org/maven2/jdom/jdom/b9/jdom-b9.jar




[INFO] Unable to find resource 'commons-beanutils:commons-beanutils:jar:1.4' in repository
jboss releases (http://repository.jboss.org/maven2/)
Downloading: http://download.java.net/maven/2/commons-beanutils/commons-beanutils/1.4/commons-beanutils-1.4.jar
[INFO] Unable to find resource 'commons-beanutils:commons-beanutils:jar:1.4' in repository
java.net (http://download.java.net/maven/2)
Downloading: http://repo1.maven.org/maven2/commons-beanutils/commons-beanutils/1.4/commons-beanutils-1.4.jar

[INFO] ------------------------------------------------------------------------
[INFO] Building Apache MyFaces JSF-2.0 Core Project
[INFO]    task-segment: [install]
[INFO] ------------------------------------------------------------------------
[INFO] Setting property: classpath.resource.loader.class => 'org.codehaus.plexus.velocity.ContextClassLoaderResourceLoader'.
[INFO] Setting property: velocimacro.messages.on => 'false'.
[INFO] Setting property: resource.loader => 'classpath'.
[INFO] Setting property: resource.manager.logwhenfound => 'false'.
[INFO] [remote-resources:process {execution: default}]
[INFO] [site:attach-descriptor {execution: default-attach-descriptor}]
[INFO] Parent project loaded from repository.
[INFO] Preparing checkstyle:check
[INFO] Setting property: classpath.resource.loader.class => 'org.codehaus.plexus.velocity.ContextClassLoaderResourceLoader'.
[INFO] Setting property: velocimacro.messages.on => 'false'.
[INFO] Setting property: resource.loader => 'classpath'.
[INFO] Setting property: resource.manager.logwhenfound => 'false'.
[INFO] ************************************************************** 
[INFO] Starting Jakarta Velocity v1.4
[INFO] RuntimeInstance initializing.
[INFO] Default Properties File: org/apache/velocity/runtime/defaults/velocity.properties
[INFO] Default ResourceManager initializing. (class org.apache.velocity.runtime.resource.ResourceManagerImpl)
[INFO] Resource Loader Instantiated: org.codehaus.plexus.velocity.ContextClassLoaderResourceLoader
[INFO] ClasspathResourceLoader : initialization starting.
[INFO] ClasspathResourceLoader : initialization complete.
[INFO] ResourceCache : initialized. (class org.apache.velocity.runtime.resource.ResourceCacheImpl)
[INFO] Default ResourceManager initialization complete.
[INFO] Loaded System Directive: org.apache.velocity.runtime.directive.Literal
[INFO] Loaded System Directive: org.apache.velocity.runtime.directive.Macro
[INFO] Loaded System Directive: org.apache.velocity.runtime.directive.Parse
[INFO] Loaded System Directive: org.apache.velocity.runtime.directive.Include
[INFO] Loaded System Directive: org.apache.velocity.runtime.directive.Foreach
[INFO] Created: 20 parsers.
[INFO] Velocimacro : initialization starting.
[INFO] Velocimacro : adding VMs from VM library template : VM_global_library.vm
[ERROR] ResourceManager : unable to find resource 'VM_global_library.vm' in any resource loader.
[INFO] Velocimacro : error using  VM library template VM_global_library.vm : org.apache.velocity.exception.ResourceNotFoundException:
Unable to find resource 'VM_global_library.vm'
[INFO] Velocimacro :  VM library template macro registration complete.
[INFO] Velocimacro : allowInline = true : VMs can be defined inline in templates
[INFO] Velocimacro : allowInlineToOverride = false : VMs defined inline may NOT replace previous
VM definitions
[INFO] Velocimacro : allowInlineLocal = false : VMs defined inline will be  global in scope
if allowed.
[INFO] Velocimacro : initialization complete.
[INFO] Velocity successfully started.
[HUDSON] Archiving <https://hudson.apache.org/hudson/job/myfaces-current-2.0/ws/current20/core/pom.xml>
to /home/hudson/hudson/jobs/myfaces-current-2.0/modules/org.apache.myfaces.core$myfaces-core-project/builds/2010-08-26_16-23-27/archive/org.apache.myfaces.core/myfaces-core-project/2.0.2-SNAPSHOT/pom.xml
[HUDSON] Archiving <https://hudson.apache.org/hudson/job/myfaces-current-2.0/ws/current20/core/target/myfaces-core-project-2.0.2-SNAPSHOT-site.xml>
to /home/hudson/hudson/jobs/myfaces-current-2.0/modules/org.apache.myfaces.core$myfaces-core-project/builds/2010-08-26_16-23-27/archive/org.apache.myfaces.core/myfaces-core-project/2.0.2-SNAPSHOT/myfaces-core-project-2.0.2-SNAPSHOT-site.xml
[INFO] [checkstyle:checkstyle {execution: checkstyle}]
[INFO] Source directory does not exist - skipping report.
[INFO] [checkstyle:check {execution: verify-style}]
[INFO] Unable to perform checkstyle:check, unable to find checkstyle:checkstyle outputFile.
[INFO] [install:install {execution: default-install}]
[INFO] Installing <https://hudson.apache.org/hudson/job/myfaces-current-2.0/ws/current20/core/pom.xml>
to /home/hudson/.m2/repository/org/apache/myfaces/core/myfaces-core-project/2.0.2-SNAPSHOT/myfaces-core-project-2.0.2-SNAPSHOT.pom
[INFO] Installing <https://hudson.apache.org/hudson/job/myfaces-current-2.0/ws/current20/core/target/myfaces-core-project-2.0.2-SNAPSHOT-site.xml>
to /home/hudson/.m2/repository/org/apache/myfaces/core/myfaces-core-project/2.0.2-SNAPSHOT/myfaces-core-project-2.0.2-SNAPSHOT-site.xml
[HUDSON] Archiving /home/hudson/.m2/repository/org/apache/myfaces/core/myfaces-core-project/2.0.2-SNAPSHOT/myfaces-core-project-2.0.2-SNAPSHOT.pom
to /home/hudson/hudson/jobs/myfaces-current-2.0/modules/org.apache.myfaces.core$myfaces-core-project/builds/2010-08-26_16-23-27/archive/org.apache.myfaces.core/myfaces-core-project/2.0.2-SNAPSHOT/myfaces-core-project-2.0.2-SNAPSHOT.pom
[INFO] ------------------------------------------------------------------------
[INFO] Building Apache MyFaces JSF Core-2.0 API
[INFO]    task-segment: [install]
[INFO] ------------------------------------------------------------------------
[INFO] artifact de.berlios.jsunit:jsunit-maven2-plugin: checking for updates from apache.snapshots
[INFO] artifact de.berlios.jsunit:jsunit-maven2-plugin: checking for updates from Codehaus
Snapshots
[INFO] artifact de.berlios.jsunit:jsunit-maven2-plugin: checking for updates from central
[INFO] snapshot org.apache.myfaces.buildtools:myfaces-builder-plugin:1.0.7-SNAPSHOT: checking
for updates from apache.snapshots
[INFO] snapshot org.apache.myfaces.buildtools:myfaces-builder-plugin:1.0.7-SNAPSHOT: checking
for updates from Codehaus Snapshots
[INFO] snapshot org.apache.myfaces.buildtools:myfaces-builder-plugin:1.0.7-SNAPSHOT: checking
for updates from jboss releases
[INFO] snapshot org.apache.myfaces.buildtools:myfaces-builder-plugin:1.0.7-SNAPSHOT: checking
for updates from java.net
[INFO] snapshot org.apache.myfaces.buildtools:myfaces-builder-plugin:1.0.7-SNAPSHOT: checking
for updates from apache-maven-snapshots
Downloading: http://people.apache.org/repo/m2-snapshot-repository/org/apache/myfaces/buildtools/myfaces-builder-plugin/1.0.7-SNAPSHOT/myfaces-builder-plugin-1.0.7-SNAPSHOT.pom
5K downloaded  (myfaces-builder-plugin-1.0.7-SNAPSHOT.pom)
Downloading: http://repository.apache.org/snapshots/org/apache/myfaces/buildtools/myfaces-plugin-parent/1.0.3/myfaces-plugin-parent-1.0.3.pom
[INFO] Unable to find resource 'org.apache.myfaces.buildtools:myfaces-plugin-parent:pom:1.0.3'
in repository apache.snapshots (http://people.apache.org/repo/m2-snapshot-repository)
Downloading: http://snapshots.repository.codehaus.org//org/apache/myfaces/buildtools/myfaces-plugin-parent/1.0.3/myfaces-plugin-parent-1.0.3.pom
[INFO] Unable to find resource 'org.apache.myfaces.buildtools:myfaces-plugin-parent:pom:1.0.3'
in repository Codehaus Snapshots (http://snapshots.repository.codehaus.org/)
Downloading: http://repo1.maven.org/maven2/org/apache/myfaces/buildtools/myfaces-plugin-parent/1.0.3/myfaces-plugin-parent-1.0.3.pom

Downloading: http://repository.apache.org/snapshots/org/apache/myfaces/buildtools/myfaces-builder-plugin/1.0.7-SNAPSHOT/myfaces-builder-plugin-1.0.7-SNAPSHOT.jar
[INFO] Unable to find resource 'org.apache.myfaces.buildtools:myfaces-builder-plugin:maven-plugin:1.0.7-SNAPSHOT'
in repository apache.snapshots (http://people.apache.org/repo/m2-snapshot-repository)
Downloading: http://snapshots.repository.codehaus.org//org/apache/myfaces/buildtools/myfaces-builder-plugin/1.0.7-SNAPSHOT/myfaces-builder-plugin-1.0.7-SNAPSHOT.jar
[INFO] Unable to find resource 'org.apache.myfaces.buildtools:myfaces-builder-plugin:maven-plugin:1.0.7-SNAPSHOT'
in repository Codehaus Snapshots (http://snapshots.repository.codehaus.org/)
[INFO] ------------------------------------------------------------------------
[ERROR] BUILD FAILURE
[INFO] ------------------------------------------------------------------------
[INFO] A required plugin was not found: Plugin could not be found - check that the goal name
is correct: Unable to download the artifact from any repository

Try downloading the file manually from the project website.

Then, install it using the command: 
    mvn install:install-file -DgroupId=org.apache.myfaces.buildtools -DartifactId=myfaces-builder-plugin
-Dversion=1.0.7-SNAPSHOT -Dpackaging=maven-plugin -Dfile=/path/to/file

Alternatively, if you host your own repository you can deploy the file there: 
    mvn deploy:deploy-file -DgroupId=org.apache.myfaces.buildtools -DartifactId=myfaces-builder-plugin
-Dversion=1.0.7-SNAPSHOT -Dpackaging=maven-plugin -Dfile=/path/to/file -Durl=[url] -DrepositoryId=[id]


  org.apache.myfaces.buildtools:myfaces-builder-plugin:maven-plugin:1.0.7-SNAPSHOT

from the specified remote repositories:
  central (http://repo1.maven.org/maven2),
  Codehaus Snapshots (http://snapshots.repository.codehaus.org/),
  Nexus (http://repository.apache.org/snapshots)


  org.apache.myfaces.buildtools:myfaces-builder-plugin:maven-plugin:1.0.7-SNAPSHOT

from the specified remote repositories:
  central (http://repo1.maven.org/maven2),
  Codehaus Snapshots (http://snapshots.repository.codehaus.org/),
  Nexus (http://repository.apache.org/snapshots)


[INFO] ------------------------------------------------------------------------
[INFO] For more information, run Maven with the -e switch
[INFO] ------------------------------------------------------------------------
[INFO] Total time: 36 seconds
[INFO] Finished at: Thu Aug 26 16:24:09 UTC 2010
[INFO] Final Memory: 35M/371M
[INFO] ------------------------------------------------------------------------
channel stopped


Mime
View raw message