myfaces-commits mailing list archives

Site index · List index
Message view « Date » · « Thread »
Top « Date » · « Thread »
From Apache Hudson Server <hud...@hudson.apache.org>
Subject Build failed in Hudson: tobago-trunk » Tobago Example Seam #3
Date Tue, 24 Aug 2010 21:41:08 GMT
See <https://hudson.apache.org/hudson/job/tobago-trunk/org.apache.myfaces.tobago$tobago-example-seam/3/>

------------------------------------------
Started by user bommel
Building remotely on vesta.apache.org (Ubuntu)
$ /home/hudson/tools/java/latest1.5/bin/java -cp /home/hudson/hudson-slave/maven-agent.jar:/home/hudson/tools/maven/latest/boot/classworlds-1.1.jar
hudson.maven.agent.Main /home/hudson/tools/maven/latest /home/hudson/hudson-slave/slave.jar
/home/hudson/hudson-slave/maven-interceptor.jar 40390 /home/hudson/hudson-slave/maven2.1-interceptor.jar
channel started<===[
HUDSON REMOTING CAPACITY]===>   Executing Maven:  -N -B -f <https://hudson.apache.org/hudson/job/tobago-trunk/org.apache.myfaces.tobago$tobago-example-seam/ws/pom.xml>
-Pall-modules clean checkstyle:check install
[INFO] Scanning for projects...
[INFO] ------------------------------------------------------------------------
[INFO] Building Tobago Example Seam
[INFO]    task-segment: [clean, checkstyle:check, install]
[INFO] ------------------------------------------------------------------------
[INFO] [clean:clean {execution: default-clean}]
[INFO] Deleting directory <https://hudson.apache.org/hudson/job/tobago-trunk/org.apache.myfaces.tobago$tobago-example-seam/ws/target>
[INFO] Preparing checkstyle:check
[INFO] snapshot org.apache.myfaces.tobago:tobago-theme-scarborough:1.5.0-alpha-2-SNAPSHOT:
checking for updates from repository.jboss.org
[INFO] snapshot org.apache.myfaces.tobago:tobago-theme-scarborough:1.5.0-alpha-2-SNAPSHOT:
checking for updates from java.net.legacy
[WARNING] *** CHECKSUM FAILED - Checksum failed on download: local = '31b98e98bef7033610f8a6990fd4c4ce4c14d131';
remote = '<!DOCTYPE' - RETRYING
[WARNING] *** CHECKSUM FAILED - Checksum failed on download: local = '31b98e98bef7033610f8a6990fd4c4ce4c14d131';
remote = '<!DOCTYPE' - IGNORING
[HUDSON] Archiving <https://hudson.apache.org/hudson/job/tobago-trunk/org.apache.myfaces.tobago$tobago-example-seam/ws/pom.xml>
to /home/hudson/hudson/jobs/tobago-trunk/modules/org.apache.myfaces.tobago$tobago-example-seam/builds/2010-08-24_21-40-49/archive/org.apache.myfaces.tobago/tobago-example-seam/1.5.0-alpha-2-SNAPSHOT/pom.xml
[INFO] ------------------------------------------------------------------------
[ERROR] BUILD ERROR
[INFO] ------------------------------------------------------------------------
[INFO] Error building POM (may not be this project's POM).


Project ID: org.apache.myfaces.tobago:tobago-theme-scarborough

Reason: Error getting POM for 'org.apache.myfaces.tobago:tobago-theme-scarborough' from the
repository: Unable to read local copy of metadata: Cannot read metadata from '/home/hudson/.m2/repository/org/apache/myfaces/tobago/tobago-theme-scarborough/1.5.0-alpha-2-SNAPSHOT/maven-metadata-java.net.legacy.xml':
end tag name </body> must match start tag name <hr> from line 7 (position: TEXT
seen ...</address>\n</body>... @9:8) 
  org.apache.myfaces.tobago:tobago-theme-scarborough:pom:1.5.0-alpha-2-SNAPSHOT


 for project org.apache.myfaces.tobago:tobago-theme-scarborough


[INFO] ------------------------------------------------------------------------
[INFO] For more information, run Maven with the -e switch
[INFO] ------------------------------------------------------------------------
[INFO] Total time: 9 seconds
[INFO] Finished at: Tue Aug 24 21:41:08 UTC 2010
[INFO] Final Memory: 11M/198M
[INFO] ------------------------------------------------------------------------


Mime
View raw message