myfaces-commits mailing list archives

Site index · List index
Message view « Date » · « Thread »
Top « Date » · « Thread »
From Apache Hudson Server <hud...@hudson.apache.org>
Subject Build failed in Jenkins: myfaces-trinidad-plugins-20x #127
Date Wed, 09 Mar 2011 00:11:10 GMT
See <https://hudson.apache.org/hudson/job/myfaces-trinidad-plugins-20x/127/>

------------------------------------------
[...truncated 194 lines...]
[INFO] Applying extractor for language: bsh
[INFO] Extractor for language: bsh found 0 mojo descriptors.
[INFO] [remote-resources:process {execution: default}]
[INFO] [resources:resources {execution: default-resources}]
[INFO] Using 'UTF-8' encoding to copy filtered resources.
[INFO] Copying 0 resource
[INFO] Copying 2 resources
[INFO] [compiler:compile {execution: default-compile}]
[INFO] Nothing to compile - all classes are up to date
[INFO] [resources:testResources {execution: default-testResources}]
[INFO] Using 'UTF-8' encoding to copy filtered resources.
[INFO] skip non existing resourceDirectory <https://hudson.apache.org/hudson/job/myfaces-trinidad-plugins-20x/ws/maven-i18n-plugin/src/test/resources>
[INFO] Copying 2 resources
[INFO] [compiler:testCompile {execution: default-testCompile}]
[INFO] No sources to compile
[INFO] [surefire:test {execution: default-test}]
[INFO] Surefire report directory: <https://hudson.apache.org/hudson/job/myfaces-trinidad-plugins-20x/ws/maven-i18n-plugin/target/surefire-reports>

-------------------------------------------------------
 T E S T S
-------------------------------------------------------
There are no tests to run.

Results :

Tests run: 0, Failures: 0, Errors: 0, Skipped: 0

[JENKINS] Recording test results
[INFO] [jar:jar {execution: default-jar}]
[INFO] Building jar: <https://hudson.apache.org/hudson/job/myfaces-trinidad-plugins-20x/ws/maven-i18n-plugin/target/maven-i18n-plugin-2.0.5-SNAPSHOT.jar>
[INFO] [plugin:addPluginArtifactMetadata {execution: default-addPluginArtifactMetadata}]
[INFO] [install:install {execution: default-install}]
[INFO] Installing <https://hudson.apache.org/hudson/job/myfaces-trinidad-plugins-20x/ws/maven-i18n-plugin/target/maven-i18n-plugin-2.0.5-SNAPSHOT.jar>
to /home/hudson/.m2/repository/org/apache/myfaces/trinidadbuild/maven-i18n-plugin/2.0.5-SNAPSHOT/maven-i18n-plugin-2.0.5-SNAPSHOT.jar
[JENKINS] Archiving <https://hudson.apache.org/hudson/job/myfaces-trinidad-plugins-20x/ws/maven-i18n-plugin/pom.xml>
to /home/hudson/hudson/jobs/myfaces-trinidad-plugins-20x/modules/org.apache.myfaces.trinidadbuild$maven-i18n-plugin/builds/2011-03-09_00-10-00/archive/org.apache.myfaces.trinidadbuild/maven-i18n-plugin/2.0.5-SNAPSHOT/pom.xml
[JENKINS] Archiving <https://hudson.apache.org/hudson/job/myfaces-trinidad-plugins-20x/ws/maven-i18n-plugin/target/maven-i18n-plugin-2.0.5-SNAPSHOT.jar>
to /home/hudson/hudson/jobs/myfaces-trinidad-plugins-20x/modules/org.apache.myfaces.trinidadbuild$maven-i18n-plugin/builds/2011-03-09_00-10-00/archive/org.apache.myfaces.trinidadbuild/maven-i18n-plugin/2.0.5-SNAPSHOT/maven-i18n-plugin-2.0.5-SNAPSHOT.jar
[INFO] ------------------------------------------------------------------------
[INFO] Building Apache Trinidad Maven Javascript Plugin
[INFO]    task-segment: [install]
[INFO] ------------------------------------------------------------------------
[INFO] [enforcer:enforce {execution: enforce-versions}]
[WARNING] While downloading javacc:javacc:3.2
  This artifact has been relocated to net.java.dev.javacc:javacc:3.2.


[INFO] [javacc:generate {execution: default}]
[INFO] Nothing to process - all grammars are up to date
[INFO] [plugin:descriptor {execution: default-descriptor}]
[INFO] Using 'UTF-8' encoding to read mojo metadata.
[INFO] Applying mojo extractor for language: java
[INFO] Mojo extractor for language: java found 2 mojo descriptors.
[INFO] Applying mojo extractor for language: bsh
[INFO] Mojo extractor for language: bsh found 0 mojo descriptors.
[INFO] [remote-resources:process {execution: default}]
[INFO] [resources:resources {execution: default-resources}]
[INFO] Using 'UTF-8' encoding to copy filtered resources.
[INFO] Copying 0 resource
[INFO] Copying 2 resources
[INFO] [compiler:compile {execution: default-compile}]
[INFO] Compiling 6 source files to <https://hudson.apache.org/hudson/job/myfaces-trinidad-plugins-20x/ws/maven-javascript-plugin/target/classes>
[INFO] [resources:testResources {execution: default-testResources}]
[INFO] Using 'UTF-8' encoding to copy filtered resources.
[INFO] skip non existing resourceDirectory <https://hudson.apache.org/hudson/job/myfaces-trinidad-plugins-20x/ws/maven-javascript-plugin/src/test/resources>
[INFO] Copying 2 resources
[INFO] [compiler:testCompile {execution: default-testCompile}]
[INFO] No sources to compile
[INFO] [surefire:test {execution: default-test}]
[INFO] Surefire report directory: <https://hudson.apache.org/hudson/job/myfaces-trinidad-plugins-20x/ws/maven-javascript-plugin/target/surefire-reports>

-------------------------------------------------------
 T E S T S
-------------------------------------------------------
There are no tests to run.

Results :

Tests run: 0, Failures: 0, Errors: 0, Skipped: 0

[JENKINS] Recording test results
[INFO] [jar:jar {execution: default-jar}]
[INFO] Building jar: <https://hudson.apache.org/hudson/job/myfaces-trinidad-plugins-20x/ws/maven-javascript-plugin/target/maven-javascript-plugin-2.0.5-SNAPSHOT.jar>
[INFO] [plugin:addPluginArtifactMetadata {execution: default-addPluginArtifactMetadata}]
[INFO] [install:install {execution: default-install}]
[INFO] Installing <https://hudson.apache.org/hudson/job/myfaces-trinidad-plugins-20x/ws/maven-javascript-plugin/target/maven-javascript-plugin-2.0.5-SNAPSHOT.jar>
to /home/hudson/.m2/repository/org/apache/myfaces/trinidadbuild/maven-javascript-plugin/2.0.5-SNAPSHOT/maven-javascript-plugin-2.0.5-SNAPSHOT.jar
[JENKINS] Archiving <https://hudson.apache.org/hudson/job/myfaces-trinidad-plugins-20x/ws/maven-javascript-plugin/pom.xml>
to /home/hudson/hudson/jobs/myfaces-trinidad-plugins-20x/modules/org.apache.myfaces.trinidadbuild$maven-javascript-plugin/builds/2011-03-09_00-10-00/archive/org.apache.myfaces.trinidadbuild/maven-javascript-plugin/2.0.5-SNAPSHOT/pom.xml
[JENKINS] Archiving <https://hudson.apache.org/hudson/job/myfaces-trinidad-plugins-20x/ws/maven-javascript-plugin/target/maven-javascript-plugin-2.0.5-SNAPSHOT.jar>
to /home/hudson/hudson/jobs/myfaces-trinidad-plugins-20x/modules/org.apache.myfaces.trinidadbuild$maven-javascript-plugin/builds/2011-03-09_00-10-00/archive/org.apache.myfaces.trinidadbuild/maven-javascript-plugin/2.0.5-SNAPSHOT/maven-javascript-plugin-2.0.5-SNAPSHOT.jar
[INFO] ------------------------------------------------------------------------
[INFO] Building Apache Trinidad Maven XRTS Plugin
[INFO]    task-segment: [install]
[INFO] ------------------------------------------------------------------------
[INFO] [enforcer:enforce {execution: enforce-versions}]
[INFO] [plugin:descriptor {execution: default-descriptor}]
[INFO] Using 2 extractors.
[INFO] Applying extractor for language: java
[INFO] Extractor for language: java found 2 mojo descriptors.
[INFO] Applying extractor for language: bsh
[INFO] Extractor for language: bsh found 0 mojo descriptors.
[INFO] [remote-resources:process {execution: default}]
[INFO] [resources:resources {execution: default-resources}]
[INFO] Using 'UTF-8' encoding to copy filtered resources.
[INFO] Copying 0 resource
[INFO] Copying 2 resources
[INFO] [compiler:compile {execution: default-compile}]
[INFO] Nothing to compile - all classes are up to date
[INFO] [resources:testResources {execution: default-testResources}]
[INFO] Using 'UTF-8' encoding to copy filtered resources.
[INFO] skip non existing resourceDirectory <https://hudson.apache.org/hudson/job/myfaces-trinidad-plugins-20x/ws/maven-xrts-plugin/src/test/resources>
[INFO] Copying 2 resources
[INFO] [compiler:testCompile {execution: default-testCompile}]
[INFO] No sources to compile
[INFO] [surefire:test {execution: default-test}]
[INFO] Surefire report directory: <https://hudson.apache.org/hudson/job/myfaces-trinidad-plugins-20x/ws/maven-xrts-plugin/target/surefire-reports>

-------------------------------------------------------
 T E S T S
-------------------------------------------------------
There are no tests to run.

Results :

Tests run: 0, Failures: 0, Errors: 0, Skipped: 0

[JENKINS] Recording test results
[INFO] [jar:jar {execution: default-jar}]
[INFO] Building jar: <https://hudson.apache.org/hudson/job/myfaces-trinidad-plugins-20x/ws/maven-xrts-plugin/target/maven-xrts-plugin-2.0.5-SNAPSHOT.jar>
[INFO] [plugin:addPluginArtifactMetadata {execution: default-addPluginArtifactMetadata}]
[INFO] [install:install {execution: default-install}]
[INFO] Installing <https://hudson.apache.org/hudson/job/myfaces-trinidad-plugins-20x/ws/maven-xrts-plugin/target/maven-xrts-plugin-2.0.5-SNAPSHOT.jar>
to /home/hudson/.m2/repository/org/apache/myfaces/trinidadbuild/maven-xrts-plugin/2.0.5-SNAPSHOT/maven-xrts-plugin-2.0.5-SNAPSHOT.jar
[JENKINS] Archiving <https://hudson.apache.org/hudson/job/myfaces-trinidad-plugins-20x/ws/maven-xrts-plugin/pom.xml>
to /home/hudson/hudson/jobs/myfaces-trinidad-plugins-20x/modules/org.apache.myfaces.trinidadbuild$maven-xrts-plugin/builds/2011-03-09_00-10-00/archive/org.apache.myfaces.trinidadbuild/maven-xrts-plugin/2.0.5-SNAPSHOT/pom.xml
[JENKINS] Archiving <https://hudson.apache.org/hudson/job/myfaces-trinidad-plugins-20x/ws/maven-xrts-plugin/target/maven-xrts-plugin-2.0.5-SNAPSHOT.jar>
to /home/hudson/hudson/jobs/myfaces-trinidad-plugins-20x/modules/org.apache.myfaces.trinidadbuild$maven-xrts-plugin/builds/2011-03-09_00-10-00/archive/org.apache.myfaces.trinidadbuild/maven-xrts-plugin/2.0.5-SNAPSHOT/maven-xrts-plugin-2.0.5-SNAPSHOT.jar
[INFO] ------------------------------------------------------------------------
[INFO] Building Apache Trinidad Maven Tag Documentation Report
[INFO]    task-segment: [install]
[INFO] ------------------------------------------------------------------------
[INFO] snapshot org.apache.myfaces.trinidadbuild:maven-faces-plugin:2.0.5-SNAPSHOT: checking
for updates from apache.snapshots
[WARNING] repository metadata for: 'snapshot org.apache.myfaces.trinidadbuild:maven-faces-plugin:2.0.5-SNAPSHOT'
could not be retrieved from repository: apache.snapshots due to an error: Error transferring
file: Server returned HTTP response code: 500 for URL: http://repository.apache.org/snapshots/org/apache/myfaces/trinidadbuild/maven-faces-plugin/2.0.5-SNAPSHOT/maven-metadata.xml
[INFO] Repository 'apache.snapshots' will be blacklisted
[INFO] [enforcer:enforce {execution: enforce-versions}]
[INFO] [plugin:descriptor {execution: default-descriptor}]
[INFO] Using 'UTF-8' encoding to read mojo metadata.
[INFO] Applying mojo extractor for language: java
[INFO] Mojo extractor for language: java found 1 mojo descriptors.
[INFO] Applying mojo extractor for language: bsh
[INFO] Mojo extractor for language: bsh found 0 mojo descriptors.
[INFO] [remote-resources:process {execution: default}]
[INFO] [resources:resources {execution: default-resources}]
[INFO] Using 'UTF-8' encoding to copy filtered resources.
[INFO] Copying 0 resource
[INFO] Copying 2 resources
[INFO] [compiler:compile {execution: default-compile}]
[INFO] Nothing to compile - all classes are up to date
[INFO] [resources:testResources {execution: default-testResources}]
[INFO] Using 'UTF-8' encoding to copy filtered resources.
[INFO] skip non existing resourceDirectory <https://hudson.apache.org/hudson/job/myfaces-trinidad-plugins-20x/ws/maven-tagdoc-plugin/src/test/resources>
[INFO] Copying 2 resources
[INFO] [compiler:testCompile {execution: default-testCompile}]
[INFO] No sources to compile
[INFO] [surefire:test {execution: default-test}]
[INFO] Surefire report directory: <https://hudson.apache.org/hudson/job/myfaces-trinidad-plugins-20x/ws/maven-tagdoc-plugin/target/surefire-reports>

-------------------------------------------------------
 T E S T S
-------------------------------------------------------
There are no tests to run.

Results :

Tests run: 0, Failures: 0, Errors: 0, Skipped: 0

[JENKINS] Recording test results
[INFO] [jar:jar {execution: default-jar}]
[INFO] Building jar: <https://hudson.apache.org/hudson/job/myfaces-trinidad-plugins-20x/ws/maven-tagdoc-plugin/target/maven-tagdoc-plugin-2.0.5-SNAPSHOT.jar>
[INFO] [plugin:addPluginArtifactMetadata {execution: default-addPluginArtifactMetadata}]
[INFO] [install:install {execution: default-install}]
[INFO] Installing <https://hudson.apache.org/hudson/job/myfaces-trinidad-plugins-20x/ws/maven-tagdoc-plugin/target/maven-tagdoc-plugin-2.0.5-SNAPSHOT.jar>
to /home/hudson/.m2/repository/org/apache/myfaces/trinidadbuild/maven-tagdoc-plugin/2.0.5-SNAPSHOT/maven-tagdoc-plugin-2.0.5-SNAPSHOT.jar
[JENKINS] Archiving <https://hudson.apache.org/hudson/job/myfaces-trinidad-plugins-20x/ws/maven-tagdoc-plugin/pom.xml>
to /home/hudson/hudson/jobs/myfaces-trinidad-plugins-20x/modules/org.apache.myfaces.trinidadbuild$maven-tagdoc-plugin/builds/2011-03-09_00-10-00/archive/org.apache.myfaces.trinidadbuild/maven-tagdoc-plugin/2.0.5-SNAPSHOT/pom.xml
[JENKINS] Archiving <https://hudson.apache.org/hudson/job/myfaces-trinidad-plugins-20x/ws/maven-tagdoc-plugin/target/maven-tagdoc-plugin-2.0.5-SNAPSHOT.jar>
to /home/hudson/hudson/jobs/myfaces-trinidad-plugins-20x/modules/org.apache.myfaces.trinidadbuild$maven-tagdoc-plugin/builds/2011-03-09_00-10-00/archive/org.apache.myfaces.trinidadbuild/maven-tagdoc-plugin/2.0.5-SNAPSHOT/maven-tagdoc-plugin-2.0.5-SNAPSHOT.jar
[INFO] 
[INFO] 
[INFO] ------------------------------------------------------------------------
[INFO] Reactor Summary:
[INFO] ------------------------------------------------------------------------
[INFO] Apache Trinidad Maven Plugin Parent ................... SUCCESS [6.264s]
[INFO] Apache Trinidad Maven JDev Plugin ..................... SUCCESS [3.602s]
[INFO] Apache Trinidad Maven Faces Plugin .................... SUCCESS [12.526s]
[INFO] Apache Trinidad Maven Javacc Plugin ................... SUCCESS [1.767s]
[INFO] Apache Trinidad Maven i18n Plugin ..................... SUCCESS [1.467s]
[INFO] Apache Trinidad Maven Javascript Plugin ............... SUCCESS [3.460s]
[INFO] Apache Trinidad Maven XRTS Plugin ..................... SUCCESS [1.071s]
[INFO] Apache Trinidad Maven Tag Documentation Report ........ SUCCESS [1.585s]
[INFO] ------------------------------------------------------------------------
[INFO] ------------------------------------------------------------------------
[INFO] BUILD SUCCESSFUL
[INFO] ------------------------------------------------------------------------
[INFO] Total time: 44 seconds
[INFO] Finished at: Tue Mar 08 16:11:09 PST 2011
[INFO] Final Memory: 44M/374M
[INFO] ------------------------------------------------------------------------
channel stopped
Deploying artifacts to https://repository.apache.org/content/repositories/snapshots
Deploying the main artifact maven-faces-plugin-2.0.5-SNAPSHOT.jar
ERROR: Error retrieving previous build number for artifact 'org.apache.myfaces.trinidadbuild:maven-faces-plugin:maven-plugin':
repository metadata for: 'snapshot org.apache.myfaces.trinidadbuild:maven-faces-plugin:2.0.5-SNAPSHOT'
could not be retrieved from repository:  due to an error: Error transferring file: Server
returned HTTP response code: 500 for URL: https://repository.apache.org/content/repositories/snapshots/org/apache/myfaces/trinidadbuild/maven-faces-plugin/2.0.5-SNAPSHOT/maven-metadata.xml
org.apache.maven.artifact.deployer.ArtifactDeploymentException: Error retrieving previous
build number for artifact 'org.apache.myfaces.trinidadbuild:maven-faces-plugin:maven-plugin':
repository metadata for: 'snapshot org.apache.myfaces.trinidadbuild:maven-faces-plugin:2.0.5-SNAPSHOT'
could not be retrieved from repository:  due to an error: Error transferring file: Server
returned HTTP response code: 500 for URL: https://repository.apache.org/content/repositories/snapshots/org/apache/myfaces/trinidadbuild/maven-faces-plugin/2.0.5-SNAPSHOT/maven-metadata.xml
	at hudson.maven.artifact.transform.SnapshotTransformation.transformForDeployment(SnapshotTransformation.java:110)
	at hudson.maven.artifact.transform.DefaultArtifactTransformationManager.transformForDeployment(DefaultArtifactTransformationManager.java:69)
	at hudson.maven.artifact.deployer.DefaultArtifactDeployer.deploy(DefaultArtifactDeployer.java:92)
	at hudson.maven.reporters.MavenArtifactRecord.deploy(MavenArtifactRecord.java:136)
	at hudson.maven.RedeployPublisher.perform(RedeployPublisher.java:128)
	at hudson.tasks.BuildStepMonitor$1.perform(BuildStepMonitor.java:19)
	at hudson.model.AbstractBuild$AbstractRunner.perform(AbstractBuild.java:644)
	at hudson.model.AbstractBuild$AbstractRunner.performAllBuildSteps(AbstractBuild.java:623)
	at hudson.maven.MavenModuleSetBuild$RunnerImpl.post2(MavenModuleSetBuild.java:766)
	at hudson.model.AbstractBuild$AbstractRunner.post(AbstractBuild.java:570)
	at hudson.model.Run.run(Run.java:1386)
	at hudson.maven.MavenModuleSetBuild.run(MavenModuleSetBuild.java:406)
	at hudson.model.ResourceController.execute(ResourceController.java:88)
	at hudson.model.Executor.run(Executor.java:145)
Caused by: org.apache.maven.artifact.repository.metadata.RepositoryMetadataResolutionException:
repository metadata for: 'snapshot org.apache.myfaces.trinidadbuild:maven-faces-plugin:2.0.5-SNAPSHOT'
could not be retrieved from repository:  due to an error: Error transferring file: Server
returned HTTP response code: 500 for URL: https://repository.apache.org/content/repositories/snapshots/org/apache/myfaces/trinidadbuild/maven-faces-plugin/2.0.5-SNAPSHOT/maven-metadata.xml
	at org.apache.maven.artifact.repository.metadata.DefaultRepositoryMetadataManager.resolveAlways(DefaultRepositoryMetadataManager.java:400)
	at hudson.maven.artifact.transform.SnapshotTransformation.resolveLatestSnapshotBuildNumber(SnapshotTransformation.java:160)
	at hudson.maven.artifact.transform.SnapshotTransformation.transformForDeployment(SnapshotTransformation.java:104)
	... 13 more
Caused by: org.apache.maven.wagon.TransferFailedException: Error transferring file: Server
returned HTTP response code: 500 for URL: https://repository.apache.org/content/repositories/snapshots/org/apache/myfaces/trinidadbuild/maven-faces-plugin/2.0.5-SNAPSHOT/maven-metadata.xml
	at org.apache.maven.wagon.providers.http.LightweightHttpWagon.fillInputData(LightweightHttpWagon.java:143)
	at org.apache.maven.wagon.StreamWagon.getInputStream(StreamWagon.java:116)
	at org.apache.maven.wagon.StreamWagon.getIfNewer(StreamWagon.java:88)
	at org.apache.maven.wagon.StreamWagon.get(StreamWagon.java:61)
	at org.apache.maven.repository.legacy.DefaultWagonManager.getRemoteFile(DefaultWagonManager.java:351)
	at org.apache.maven.repository.legacy.DefaultWagonManager.getArtifactMetadataFromDeploymentRepository(DefaultWagonManager.java:215)
	at org.apache.maven.artifact.repository.metadata.DefaultRepositoryMetadataManager.getArtifactMetadataFromDeploymentRepository(DefaultRepositoryMetadataManager.java:424)
	at org.apache.maven.artifact.repository.metadata.DefaultRepositoryMetadataManager.resolveAlways(DefaultRepositoryMetadataManager.java:396)
	... 15 more
Caused by: java.io.IOException: Server returned HTTP response code: 500 for URL: https://repository.apache.org/content/repositories/snapshots/org/apache/myfaces/trinidadbuild/maven-faces-plugin/2.0.5-SNAPSHOT/maven-metadata.xml
	at sun.reflect.NativeConstructorAccessorImpl.newInstance0(Native Method)
	at sun.reflect.NativeConstructorAccessorImpl.newInstance(NativeConstructorAccessorImpl.java:39)
	at sun.reflect.DelegatingConstructorAccessorImpl.newInstance(DelegatingConstructorAccessorImpl.java:27)
	at java.lang.reflect.Constructor.newInstance(Constructor.java:513)
	at sun.net.www.protocol.http.HttpURLConnection$6.run(HttpURLConnection.java:1491)
	at java.security.AccessController.doPrivileged(Native Method)
	at sun.net.www.protocol.http.HttpURLConnection.getChainedException(HttpURLConnection.java:1485)
	at sun.net.www.protocol.http.HttpURLConnection.getInputStream(HttpURLConnection.java:1139)
	at sun.net.www.protocol.https.HttpsURLConnectionImpl.getInputStream(HttpsURLConnectionImpl.java:234)
	at org.apache.maven.wagon.providers.http.LightweightHttpWagon.fillInputData(LightweightHttpWagon.java:122)
	... 22 more
Caused by: java.io.IOException: Server returned HTTP response code: 500 for URL: https://repository.apache.org/content/repositories/snapshots/org/apache/myfaces/trinidadbuild/maven-faces-plugin/2.0.5-SNAPSHOT/maven-metadata.xml
	at sun.net.www.protocol.http.HttpURLConnection.getInputStream(HttpURLConnection.java:1436)
	at java.net.HttpURLConnection.getResponseCode(HttpURLConnection.java:379)
	at sun.net.www.protocol.https.HttpsURLConnectionImpl.getResponseCode(HttpsURLConnectionImpl.java:318)
	at org.apache.maven.wagon.providers.http.LightweightHttpWagon.fillInputData(LightweightHttpWagon.java:115)
	... 22 more


Mime
View raw message