myfaces-commits mailing list archives

Site index · List index
Message view « Date » · « Thread »
Top « Date » · « Thread »
From Apache Jenkins Server <hud...@hudson.apache.org>
Subject Build failed in Jenkins: myfaces-trinidad-core-2 #278
Date Thu, 12 May 2011 00:17:42 GMT
See <https://builds.apache.org/hudson/job/myfaces-trinidad-core-2/278/>

------------------------------------------
[...truncated 10869 lines...]
[INFO] META-INF/adf/jsLibs/resources/LocaleElements_de.js already added, skipping
[INFO] META-INF/adf/jsLibs/resources/LocaleElements_ar_MA.js already added, skipping
[INFO] META-INF/adf/jsLibs/resources/LocaleElements_ja_JP.js already added, skipping
[INFO] META-INF/adf/jsLibs/resources/LocaleElements_en.js already added, skipping
[INFO] META-INF/adf/jsLibs/resources/LocaleElements_ga.js already added, skipping
[INFO] META-INF/adf/jsLibs/resources/LocaleElements_ar_QA.js already added, skipping
[INFO] META-INF/adf/jsLibs/resources/LocaleElements_ga_IE.js already added, skipping
[INFO] META-INF/adf/jsLibs/resources/LocaleElements_be_BY.js already added, skipping
[INFO] META-INF/adf/jsLibs/resources/LocaleElements_cs_CZ.js already added, skipping
[INFO] META-INF/adf/jsLibs/resources/LocaleElements_es_MX.js already added, skipping
[INFO] META-INF/adf/jsLibs/Page.js already added, skipping
[INFO] META-INF/adf/jsLibs/NumberFormat.js already added, skipping
[INFO] META-INF/adf/jsLibs/ApacheChart.js already added, skipping
[INFO] META-INF/adf/jsLibs/MessageBox.js already added, skipping
[INFO] META-INF/adf/jsLibs/PPR.js already added, skipping
[INFO] META-INF/adf/jsLibs/Core.js already added, skipping
[INFO] META-INF/adf/jsLibs/xhr/IFrameXMLRequestEvent.js already added, skipping
[INFO] META-INF/adf/jsLibs/xhr/RequestQueue.js already added, skipping
[INFO] META-INF/adf/jsLibs/xhr/XMLRequestEvent.js already added, skipping
[INFO] META-INF/adf/jsLibs/xhr/XMLRequest.js already added, skipping
[INFO] META-INF/adf/jsLibs/Locale.js already added, skipping
[INFO] META-INF/adf/jsLibs/Shuttle.js already added, skipping
[INFO] META-INF/adf/jsLibs/ColorField.js already added, skipping
[INFO] META-INF/adf/jsLibs/NumberConverter.js already added, skipping
[INFO] META-INF/adf/jsLibs/DateFieldFormat.js already added, skipping
[INFO] META-INF/adf/jsLibs/CharSets.js already added, skipping
[INFO] META-INF/adf/jsLibs/ColorFieldFormat.js already added, skipping
[WARNING] Artifact org.apache.myfaces.trinidad:trinidad-impl:java-source:sources:2.0.1-SNAPSHOT
already attached to project, ignoring duplicate
[INFO] 
[INFO] --- maven-jar-plugin:2.3.1:test-jar (default) @ trinidad-impl ---
[INFO] Building jar: <https://builds.apache.org/hudson/job/myfaces-trinidad-core-2/ws/trinidad-impl/target/trinidad-impl-2.0.1-SNAPSHOT-tests.jar>
[WARNING] Artifact org.apache.myfaces.trinidad:trinidad-impl:test-jar:tests:2.0.1-SNAPSHOT
already attached to project, ignoring duplicate
[INFO] Installing <https://builds.apache.org/hudson/job/myfaces-trinidad-core-2/ws/trinidad-impl/target/trinidad-impl-2.0.1-SNAPSHOT.jar>
to /home/hudson/.m2/repository/org/apache/myfaces/trinidad/trinidad-impl/2.0.1-SNAPSHOT/trinidad-impl-2.0.1-SNAPSHOT.jar
[INFO] [INFO] Installing <https://builds.apache.org/hudson/job/myfaces-trinidad-core-2/ws/trinidad-impl/pom.xml>
to /home/hudson/.m2/repository/org/apache/myfaces/trinidad/trinidad-impl/2.0.1-SNAPSHOT/trinidad-impl-2.0.1-SNAPSHOT.pom
[INFO] Installing <https://builds.apache.org/hudson/job/myfaces-trinidad-core-2/ws/trinidad-impl/target/trinidad-impl-2.0.1-SNAPSHOT-sources.jar>
to /home/hudson/.m2/repository/org/apache/myfaces/trinidad/trinidad-impl/2.0.1-SNAPSHOT/trinidad-impl-2.0.1-SNAPSHOT-sources.jar
[INFO] Installing <https://builds.apache.org/hudson/job/myfaces-trinidad-core-2/ws/trinidad-impl/target/trinidad-impl-2.0.1-SNAPSHOT-tests.jar>
to /home/hudson/.m2/repository/org/apache/myfaces/trinidad/trinidad-impl/2.0.1-SNAPSHOT/trinidad-impl-2.0.1-SNAPSHOT-tests.jar

[INFO] --- maven-install-plugin:2.3:install (default-install) @ trinidad-impl ---
[INFO] Downloading: https://repository.apache.org/content/repositories/snapshots/org/apache/myfaces/trinidad/trinidad-impl/2.0.1-SNAPSHOT/maven-metadata.xml

[INFO] --- maven-deploy-plugin:2.5:deploy (default-deploy) @ trinidad-impl ---
Downloaded: https://repository.apache.org/content/repositories/snapshots/org/apache/myfaces/trinidad/trinidad-impl/2.0.1-SNAPSHOT/maven-metadata.xml
(2 KB at 4.8 KB/sec)
Uploading: https://repository.apache.org/content/repositories/snapshots/org/apache/myfaces/trinidad/trinidad-impl/2.0.1-SNAPSHOT/trinidad-impl-2.0.1-20110512.001616-24.jar
Uploaded: https://repository.apache.org/content/repositories/snapshots/org/apache/myfaces/trinidad/trinidad-impl/2.0.1-SNAPSHOT/trinidad-impl-2.0.1-20110512.001616-24.jar
(4845 KB at 3957.9 KB/sec)
Uploading: https://repository.apache.org/content/repositories/snapshots/org/apache/myfaces/trinidad/trinidad-impl/2.0.1-SNAPSHOT/trinidad-impl-2.0.1-20110512.001616-24.pom
Uploaded: https://repository.apache.org/content/repositories/snapshots/org/apache/myfaces/trinidad/trinidad-impl/2.0.1-SNAPSHOT/trinidad-impl-2.0.1-20110512.001616-24.pom
(14 KB at 79.8 KB/sec)
Downloading: https://repository.apache.org/content/repositories/snapshots/org/apache/myfaces/trinidad/trinidad-impl/maven-metadata.xml
Downloaded: https://repository.apache.org/content/repositories/snapshots/org/apache/myfaces/trinidad/trinidad-impl/maven-metadata.xml
(533 B at 5.3 KB/sec)
Uploading: https://repository.apache.org/content/repositories/snapshots/org/apache/myfaces/trinidad/trinidad-impl/2.0.1-SNAPSHOT/maven-metadata.xml
Uploaded: https://repository.apache.org/content/repositories/snapshots/org/apache/myfaces/trinidad/trinidad-impl/2.0.1-SNAPSHOT/maven-metadata.xml
(2 KB at 7.9 KB/sec)
Uploading: https://repository.apache.org/content/repositories/snapshots/org/apache/myfaces/trinidad/trinidad-impl/maven-metadata.xml
Uploaded: https://repository.apache.org/content/repositories/snapshots/org/apache/myfaces/trinidad/trinidad-impl/maven-metadata.xml
(533 B at 3.4 KB/sec)
Uploading: https://repository.apache.org/content/repositories/snapshots/org/apache/myfaces/trinidad/trinidad-impl/2.0.1-SNAPSHOT/trinidad-impl-2.0.1-20110512.001616-24-sources.jar
Uploaded: https://repository.apache.org/content/repositories/snapshots/org/apache/myfaces/trinidad/trinidad-impl/2.0.1-SNAPSHOT/trinidad-impl-2.0.1-20110512.001616-24-sources.jar
(4366 KB at 5017.6 KB/sec)
Uploading: https://repository.apache.org/content/repositories/snapshots/org/apache/myfaces/trinidad/trinidad-impl/2.0.1-SNAPSHOT/maven-metadata.xml
Uploaded: https://repository.apache.org/content/repositories/snapshots/org/apache/myfaces/trinidad/trinidad-impl/2.0.1-SNAPSHOT/maven-metadata.xml
(2 KB at 7.6 KB/sec)
Uploading: https://repository.apache.org/content/repositories/snapshots/org/apache/myfaces/trinidad/trinidad-impl/2.0.1-SNAPSHOT/trinidad-impl-2.0.1-20110512.001616-24-tests.jar
Uploaded: https://repository.apache.org/content/repositories/snapshots/org/apache/myfaces/trinidad/trinidad-impl/2.0.1-SNAPSHOT/trinidad-impl-2.0.1-20110512.001616-24-tests.jar
(1508 KB at 4528.1 KB/sec)
Uploading: https://repository.apache.org/content/repositories/snapshots/org/apache/myfaces/trinidad/trinidad-impl/2.0.1-SNAPSHOT/maven-metadata.xml
Uploaded: https://repository.apache.org/content/repositories/snapshots/org/apache/myfaces/trinidad/trinidad-impl/2.0.1-SNAPSHOT/maven-metadata.xml
(2 KB at 8.0 KB/sec)
projectSucceeded org.apache.myfaces.trinidad:trinidad-impl:2.0.1-SNAPSHOT
[JENKINS] Archiving <https://builds.apache.org/hudson/job/myfaces-trinidad-core-2/ws/trinidad-impl/target/trinidad-impl-2.0.1-SNAPSHOT.jar>
to /home/hudson/hudson/jobs/myfaces-trinidad-core-2/modules/org.apache.myfaces.trinidad$trinidad-impl/builds/2011-05-12_00-09-36/archive/org.apache.myfaces.trinidad/trinidad-impl/2.0.1-20110512.001616-24/trinidad-impl-2.0.1-20110512.001616-24.jar
[JENKINS] Archiving <https://builds.apache.org/hudson/job/myfaces-trinidad-core-2/ws/trinidad-impl/target/trinidad-impl-2.0.1-SNAPSHOT-sources.jar>
to /home/hudson/hudson/jobs/myfaces-trinidad-core-2/modules/org.apache.myfaces.trinidad$trinidad-impl/builds/2011-05-12_00-09-36/archive/org.apache.myfaces.trinidad/trinidad-impl/2.0.1-20110512.001616-24/trinidad-impl-2.0.1-20110512.001616-24-sources.jar
[JENKINS] Archiving <https://builds.apache.org/hudson/job/myfaces-trinidad-core-2/ws/trinidad-impl/target/trinidad-impl-2.0.1-SNAPSHOT-tests.jar>
to /home/hudson/hudson/jobs/myfaces-trinidad-core-2/modules/org.apache.myfaces.trinidad$trinidad-impl/builds/2011-05-12_00-09-36/archive/org.apache.myfaces.trinidad/trinidad-impl/2.0.1-20110512.001616-24/trinidad-impl-2.0.1-20110512.001616-24-tests.jar
[INFO]                                                                         
[INFO] ------------------------------------------------------------------------
[INFO] Building Apache MyFaces Trinidad Examples 2.0.1-SNAPSHOT
[INFO] ------------------------------------------------------------------------
[INFO] Deleting <https://builds.apache.org/hudson/job/myfaces-trinidad-core-2/ws/trinidad-examples/target>
[INFO] 
[INFO] --- maven-clean-plugin:2.4.1:clean (default-clean) @ trinidad-example ---
[INFO] 
[INFO] --- maven-enforcer-plugin:1.0-beta-1:enforce (enforce-versions) @ trinidad-example
---
[INFO] 
[INFO] --- maven-xrts-plugin:2.0.5:generate-sources (default) @ trinidad-example ---
[INFO] 
[INFO] --- maven-remote-resources-plugin:1.0-alpha-6:process (default) @ trinidad-example
---
[INFO] 
[INFO] --- maven-xrts-plugin:2.0.5:generate-test-sources (default) @ trinidad-example ---
mojo forkStarted org.apache.maven.plugins:maven-source-plugin:2.1.2(attach-source)
forkedProjectStarted org.apache.myfaces.trinidad:trinidad-example2.0.1-SNAPSHOT
[INFO] 
[INFO] --- maven-enforcer-plugin:1.0-beta-1:enforce (enforce-versions) @ trinidad-example
---
[INFO] 
[INFO] --- maven-xrts-plugin:2.0.5:generate-sources (default) @ trinidad-example ---
forkedProjectSucceeded org.apache.myfaces.trinidad:trinidad-example2.0.1-SNAPSHOT
[JENKINS] Archiving <https://builds.apache.org/hudson/job/myfaces-trinidad-core-2/ws/trinidad-examples/pom.xml>
to /home/hudson/hudson/jobs/myfaces-trinidad-core-2/modules/org.apache.myfaces.trinidad$trinidad-example/builds/2011-05-12_00-09-36/archive/org.apache.myfaces.trinidad/trinidad-example/2.0.1-SNAPSHOT/trinidad-example-2.0.1-SNAPSHOT.pom
mojo forkSucceeded org.apache.maven.plugins:maven-source-plugin:2.1.2(attach-source)
ignoring exception during new ExecutedMojo null
[INFO] 
[INFO] --- maven-source-plugin:2.1.2:jar (attach-source) @ trinidad-example ---
[INFO] Installing <https://builds.apache.org/hudson/job/myfaces-trinidad-core-2/ws/trinidad-examples/pom.xml>
to /home/hudson/.m2/repository/org/apache/myfaces/trinidad/trinidad-example/2.0.1-SNAPSHOT/trinidad-example-2.0.1-SNAPSHOT.pom
[INFO] 
[INFO] --- maven-install-plugin:2.3:install (default-install) @ trinidad-example ---
[INFO] 
[INFO] --- maven-enforcer-plugin:1.0-beta-1:enforce (enforce-versions) @ trinidad-example
---
[INFO] 
[INFO] --- maven-xrts-plugin:2.0.5:generate-sources (default) @ trinidad-example ---
[INFO] 
[INFO] --- maven-remote-resources-plugin:1.0-alpha-6:process (default) @ trinidad-example
---
[INFO] 
[INFO] --- maven-xrts-plugin:2.0.5:generate-test-sources (default) @ trinidad-example ---
mojo forkStarted org.apache.maven.plugins:maven-source-plugin:2.1.2(attach-source)
forkedProjectStarted org.apache.myfaces.trinidad:trinidad-example2.0.1-SNAPSHOT
[INFO] 
[INFO] --- maven-enforcer-plugin:1.0-beta-1:enforce (enforce-versions) @ trinidad-example
---
[INFO] 
[INFO] --- maven-xrts-plugin:2.0.5:generate-sources (default) @ trinidad-example ---
forkedProjectSucceeded org.apache.myfaces.trinidad:trinidad-example2.0.1-SNAPSHOT
mojo forkSucceeded org.apache.maven.plugins:maven-source-plugin:2.1.2(attach-source)
ignoring exception during new ExecutedMojo null
[INFO] 
[INFO] --- maven-source-plugin:2.1.2:jar (attach-source) @ trinidad-example ---
[INFO] [INFO] Installing <https://builds.apache.org/hudson/job/myfaces-trinidad-core-2/ws/trinidad-examples/pom.xml>
to /home/hudson/.m2/repository/org/apache/myfaces/trinidad/trinidad-example/2.0.1-SNAPSHOT/trinidad-example-2.0.1-SNAPSHOT.pom

[INFO] --- maven-install-plugin:2.3:install (default-install) @ trinidad-example ---
[INFO] Downloading: https://repository.apache.org/content/repositories/snapshots/org/apache/myfaces/trinidad/trinidad-example/2.0.1-SNAPSHOT/maven-metadata.xml

[INFO] --- maven-deploy-plugin:2.5:deploy (default-deploy) @ trinidad-example ---
Downloaded: https://repository.apache.org/content/repositories/snapshots/org/apache/myfaces/trinidad/trinidad-example/2.0.1-SNAPSHOT/maven-metadata.xml
(622 B at 2.3 KB/sec)
Uploading: https://repository.apache.org/content/repositories/snapshots/org/apache/myfaces/trinidad/trinidad-example/2.0.1-SNAPSHOT/trinidad-example-2.0.1-20110512.001721-40.pom
Uploaded: https://repository.apache.org/content/repositories/snapshots/org/apache/myfaces/trinidad/trinidad-example/2.0.1-SNAPSHOT/trinidad-example-2.0.1-20110512.001721-40.pom
(6 KB at 13.8 KB/sec)
Downloading: https://repository.apache.org/content/repositories/snapshots/org/apache/myfaces/trinidad/trinidad-example/maven-metadata.xml
Downloaded: https://repository.apache.org/content/repositories/snapshots/org/apache/myfaces/trinidad/trinidad-example/maven-metadata.xml
(7 KB at 14.0 KB/sec)
Uploading: https://repository.apache.org/content/repositories/snapshots/org/apache/myfaces/trinidad/trinidad-example/2.0.1-SNAPSHOT/maven-metadata.xml
Uploaded: https://repository.apache.org/content/repositories/snapshots/org/apache/myfaces/trinidad/trinidad-example/2.0.1-SNAPSHOT/maven-metadata.xml
(622 B at 3.2 KB/sec)
Uploading: https://repository.apache.org/content/repositories/snapshots/org/apache/myfaces/trinidad/trinidad-example/maven-metadata.xml
Uploaded: https://repository.apache.org/content/repositories/snapshots/org/apache/myfaces/trinidad/trinidad-example/maven-metadata.xml
(7 KB at 45.8 KB/sec)
projectSucceeded org.apache.myfaces.trinidad:trinidad-example:2.0.1-SNAPSHOT
[INFO]                                                                         
[INFO] ------------------------------------------------------------------------
[INFO] Building Apache MyFaces Trinidad Blank Demo 2.0.1-SNAPSHOT
[INFO] ------------------------------------------------------------------------
[INFO] Deleting <https://builds.apache.org/hudson/job/myfaces-trinidad-core-2/ws/trinidad-examples/trinidad-blank/target>
[INFO] 
[INFO] --- maven-clean-plugin:2.4.1:clean (default-clean) @ trinidad-blank ---
[INFO] 
[INFO] --- maven-enforcer-plugin:1.0-beta-1:enforce (enforce-versions) @ trinidad-blank ---
[INFO] 
[INFO] --- maven-xrts-plugin:2.0.5:generate-sources (default) @ trinidad-blank ---
[INFO] 
[INFO] --- maven-remote-resources-plugin:1.0-alpha-6:process (default) @ trinidad-blank ---
[INFO] [INFO] Using 'UTF-8' encoding to copy filtered resources.
[INFO] skip non existing resourceDirectory <https://builds.apache.org/hudson/job/myfaces-trinidad-core-2/ws/trinidad-examples/trinidad-blank/src/main/resources>
[INFO] Copying 2 resources

[INFO] --- maven-resources-plugin:2.4.3:resources (default-resources) @ trinidad-blank ---
[INFO] 
[INFO] --- maven-compiler-plugin:2.3.1:compile (default-compile) @ trinidad-blank ---
[INFO] Compiling 1 source file to <https://builds.apache.org/hudson/job/myfaces-trinidad-core-2/ws/trinidad-examples/trinidad-blank/target/classes>
mojoFailed org.apache.maven.plugins:maven-compiler-plugin:2.3.1(default-compile)
projectFailed org.apache.myfaces.trinidad:trinidad-blank:2.0.1-SNAPSHOT
sessionEnded
[INFO] ------------------------------------------------------------------------
[INFO] Reactor Summary:
[INFO] 
[INFO] Apache MyFaces Trinidad 2.0 ....................... SUCCESS [14.912s]
[INFO] Apache MyFaces Trinidad Build ..................... SUCCESS [23.081s]
[INFO] Apache MyFaces Trinidad API ....................... SUCCESS [1:58.765s]
[INFO] Apache MyFaces Trinidad Impl ...................... SUCCESS [3:35.206s]
[INFO] Apache MyFaces Trinidad Examples .................. SUCCESS [14.832s]
[INFO] Apache MyFaces Trinidad Blank Demo ................ FAILURE [16.815s]
[INFO] Apache MyFaces Trinidad Demo ...................... SKIPPED
[INFO] Apache MyFaces Trinidad Components Showcase ....... SKIPPED
[INFO] ------------------------------------------------------------------------
[INFO] BUILD FAILURE
[INFO] ------------------------------------------------------------------------
[INFO] Total time: 7:54.543s
[INFO] Finished at: Thu May 12 00:17:41 UTC 2011
[INFO] Final Memory: 71M/951M
[INFO] ------------------------------------------------------------------------
mavenExecutionResult exceptions not empty
org.apache.maven.InternalErrorException: Internal error: java.lang.reflect.UndeclaredThrowableException
	at org.apache.maven.lifecycle.internal.BuilderCommon.handleBuildError(BuilderCommon.java:128)
	at org.apache.maven.lifecycle.internal.LifecycleModuleBuilder.buildProject(LifecycleModuleBuilder.java:95)
	at org.apache.maven.lifecycle.internal.LifecycleModuleBuilder.buildProject(LifecycleModuleBuilder.java:59)
	at org.apache.maven.lifecycle.internal.LifecycleStarter.singleThreadedBuild(LifecycleStarter.java:183)
	at org.apache.maven.lifecycle.internal.LifecycleStarter.execute(LifecycleStarter.java:161)
	at org.apache.maven.DefaultMaven.doExecute(DefaultMaven.java:319)
	at org.apache.maven.DefaultMaven.execute(DefaultMaven.java:156)
	at org.jvnet.hudson.maven3.launcher.Maven3Launcher.main(Maven3Launcher.java:79)
	at sun.reflect.NativeMethodAccessorImpl.invoke0(Native Method)
	at sun.reflect.NativeMethodAccessorImpl.invoke(NativeMethodAccessorImpl.java:39)
	at sun.reflect.DelegatingMethodAccessorImpl.invoke(DelegatingMethodAccessorImpl.java:25)
	at java.lang.reflect.Method.invoke(Method.java:597)
	at org.codehaus.plexus.classworlds.launcher.Launcher.launchStandard(Launcher.java:329)
	at org.codehaus.plexus.classworlds.launcher.Launcher.launch(Launcher.java:239)
	at org.jvnet.hudson.maven3.agent.Maven3Main.launch(Maven3Main.java:158)
	at hudson.maven.Maven3Builder.call(Maven3Builder.java:127)
	at hudson.maven.Maven3Builder.call(Maven3Builder.java:74)
	at hudson.remoting.UserRequest.perform(UserRequest.java:118)
	at hudson.remoting.UserRequest.perform(UserRequest.java:48)
	at hudson.remoting.Request$2.run(Request.java:270)
	at java.util.concurrent.Executors$RunnableAdapter.call(Executors.java:441)
	at java.util.concurrent.FutureTask$Sync.innerRun(FutureTask.java:303)
	at java.util.concurrent.FutureTask.run(FutureTask.java:138)
	at java.util.concurrent.ThreadPoolExecutor$Worker.runTask(ThreadPoolExecutor.java:886)
	at java.util.concurrent.ThreadPoolExecutor$Worker.run(ThreadPoolExecutor.java:908)
	at java.lang.Thread.run(Thread.java:619)
Caused by: java.lang.reflect.UndeclaredThrowableException
	at $Proxy2.setExecutedMojos(Unknown Source)
	at hudson.maven.MavenBuildProxy$Filter.setExecutedMojos(MavenBuildProxy.java:240)
	at hudson.maven.MavenBuildProxy$Filter.setExecutedMojos(MavenBuildProxy.java:240)
	at hudson.maven.Maven3Builder$MavenExecutionListener.reccordMojoFailed(Maven3Builder.java:643)
	at hudson.maven.Maven3Builder$MavenExecutionListener.mojoFailed(Maven3Builder.java:612)
	at org.apache.maven.lifecycle.internal.DefaultExecutionEventCatapult.fire(DefaultExecutionEventCatapult.java:90)
	at org.apache.maven.lifecycle.internal.MojoExecutor.execute(MojoExecutor.java:232)
	at org.apache.maven.lifecycle.internal.MojoExecutor.execute(MojoExecutor.java:153)
	at org.apache.maven.lifecycle.internal.MojoExecutor.execute(MojoExecutor.java:145)
	at org.apache.maven.lifecycle.internal.LifecycleModuleBuilder.buildProject(LifecycleModuleBuilder.java:84)
	... 24 more
Caused by: java.io.IOException: Remote call on channel failed
	at hudson.remoting.Channel.call(Channel.java:652)
	at hudson.remoting.RemoteInvocationHandler.invoke(RemoteInvocationHandler.java:158)
	... 34 more
Caused by: java.lang.OutOfMemoryError: PermGen space
	at sun.misc.Unsafe.defineClass(Native Method)
	at sun.reflect.ClassDefiner.defineClass(ClassDefiner.java:45)
	at sun.reflect.MethodAccessorGenerator$1.run(MethodAccessorGenerator.java:381)
	at java.security.AccessController.doPrivileged(Native Method)
	at sun.reflect.MethodAccessorGenerator.generate(MethodAccessorGenerator.java:377)
	at sun.reflect.MethodAccessorGenerator.generateSerializationConstructor(MethodAccessorGenerator.java:95)
	at sun.reflect.ReflectionFactory.newConstructorForSerialization(ReflectionFactory.java:313)
	at java.io.ObjectStreamClass.getSerializableConstructor(ObjectStreamClass.java:1327)
	at java.io.ObjectStreamClass.access$1500(ObjectStreamClass.java:52)
	at java.io.ObjectStreamClass$2.run(ObjectStreamClass.java:437)
	at java.security.AccessController.doPrivileged(Native Method)
	at java.io.ObjectStreamClass.<init>(ObjectStreamClass.java:413)
	at java.io.ObjectStreamClass.lookup(ObjectStreamClass.java:310)
	at java.io.ObjectOutputStream.writeObject0(ObjectOutputStream.java:1106)
	at java.io.ObjectOutputStream.writeObject(ObjectOutputStream.java:326)
	at hudson.remoting.UserRequest._serialize(UserRequest.java:155)
	at hudson.remoting.UserRequest.serialize(UserRequest.java:164)
	at hudson.remoting.UserRequest.<init>(UserRequest.java:62)
	at hudson.remoting.Channel.call(Channel.java:642)
	at hudson.remoting.RemoteInvocationHandler.invoke(RemoteInvocationHandler.java:158)
	at $Proxy2.setExecutedMojos(Unknown Source)
	at hudson.maven.MavenBuildProxy$Filter.setExecutedMojos(MavenBuildProxy.java:240)
	at hudson.maven.MavenBuildProxy$Filter.setExecutedMojos(MavenBuildProxy.java:240)
	at hudson.maven.Maven3Builder$MavenExecutionListener.reccordMojoFailed(Maven3Builder.java:643)
	at hudson.maven.Maven3Builder$MavenExecutionListener.mojoFailed(Maven3Builder.java:612)
	at org.apache.maven.lifecycle.internal.DefaultExecutionEventCatapult.fire(DefaultExecutionEventCatapult.java:90)
	at org.apache.maven.lifecycle.internal.MojoExecutor.execute(MojoExecutor.java:232)
	at org.apache.maven.lifecycle.internal.MojoExecutor.execute(MojoExecutor.java:153)
	at org.apache.maven.lifecycle.internal.MojoExecutor.execute(MojoExecutor.java:145)
	at org.apache.maven.lifecycle.internal.LifecycleModuleBuilder.buildProject(LifecycleModuleBuilder.java:84)
	at org.apache.maven.lifecycle.internal.LifecycleModuleBuilder.buildProject(LifecycleModuleBuilder.java:59)
	at org.apache.maven.lifecycle.internal.LifecycleStarter.singleThreadedBuild(LifecycleStarter.java:183)
channel stopped


Mime
View raw message