myfaces-commits mailing list archives

Site index · List index
Message view « Date » · « Thread »
Top « Date » · « Thread »
From Apache Jenkins Server <jenk...@builds.apache.org>
Subject Build failed in Jenkins: tobago-trunk-deploy » Tobago Example Demo #115
Date Fri, 10 Jun 2011 00:52:21 GMT
See <https://builds.apache.org/job/tobago-trunk-deploy/org.apache.myfaces.tobago$tobago-example-demo/115/changes>

Changes:

[lofwyr] Demo: splitting tab page into different pages.

[lofwyr] refactor the demo

[lofwyr] refactor the demo

[lofwyr] Restructuring the demo:
 - Using own directory for each navigation node, because some of them needs more than one
file

------------------------------------------
[INFO] ------------------------------------------------------------------------
[INFO] Building Tobago Example Demo
[INFO]    task-segment: [clean, animal-sniffer:check, deploy]
[INFO] ------------------------------------------------------------------------
[INFO] [clean:clean {execution: default-clean}]
[INFO] [animal-sniffer:check {execution: default-cli}]
[INFO] Checking unresolved references to org.codehaus.mojo.signature:java15:1.0
[INFO] [enforcer:enforce {execution: enforce}]
[INFO] [buildnumber:create {execution: default}]
[INFO] [remote-resources:process {execution: default}]
[INFO] [xml:transform {execution: default}]
[INFO] Transforming file: <https://builds.apache.org/job/tobago-trunk-deploy/org.apache.myfaces.tobago$tobago-example-demo/ws/src/main/webapp/reference/popup.xhtml>
[INFO] Transforming file: <https://builds.apache.org/job/tobago-trunk-deploy/org.apache.myfaces.tobago$tobago-example-demo/ws/src/main/webapp/reference/tree/tree-normal.xhtml>
[INFO] Transforming file: <https://builds.apache.org/job/tobago-trunk-deploy/org.apache.myfaces.tobago$tobago-example-demo/ws/src/main/webapp/reference/tree/tree-menu.xhtml>
[INFO] Transforming file: <https://builds.apache.org/job/tobago-trunk-deploy/org.apache.myfaces.tobago$tobago-example-demo/ws/src/main/webapp/reference/tree/tree-select.xhtml>
[INFO] Transforming file: <https://builds.apache.org/job/tobago-trunk-deploy/org.apache.myfaces.tobago$tobago-example-demo/ws/src/main/webapp/reference/tree/tree-simple.xhtml>
[INFO] Transforming file: <https://builds.apache.org/job/tobago-trunk-deploy/org.apache.myfaces.tobago$tobago-example-demo/ws/src/main/webapp/reference/tree/tree-listbox.xhtml>
[INFO] Transforming file: <https://builds.apache.org/job/tobago-trunk-deploy/org.apache.myfaces.tobago$tobago-example-demo/ws/src/main/webapp/reference/select.xhtml>
[INFO] Transforming file: <https://builds.apache.org/job/tobago-trunk-deploy/org.apache.myfaces.tobago$tobago-example-demo/ws/src/main/webapp/reference/upload.xhtml>
[INFO] Transforming file: <https://builds.apache.org/job/tobago-trunk-deploy/org.apache.myfaces.tobago$tobago-example-demo/ws/src/main/webapp/init.xhtml>
[INFO] Transformed 9 file(s).
[INFO] [resources:resources {execution: default-resources}]
[INFO] Using 'UTF-8' encoding to copy filtered resources.
[INFO] Copying 1 resource
[INFO] Copying 3 resources
[INFO] [build-helper:add-source {execution: default}]
[INFO] Source directory: <https://builds.apache.org/job/tobago-trunk-deploy/org.apache.myfaces.tobago$tobago-example-demo/ws/src/main/java-jsf-1.2>
added.
[INFO] [theme:resources {execution: default}]
[INFO] Expanding: /home/hudson/hudson-slave/workspace/tobago-trunk-deploy/trunk-deploy/tobago-theme/tobago-theme-charlotteville/target/tobago-theme-charlotteville-1.5.0-alpha-3-SNAPSHOT.jar
into <https://builds.apache.org/job/tobago-trunk-deploy/org.apache.myfaces.tobago$tobago-example-demo/ws/target/theme/work/tobago-theme-charlotteville-1.5.0-alpha-3-SNAPSHOT>
[INFO] Expanding: /home/hudson/hudson-slave/workspace/tobago-trunk-deploy/trunk-deploy/tobago-theme/tobago-theme-scarborough/target/tobago-theme-scarborough-1.5.0-alpha-3-SNAPSHOT.jar
into <https://builds.apache.org/job/tobago-trunk-deploy/org.apache.myfaces.tobago$tobago-example-demo/ws/target/theme/work/tobago-theme-scarborough-1.5.0-alpha-3-SNAPSHOT>
[INFO] Expanding: /home/hudson/hudson-slave/workspace/tobago-trunk-deploy/trunk-deploy/tobago-theme/tobago-theme-richmond/target/tobago-theme-richmond-1.5.0-alpha-3-SNAPSHOT.jar
into <https://builds.apache.org/job/tobago-trunk-deploy/org.apache.myfaces.tobago$tobago-example-demo/ws/target/theme/work/tobago-theme-richmond-1.5.0-alpha-3-SNAPSHOT>
[INFO] [compiler:compile {execution: default-compile}]
[INFO] Compiling 40 source files to <https://builds.apache.org/job/tobago-trunk-deploy/org.apache.myfaces.tobago$tobago-example-demo/ws/target/classes>
[INFO] [resources:testResources {execution: default-testResources}]
[INFO] Using 'UTF-8' encoding to copy filtered resources.
[INFO] skip non existing resourceDirectory <https://builds.apache.org/job/tobago-trunk-deploy/org.apache.myfaces.tobago$tobago-example-demo/ws/src/test/resources>
[INFO] Copying 3 resources
[INFO] [compiler:testCompile {execution: default-testCompile}]
[INFO] Compiling 2 source files to <https://builds.apache.org/job/tobago-trunk-deploy/org.apache.myfaces.tobago$tobago-example-demo/ws/target/test-classes>
[INFO] -------------------------------------------------------------
[ERROR] COMPILATION ERROR : 
[INFO] -------------------------------------------------------------
[ERROR] <https://builds.apache.org/job/tobago-trunk-deploy/org.apache.myfaces.tobago$tobago-example-demo/ws/src/test/java/org/apache/myfaces/tobago/example/demo/NavigationUnitTest.java>:[39,34]
cannot find symbol
symbol  : constructor Navigation(java.util.List<java.lang.String>)
location: class org.apache.myfaces.tobago.example.demo.Navigation
[INFO] 1 error
[INFO] -------------------------------------------------------------
[JENKINS] Archiving <https://builds.apache.org/job/tobago-trunk-deploy/org.apache.myfaces.tobago$tobago-example-demo/ws/pom.xml>
to /home/hudson/hudson/jobs/tobago-trunk-deploy/modules/org.apache.myfaces.tobago$tobago-example-demo/builds/2011-06-10_00-37-16/archive/org.apache.myfaces.tobago/tobago-example-demo/1.5.0-alpha-3-SNAPSHOT/tobago-example-demo-1.5.0-alpha-3-SNAPSHOT.pom
[INFO] ------------------------------------------------------------------------
[ERROR] BUILD FAILURE
[INFO] ------------------------------------------------------------------------
[INFO] Compilation failure
<https://builds.apache.org/job/tobago-trunk-deploy/org.apache.myfaces.tobago$tobago-example-demo/ws/src/test/java/org/apache/myfaces/tobago/example/demo/NavigationUnitTest.java>:[39,34]
cannot find symbol
symbol  : constructor Navigation(java.util.List<java.lang.String>)
location: class org.apache.myfaces.tobago.example.demo.Navigation

[INFO] ------------------------------------------------------------------------
[INFO] For more information, run Maven with the -e switch
[INFO] ------------------------------------------------------------------------
[INFO] Total time: 14 minutes 49 seconds
[INFO] Finished at: Thu Jun 09 20:52:20 EDT 2011
[INFO] Final Memory: 116M/536M
[INFO] ------------------------------------------------------------------------


Mime
View raw message