myfaces-commits mailing list archives

Site index · List index
Message view « Date » · « Thread »
Top « Date » · « Thread »
From Apache Jenkins Server <jenk...@builds.apache.org>
Subject Build failed in Jenkins: tobago-trunk-deploy #115
Date Fri, 10 Jun 2011 00:52:27 GMT
See <https://builds.apache.org/job/tobago-trunk-deploy/115/changes>

Changes:

[lofwyr] Demo: splitting tab page into different pages.

[lofwyr] refactor the demo

[lofwyr] refactor the demo

[lofwyr] Restructuring the demo:
 - Using own directory for each navigation node, because some of them needs more than one
file

[lofwyr] TOBAGO-606: Layout Manager
 - Do not log a warning, if rendering is false

------------------------------------------
[...truncated 27562 lines...]
[INFO] [dependency:unpack {execution: unpack}]
[INFO] Configured Artifact: org.tango-project:tango-icon-theme:0.8.0:jar
[INFO] Unpacking /export/home/hudson/.m2/repository/org/tango-project/tango-icon-theme/0.8.0/tango-icon-theme-0.8.0.jar
to <https://builds.apache.org/job/tobago-trunk-deploy/ws/trunk-deploy/tobago-example/tobago-example-addressbook/target/tobago-example-addressbook/image>
with includes  and excludes 
[INFO] [install:install {execution: default-install}]
[INFO] Installing <https://builds.apache.org/job/tobago-trunk-deploy/ws/trunk-deploy/tobago-example/tobago-example-addressbook/target/tobago-example-addressbook.war>
to /export/home/hudson/.m2/repository/org/apache/myfaces/tobago/tobago-example-addressbook/1.5.0-alpha-3-SNAPSHOT/tobago-example-addressbook-1.5.0-alpha-3-SNAPSHOT.war
[INFO] Installing <https://builds.apache.org/job/tobago-trunk-deploy/ws/trunk-deploy/tobago-example/tobago-example-addressbook/target/tobago-example-addressbook-javadoc.jar>
to /export/home/hudson/.m2/repository/org/apache/myfaces/tobago/tobago-example-addressbook/1.5.0-alpha-3-SNAPSHOT/tobago-example-addressbook-1.5.0-alpha-3-SNAPSHOT-javadoc.jar
[INFO] Installing <https://builds.apache.org/job/tobago-trunk-deploy/ws/trunk-deploy/tobago-example/tobago-example-addressbook/target/tobago-example-addressbook-sources.jar>
to /export/home/hudson/.m2/repository/org/apache/myfaces/tobago/tobago-example-addressbook/1.5.0-alpha-3-SNAPSHOT/tobago-example-addressbook-1.5.0-alpha-3-SNAPSHOT-sources.jar
[INFO] [deploy:deploy {execution: default-deploy}]
[INFO] Retrieving previous build number from apache.snapshots.https
Uploading: https://repository.apache.org/content/repositories/snapshots/org/apache/myfaces/tobago/tobago-example-addressbook/1.5.0-alpha-3-SNAPSHOT/tobago-example-addressbook-1.5.0-alpha-3-SNAPSHOT.war
14221K uploaded  (tobago-example-addressbook-1.5.0-alpha-3-SNAPSHOT.war)
[INFO] Retrieving previous metadata from apache.snapshots.https
[INFO] Uploading repository metadata for: 'snapshot org.apache.myfaces.tobago:tobago-example-addressbook:1.5.0-alpha-3-SNAPSHOT'
[INFO] Retrieving previous metadata from apache.snapshots.https
[INFO] Uploading repository metadata for: 'artifact org.apache.myfaces.tobago:tobago-example-addressbook'
[INFO] Uploading project information for tobago-example-addressbook 1.5.0-alpha-3-SNAPSHOT
[INFO] Retrieving previous build number from apache.snapshots.https
Uploading: https://repository.apache.org/content/repositories/snapshots/org/apache/myfaces/tobago/tobago-example-addressbook/1.5.0-alpha-3-SNAPSHOT/tobago-example-addressbook-1.5.0-alpha-3-SNAPSHOT-javadoc.jar
209K uploaded  (tobago-example-addressbook-1.5.0-alpha-3-SNAPSHOT-javadoc.jar)
[INFO] Retrieving previous build number from apache.snapshots.https
Uploading: https://repository.apache.org/content/repositories/snapshots/org/apache/myfaces/tobago/tobago-example-addressbook/1.5.0-alpha-3-SNAPSHOT/tobago-example-addressbook-1.5.0-alpha-3-SNAPSHOT-sources.jar
40K uploaded  (tobago-example-addressbook-1.5.0-alpha-3-SNAPSHOT-sources.jar)
[JENKINS] Archiving <https://builds.apache.org/job/tobago-trunk-deploy/ws/trunk-deploy/tobago-example/tobago-example-addressbook/target/tobago-example-addressbook-sources.jar>
to /home/hudson/hudson/jobs/tobago-trunk-deploy/modules/org.apache.myfaces.tobago$tobago-example-addressbook/builds/2011-06-10_00-37-16/archive/org.apache.myfaces.tobago/tobago-example-addressbook/1.5.0-alpha-3-SNAPSHOT/tobago-example-addressbook-1.5.0-alpha-3-SNAPSHOT-sources.jar
[INFO] ------------------------------------------------------------------------
[INFO] Building Tobago Example Blank
[INFO]    task-segment: [clean, animal-sniffer:check, deploy]
[INFO] ------------------------------------------------------------------------
[INFO] [clean:clean {execution: default-clean}]
[INFO] [animal-sniffer:check {execution: default-cli}]
[INFO] Checking unresolved references to org.codehaus.mojo.signature:java15:1.0
[INFO] [enforcer:enforce {execution: enforce}]
[INFO] [buildnumber:create {execution: default}]
[INFO] [remote-resources:process {execution: default}]
[INFO] [resources:resources {execution: default-resources}]
[INFO] Using 'UTF-8' encoding to copy filtered resources.
[INFO] skip non existing resourceDirectory <https://builds.apache.org/job/tobago-trunk-deploy/ws/trunk-deploy/tobago-example/tobago-example-blank/src/main/resources>
[INFO] Copying 3 resources
[INFO] [build-helper:add-source {execution: default}]
[INFO] Source directory: <https://builds.apache.org/job/tobago-trunk-deploy/ws/trunk-deploy/tobago-example/tobago-example-blank/src/main/java-jsf-1.2>
added.
[INFO] [compiler:compile {execution: default-compile}]
[INFO] No sources to compile
[INFO] [resources:testResources {execution: default-testResources}]
[INFO] Using 'UTF-8' encoding to copy filtered resources.
[INFO] skip non existing resourceDirectory <https://builds.apache.org/job/tobago-trunk-deploy/ws/trunk-deploy/tobago-example/tobago-example-blank/src/test/resources>
[INFO] Copying 3 resources
[INFO] [compiler:testCompile {execution: default-testCompile}]
[INFO] No sources to compile
[INFO] [surefire:test {execution: default-test}]
[INFO] Surefire report directory: <https://builds.apache.org/job/tobago-trunk-deploy/ws/trunk-deploy/tobago-example/tobago-example-blank/target/surefire-reports>

-------------------------------------------------------
 T E S T S
-------------------------------------------------------
There are no tests to run.

Results :

Tests run: 0, Failures: 0, Errors: 0, Skipped: 0

[JENKINS] Recording test results
[INFO] [war:war {execution: default-war}]
[INFO] Packaging webapp
[INFO] Assembling webapp[tobago-example-blank] in [<https://builds.apache.org/job/tobago-trunk-deploy/ws/trunk-deploy/tobago-example/tobago-example-blank/target/tobago-example-blank]>
[INFO] Processing war project
[INFO] Copying webapp resources[<https://builds.apache.org/job/tobago-trunk-deploy/ws/trunk-deploy/tobago-example/tobago-example-blank/src/main/webapp]>
[INFO] Webapp assembled in [250 msecs]
[INFO] Building war: <https://builds.apache.org/job/tobago-trunk-deploy/ws/trunk-deploy/tobago-example/tobago-example-blank/target/tobago-example-blank.war>
[INFO] [javadoc:jar {execution: attach-javadoc}]
[INFO] Preparing source:jar
[WARNING] Removing: jar from forked lifecycle, to prevent recursive invocation.
[JENKINS] Archiving <https://builds.apache.org/job/tobago-trunk-deploy/ws/trunk-deploy/tobago-example/tobago-example-blank/pom.xml>
to /home/hudson/hudson/jobs/tobago-trunk-deploy/modules/org.apache.myfaces.tobago$tobago-example-blank/builds/2011-06-10_00-37-16/archive/org.apache.myfaces.tobago/tobago-example-blank/1.5.0-alpha-3-SNAPSHOT/tobago-example-blank-1.5.0-alpha-3-SNAPSHOT.pom
[JENKINS] Archiving <https://builds.apache.org/job/tobago-trunk-deploy/ws/trunk-deploy/tobago-example/tobago-example-blank/target/tobago-example-blank.war>
to /home/hudson/hudson/jobs/tobago-trunk-deploy/modules/org.apache.myfaces.tobago$tobago-example-blank/builds/2011-06-10_00-37-16/archive/org.apache.myfaces.tobago/tobago-example-blank/1.5.0-alpha-3-SNAPSHOT/tobago-example-blank-1.5.0-alpha-3-SNAPSHOT.war
[INFO] [enforcer:enforce {execution: enforce}]
[INFO] [buildnumber:create {execution: default}]
[INFO] [source:jar {execution: attach-source}]
[INFO] META-INF already added, skipping
[INFO] META-INF/LICENSE already added, skipping
[INFO] META-INF/DEPENDENCIES already added, skipping
[INFO] META-INF/NOTICE already added, skipping
[INFO] Building jar: <https://builds.apache.org/job/tobago-trunk-deploy/ws/trunk-deploy/tobago-example/tobago-example-blank/target/tobago-example-blank-sources.jar>
[INFO] META-INF already added, skipping
[INFO] META-INF/LICENSE already added, skipping
[INFO] META-INF/DEPENDENCIES already added, skipping
[INFO] META-INF/NOTICE already added, skipping
[INFO] [assembly:single {execution: source-release-assembly}]
[INFO] Skipping the assembly in this project because it's not the Execution Root
[INFO] [install:install {execution: default-install}]
[INFO] Installing <https://builds.apache.org/job/tobago-trunk-deploy/ws/trunk-deploy/tobago-example/tobago-example-blank/target/tobago-example-blank.war>
to /export/home/hudson/.m2/repository/org/apache/myfaces/tobago/tobago-example-blank/1.5.0-alpha-3-SNAPSHOT/tobago-example-blank-1.5.0-alpha-3-SNAPSHOT.war
[INFO] Installing <https://builds.apache.org/job/tobago-trunk-deploy/ws/trunk-deploy/tobago-example/tobago-example-blank/target/tobago-example-blank-sources.jar>
to /export/home/hudson/.m2/repository/org/apache/myfaces/tobago/tobago-example-blank/1.5.0-alpha-3-SNAPSHOT/tobago-example-blank-1.5.0-alpha-3-SNAPSHOT-sources.jar
[INFO] [deploy:deploy {execution: default-deploy}]
[INFO] Retrieving previous build number from apache.snapshots.https
Uploading: https://repository.apache.org/content/repositories/snapshots/org/apache/myfaces/tobago/tobago-example-blank/1.5.0-alpha-3-SNAPSHOT/tobago-example-blank-1.5.0-alpha-3-SNAPSHOT.war
4469K uploaded  (tobago-example-blank-1.5.0-alpha-3-SNAPSHOT.war)
[INFO] Uploading project information for tobago-example-blank 1.5.0-alpha-3-SNAPSHOT
[INFO] Retrieving previous metadata from apache.snapshots.https
[INFO] Uploading repository metadata for: 'snapshot org.apache.myfaces.tobago:tobago-example-blank:1.5.0-alpha-3-SNAPSHOT'
[INFO] Retrieving previous metadata from apache.snapshots.https
[INFO] Uploading repository metadata for: 'artifact org.apache.myfaces.tobago:tobago-example-blank'
[INFO] Retrieving previous build number from apache.snapshots.https
Uploading: https://repository.apache.org/content/repositories/snapshots/org/apache/myfaces/tobago/tobago-example-blank/1.5.0-alpha-3-SNAPSHOT/tobago-example-blank-1.5.0-alpha-3-SNAPSHOT-sources.jar
5K uploaded  (tobago-example-blank-1.5.0-alpha-3-SNAPSHOT-sources.jar)
[JENKINS] Archiving <https://builds.apache.org/job/tobago-trunk-deploy/ws/trunk-deploy/tobago-example/tobago-example-blank/target/tobago-example-blank-sources.jar>
to /home/hudson/hudson/jobs/tobago-trunk-deploy/modules/org.apache.myfaces.tobago$tobago-example-blank/builds/2011-06-10_00-37-16/archive/org.apache.myfaces.tobago/tobago-example-blank/1.5.0-alpha-3-SNAPSHOT/tobago-example-blank-1.5.0-alpha-3-SNAPSHOT-sources.jar
[INFO] ------------------------------------------------------------------------
[INFO] Building Tobago Example Data (to use in other examples)
[INFO]    task-segment: [clean, animal-sniffer:check, deploy]
[INFO] ------------------------------------------------------------------------
[INFO] [clean:clean {execution: default-clean}]
[INFO] [animal-sniffer:check {execution: default-cli}]
[INFO] Checking unresolved references to org.codehaus.mojo.signature:java15:1.0
[INFO] [enforcer:enforce {execution: enforce}]
[INFO] [buildnumber:create {execution: default}]
[INFO] [remote-resources:process {execution: default}]
[INFO] [resources:resources {execution: default-resources}]
[INFO] Using 'UTF-8' encoding to copy filtered resources.
[INFO] Copying 1 resource
[INFO] Copying 3 resources
[INFO] [build-helper:add-source {execution: default}]
[INFO] Source directory: <https://builds.apache.org/job/tobago-trunk-deploy/ws/trunk-deploy/tobago-example/tobago-example-data/src/main/java-jsf-1.2>
added.
[INFO] [compiler:compile {execution: default-compile}]
[INFO] Compiling 12 source files to <https://builds.apache.org/job/tobago-trunk-deploy/ws/trunk-deploy/tobago-example/tobago-example-data/target/classes>
[INFO] [resources:testResources {execution: default-testResources}]
[INFO] Using 'UTF-8' encoding to copy filtered resources.
[INFO] skip non existing resourceDirectory <https://builds.apache.org/job/tobago-trunk-deploy/ws/trunk-deploy/tobago-example/tobago-example-data/src/test/resources>
[INFO] Copying 3 resources
[INFO] [compiler:testCompile {execution: default-testCompile}]
[INFO] No sources to compile
[INFO] [surefire:test {execution: default-test}]
[INFO] Surefire report directory: <https://builds.apache.org/job/tobago-trunk-deploy/ws/trunk-deploy/tobago-example/tobago-example-data/target/surefire-reports>

-------------------------------------------------------
 T E S T S
-------------------------------------------------------
There are no tests to run.

Results :

Tests run: 0, Failures: 0, Errors: 0, Skipped: 0

[JENKINS] Recording test results
[INFO] [jar:jar {execution: default-jar}]
[INFO] Building jar: <https://builds.apache.org/job/tobago-trunk-deploy/ws/trunk-deploy/tobago-example/tobago-example-data/target/tobago-example-data-1.5.0-alpha-3-SNAPSHOT.jar>
[INFO] [javadoc:jar {execution: attach-javadoc}]
[INFO] Building jar: <https://builds.apache.org/job/tobago-trunk-deploy/ws/trunk-deploy/tobago-example/tobago-example-data/target/tobago-example-data-1.5.0-alpha-3-SNAPSHOT-javadoc.jar>
[INFO] Preparing source:jar
[WARNING] Removing: jar from forked lifecycle, to prevent recursive invocation.
[JENKINS] Archiving <https://builds.apache.org/job/tobago-trunk-deploy/ws/trunk-deploy/tobago-example/tobago-example-data/pom.xml>
to /home/hudson/hudson/jobs/tobago-trunk-deploy/modules/org.apache.myfaces.tobago$tobago-example-data/builds/2011-06-10_00-37-16/archive/org.apache.myfaces.tobago/tobago-example-data/1.5.0-alpha-3-SNAPSHOT/tobago-example-data-1.5.0-alpha-3-SNAPSHOT.pom
[JENKINS] Archiving <https://builds.apache.org/job/tobago-trunk-deploy/ws/trunk-deploy/tobago-example/tobago-example-data/target/tobago-example-data-1.5.0-alpha-3-SNAPSHOT.jar>
to /home/hudson/hudson/jobs/tobago-trunk-deploy/modules/org.apache.myfaces.tobago$tobago-example-data/builds/2011-06-10_00-37-16/archive/org.apache.myfaces.tobago/tobago-example-data/1.5.0-alpha-3-SNAPSHOT/tobago-example-data-1.5.0-alpha-3-SNAPSHOT.jar
[JENKINS] Archiving <https://builds.apache.org/job/tobago-trunk-deploy/ws/trunk-deploy/tobago-example/tobago-example-data/target/tobago-example-data-1.5.0-alpha-3-SNAPSHOT-javadoc.jar>
to /home/hudson/hudson/jobs/tobago-trunk-deploy/modules/org.apache.myfaces.tobago$tobago-example-data/builds/2011-06-10_00-37-16/archive/org.apache.myfaces.tobago/tobago-example-data/1.5.0-alpha-3-SNAPSHOT/tobago-example-data-1.5.0-alpha-3-SNAPSHOT-javadoc.jar
[INFO] [enforcer:enforce {execution: enforce}]
[INFO] [buildnumber:create {execution: default}]
[INFO] [source:jar {execution: attach-source}]
[INFO] META-INF already added, skipping
[INFO] META-INF already added, skipping
[INFO] META-INF/NOTICE already added, skipping
[INFO] META-INF/DEPENDENCIES already added, skipping
[INFO] META-INF/LICENSE already added, skipping
[INFO] Building jar: <https://builds.apache.org/job/tobago-trunk-deploy/ws/trunk-deploy/tobago-example/tobago-example-data/target/tobago-example-data-1.5.0-alpha-3-SNAPSHOT-sources.jar>
[INFO] META-INF already added, skipping
[INFO] META-INF already added, skipping
[INFO] META-INF/NOTICE already added, skipping
[INFO] META-INF/DEPENDENCIES already added, skipping
[INFO] META-INF/LICENSE already added, skipping
[INFO] [assembly:single {execution: source-release-assembly}]
[INFO] Skipping the assembly in this project because it's not the Execution Root
[INFO] [install:install {execution: default-install}]
[INFO] Installing <https://builds.apache.org/job/tobago-trunk-deploy/ws/trunk-deploy/tobago-example/tobago-example-data/target/tobago-example-data-1.5.0-alpha-3-SNAPSHOT.jar>
to /export/home/hudson/.m2/repository/org/apache/myfaces/tobago/tobago-example-data/1.5.0-alpha-3-SNAPSHOT/tobago-example-data-1.5.0-alpha-3-SNAPSHOT.jar
[INFO] Installing <https://builds.apache.org/job/tobago-trunk-deploy/ws/trunk-deploy/tobago-example/tobago-example-data/target/tobago-example-data-1.5.0-alpha-3-SNAPSHOT-javadoc.jar>
to /export/home/hudson/.m2/repository/org/apache/myfaces/tobago/tobago-example-data/1.5.0-alpha-3-SNAPSHOT/tobago-example-data-1.5.0-alpha-3-SNAPSHOT-javadoc.jar
[INFO] Installing <https://builds.apache.org/job/tobago-trunk-deploy/ws/trunk-deploy/tobago-example/tobago-example-data/target/tobago-example-data-1.5.0-alpha-3-SNAPSHOT-sources.jar>
to /export/home/hudson/.m2/repository/org/apache/myfaces/tobago/tobago-example-data/1.5.0-alpha-3-SNAPSHOT/tobago-example-data-1.5.0-alpha-3-SNAPSHOT-sources.jar
[INFO] [deploy:deploy {execution: default-deploy}]
[INFO] Retrieving previous build number from apache.snapshots.https
Uploading: https://repository.apache.org/content/repositories/snapshots/org/apache/myfaces/tobago/tobago-example-data/1.5.0-alpha-3-SNAPSHOT/tobago-example-data-1.5.0-alpha-3-SNAPSHOT.jar
25K uploaded  (tobago-example-data-1.5.0-alpha-3-SNAPSHOT.jar)
[INFO] Uploading project information for tobago-example-data 1.5.0-alpha-3-SNAPSHOT
[INFO] Retrieving previous metadata from apache.snapshots.https
[INFO] Uploading repository metadata for: 'snapshot org.apache.myfaces.tobago:tobago-example-data:1.5.0-alpha-3-SNAPSHOT'
[INFO] Retrieving previous metadata from apache.snapshots.https
[INFO] Uploading repository metadata for: 'artifact org.apache.myfaces.tobago:tobago-example-data'
[INFO] Retrieving previous build number from apache.snapshots.https
Uploading: https://repository.apache.org/content/repositories/snapshots/org/apache/myfaces/tobago/tobago-example-data/1.5.0-alpha-3-SNAPSHOT/tobago-example-data-1.5.0-alpha-3-SNAPSHOT-javadoc.jar
107K uploaded  (tobago-example-data-1.5.0-alpha-3-SNAPSHOT-javadoc.jar)
[INFO] Retrieving previous build number from apache.snapshots.https
Uploading: https://repository.apache.org/content/repositories/snapshots/org/apache/myfaces/tobago/tobago-example-data/1.5.0-alpha-3-SNAPSHOT/tobago-example-data-1.5.0-alpha-3-SNAPSHOT-sources.jar
21K uploaded  (tobago-example-data-1.5.0-alpha-3-SNAPSHOT-sources.jar)
[JENKINS] Archiving <https://builds.apache.org/job/tobago-trunk-deploy/ws/trunk-deploy/tobago-example/tobago-example-data/target/tobago-example-data-1.5.0-alpha-3-SNAPSHOT-sources.jar>
to /home/hudson/hudson/jobs/tobago-trunk-deploy/modules/org.apache.myfaces.tobago$tobago-example-data/builds/2011-06-10_00-37-16/archive/org.apache.myfaces.tobago/tobago-example-data/1.5.0-alpha-3-SNAPSHOT/tobago-example-data-1.5.0-alpha-3-SNAPSHOT-sources.jar
[INFO] ------------------------------------------------------------------------
[INFO] Building Tobago Example Demo
[INFO]    task-segment: [clean, animal-sniffer:check, deploy]
[INFO] ------------------------------------------------------------------------
[INFO] [clean:clean {execution: default-clean}]
[INFO] [animal-sniffer:check {execution: default-cli}]
[INFO] Checking unresolved references to org.codehaus.mojo.signature:java15:1.0
[INFO] [enforcer:enforce {execution: enforce}]
[INFO] [buildnumber:create {execution: default}]
[INFO] [remote-resources:process {execution: default}]
[INFO] [xml:transform {execution: default}]
[INFO] Transforming file: <https://builds.apache.org/job/tobago-trunk-deploy/ws/trunk-deploy/tobago-example/tobago-example-demo/src/main/webapp/reference/popup.xhtml>
[INFO] Transforming file: <https://builds.apache.org/job/tobago-trunk-deploy/ws/trunk-deploy/tobago-example/tobago-example-demo/src/main/webapp/reference/tree/tree-normal.xhtml>
[INFO] Transforming file: <https://builds.apache.org/job/tobago-trunk-deploy/ws/trunk-deploy/tobago-example/tobago-example-demo/src/main/webapp/reference/tree/tree-menu.xhtml>
[INFO] Transforming file: <https://builds.apache.org/job/tobago-trunk-deploy/ws/trunk-deploy/tobago-example/tobago-example-demo/src/main/webapp/reference/tree/tree-select.xhtml>
[INFO] Transforming file: <https://builds.apache.org/job/tobago-trunk-deploy/ws/trunk-deploy/tobago-example/tobago-example-demo/src/main/webapp/reference/tree/tree-simple.xhtml>
[INFO] Transforming file: <https://builds.apache.org/job/tobago-trunk-deploy/ws/trunk-deploy/tobago-example/tobago-example-demo/src/main/webapp/reference/tree/tree-listbox.xhtml>
[INFO] Transforming file: <https://builds.apache.org/job/tobago-trunk-deploy/ws/trunk-deploy/tobago-example/tobago-example-demo/src/main/webapp/reference/select.xhtml>
[INFO] Transforming file: <https://builds.apache.org/job/tobago-trunk-deploy/ws/trunk-deploy/tobago-example/tobago-example-demo/src/main/webapp/reference/upload.xhtml>
[INFO] Transforming file: <https://builds.apache.org/job/tobago-trunk-deploy/ws/trunk-deploy/tobago-example/tobago-example-demo/src/main/webapp/init.xhtml>
[INFO] Transformed 9 file(s).
[INFO] [resources:resources {execution: default-resources}]
[INFO] Using 'UTF-8' encoding to copy filtered resources.
[INFO] Copying 1 resource
[INFO] Copying 3 resources
[INFO] [build-helper:add-source {execution: default}]
[INFO] Source directory: <https://builds.apache.org/job/tobago-trunk-deploy/ws/trunk-deploy/tobago-example/tobago-example-demo/src/main/java-jsf-1.2>
added.
[INFO] [theme:resources {execution: default}]
[INFO] Expanding: <https://builds.apache.org/job/tobago-trunk-deploy/ws/trunk-deploy/tobago-theme/tobago-theme-charlotteville/target/tobago-theme-charlotteville-1.5.0-alpha-3-SNAPSHOT.jar>
into <https://builds.apache.org/job/tobago-trunk-deploy/ws/trunk-deploy/tobago-example/tobago-example-demo/target/theme/work/tobago-theme-charlotteville-1.5.0-alpha-3-SNAPSHOT>
[INFO] Expanding: <https://builds.apache.org/job/tobago-trunk-deploy/ws/trunk-deploy/tobago-theme/tobago-theme-scarborough/target/tobago-theme-scarborough-1.5.0-alpha-3-SNAPSHOT.jar>
into <https://builds.apache.org/job/tobago-trunk-deploy/ws/trunk-deploy/tobago-example/tobago-example-demo/target/theme/work/tobago-theme-scarborough-1.5.0-alpha-3-SNAPSHOT>
[INFO] Expanding: <https://builds.apache.org/job/tobago-trunk-deploy/ws/trunk-deploy/tobago-theme/tobago-theme-richmond/target/tobago-theme-richmond-1.5.0-alpha-3-SNAPSHOT.jar>
into <https://builds.apache.org/job/tobago-trunk-deploy/ws/trunk-deploy/tobago-example/tobago-example-demo/target/theme/work/tobago-theme-richmond-1.5.0-alpha-3-SNAPSHOT>
[INFO] [compiler:compile {execution: default-compile}]
[INFO] Compiling 40 source files to <https://builds.apache.org/job/tobago-trunk-deploy/ws/trunk-deploy/tobago-example/tobago-example-demo/target/classes>
[INFO] [resources:testResources {execution: default-testResources}]
[INFO] Using 'UTF-8' encoding to copy filtered resources.
[INFO] skip non existing resourceDirectory <https://builds.apache.org/job/tobago-trunk-deploy/ws/trunk-deploy/tobago-example/tobago-example-demo/src/test/resources>
[INFO] Copying 3 resources
[INFO] [compiler:testCompile {execution: default-testCompile}]
[INFO] Compiling 2 source files to <https://builds.apache.org/job/tobago-trunk-deploy/ws/trunk-deploy/tobago-example/tobago-example-demo/target/test-classes>
[INFO] -------------------------------------------------------------
[ERROR] COMPILATION ERROR : 
[INFO] -------------------------------------------------------------
[ERROR] <https://builds.apache.org/job/tobago-trunk-deploy/ws/trunk-deploy/tobago-example/tobago-example-demo/src/test/java/org/apache/myfaces/tobago/example/demo/NavigationUnitTest.java>:[39,34]
cannot find symbol
symbol  : constructor Navigation(java.util.List<java.lang.String>)
location: class org.apache.myfaces.tobago.example.demo.Navigation
[INFO] 1 error
[INFO] -------------------------------------------------------------
[JENKINS] Archiving <https://builds.apache.org/job/tobago-trunk-deploy/ws/trunk-deploy/tobago-example/tobago-example-demo/pom.xml>
to /home/hudson/hudson/jobs/tobago-trunk-deploy/modules/org.apache.myfaces.tobago$tobago-example-demo/builds/2011-06-10_00-37-16/archive/org.apache.myfaces.tobago/tobago-example-demo/1.5.0-alpha-3-SNAPSHOT/tobago-example-demo-1.5.0-alpha-3-SNAPSHOT.pom
[INFO] ------------------------------------------------------------------------
[ERROR] BUILD FAILURE
[INFO] ------------------------------------------------------------------------
[INFO] Compilation failure
<https://builds.apache.org/job/tobago-trunk-deploy/ws/trunk-deploy/tobago-example/tobago-example-demo/src/test/java/org/apache/myfaces/tobago/example/demo/NavigationUnitTest.java>:[39,34]
cannot find symbol
symbol  : constructor Navigation(java.util.List<java.lang.String>)
location: class org.apache.myfaces.tobago.example.demo.Navigation

[INFO] ------------------------------------------------------------------------
[INFO] For more information, run Maven with the -e switch
[INFO] ------------------------------------------------------------------------
[INFO] Total time: 14 minutes 49 seconds
[INFO] Finished at: Thu Jun 09 20:52:20 EDT 2011
[INFO] Final Memory: 116M/536M
[INFO] ------------------------------------------------------------------------
Sending e-mails to: commits@myfaces.apache.org
channel stopped


Mime
View raw message