myfaces-commits mailing list archives

Site index · List index
Message view « Date » · « Thread »
Top « Date » · « Thread »
From Apache Jenkins Server <jenk...@builds.apache.org>
Subject Build failed in Jenkins: ExtVal for JSF 1.2 (nightly) #76
Date Sun, 14 Aug 2011 00:06:54 GMT
See <https://builds.apache.org/job/ExtVal%20for%20JSF%201.2%20(nightly)/76/>

------------------------------------------
[...truncated 665 lines...]
[JENKINS] Archiving <https://builds.apache.org/job/ExtVal%20for%20JSF%201.2%20(nightly)/ws/trunk/test-modules/property-validation-tests/target/myfaces-extval-property-validation-tests-1.2.5-SNAPSHOT.jar>
to /home/hudson/hudson/jobs/ExtVal for JSF 1.2 (nightly)/modules/org.apache.myfaces.extensions.validator.test-modules$myfaces-extval-property-validation-tests/builds/2011-08-14_00-04-11/archive/org.apache.myfaces.extensions.validator.test-modules/myfaces-extval-property-validation-tests/1.2.5-SNAPSHOT/myfaces-extval-property-validation-tests-1.2.5-SNAPSHOT.jar
[INFO] [antrun:run {execution: javadoc.resources}]
[INFO] Executing tasks
[INFO] Executed tasks
[INFO] [source:jar {execution: attach-sources}]
[INFO] META-INF already added, skipping
[INFO] META-INF/LICENSE already added, skipping
[INFO] META-INF/NOTICE already added, skipping
[INFO] META-INF/DEPENDENCIES already added, skipping
[INFO] Building jar: <https://builds.apache.org/job/ExtVal%20for%20JSF%201.2%20(nightly)/ws/trunk/test-modules/property-validation-tests/target/myfaces-extval-property-validation-tests-1.2.5-SNAPSHOT-sources.jar>
[INFO] META-INF already added, skipping
[INFO] META-INF/LICENSE already added, skipping
[INFO] META-INF/NOTICE already added, skipping
[INFO] META-INF/DEPENDENCIES already added, skipping
[INFO] [jar:test-jar {execution: default}]
[INFO] Building jar: <https://builds.apache.org/job/ExtVal%20for%20JSF%201.2%20(nightly)/ws/trunk/test-modules/property-validation-tests/target/myfaces-extval-property-validation-tests-1.2.5-SNAPSHOT-tests.jar>
[INFO] Preparing checkstyle:check
[JENKINS] Archiving <https://builds.apache.org/job/ExtVal%20for%20JSF%201.2%20(nightly)/ws/trunk/test-modules/property-validation-tests/target/myfaces-extval-property-validation-tests-1.2.5-SNAPSHOT-sources.jar>
to /home/hudson/hudson/jobs/ExtVal for JSF 1.2 (nightly)/modules/org.apache.myfaces.extensions.validator.test-modules$myfaces-extval-property-validation-tests/builds/2011-08-14_00-04-11/archive/org.apache.myfaces.extensions.validator.test-modules/myfaces-extval-property-validation-tests/1.2.5-SNAPSHOT/myfaces-extval-property-validation-tests-1.2.5-SNAPSHOT-sources.jar
[JENKINS] Archiving <https://builds.apache.org/job/ExtVal%20for%20JSF%201.2%20(nightly)/ws/trunk/test-modules/property-validation-tests/target/myfaces-extval-property-validation-tests-1.2.5-SNAPSHOT-tests.jar>
to /home/hudson/hudson/jobs/ExtVal for JSF 1.2 (nightly)/modules/org.apache.myfaces.extensions.validator.test-modules$myfaces-extval-property-validation-tests/builds/2011-08-14_00-04-11/archive/org.apache.myfaces.extensions.validator.test-modules/myfaces-extval-property-validation-tests/1.2.5-SNAPSHOT/myfaces-extval-property-validation-tests-1.2.5-SNAPSHOT-tests.jar
[INFO] [checkstyle:checkstyle {execution: checkstyle}]
[INFO] Source directory does not exist - skipping report.
[INFO] [checkstyle:check {execution: verify-style}]
[INFO] Unable to perform checkstyle:check, unable to find checkstyle:checkstyle outputFile.
[INFO] [install:install {execution: default-install}]
[INFO] Installing <https://builds.apache.org/job/ExtVal%20for%20JSF%201.2%20(nightly)/ws/trunk/test-modules/property-validation-tests/target/myfaces-extval-property-validation-tests-1.2.5-SNAPSHOT.jar>
to /home/jenkins/.m2/repository/org/apache/myfaces/extensions/validator/test-modules/myfaces-extval-property-validation-tests/1.2.5-SNAPSHOT/myfaces-extval-property-validation-tests-1.2.5-SNAPSHOT.jar
[INFO] Installing <https://builds.apache.org/job/ExtVal%20for%20JSF%201.2%20(nightly)/ws/trunk/test-modules/property-validation-tests/target/myfaces-extval-property-validation-tests-1.2.5-SNAPSHOT-sources.jar>
to /home/jenkins/.m2/repository/org/apache/myfaces/extensions/validator/test-modules/myfaces-extval-property-validation-tests/1.2.5-SNAPSHOT/myfaces-extval-property-validation-tests-1.2.5-SNAPSHOT-sources.jar
[INFO] Installing <https://builds.apache.org/job/ExtVal%20for%20JSF%201.2%20(nightly)/ws/trunk/test-modules/property-validation-tests/target/myfaces-extval-property-validation-tests-1.2.5-SNAPSHOT-tests.jar>
to /home/jenkins/.m2/repository/org/apache/myfaces/extensions/validator/test-modules/myfaces-extval-property-validation-tests/1.2.5-SNAPSHOT/myfaces-extval-property-validation-tests-1.2.5-SNAPSHOT-tests.jar
[INFO] ------------------------------------------------------------------------
[INFO] Building MyFaces Extensions-Validator Bean-Validation-Integration-Tests
[INFO]    task-segment: [clean, install]
[INFO] ------------------------------------------------------------------------
[INFO] [clean:clean {execution: default-clean}]
Downloading: http://repository.jboss.com/maven2/com/sun/xml/bind/jaxb-impl/2.1.3/jaxb-impl-2.1.3.jar
Downloading: http://repository.jboss.com/maven2/org/hibernate/hibernate-validator/4.0.0.GA/hibernate-validator-4.0.0.GA.jar
[WARNING] Unable to get resource 'com.sun.xml.bind:jaxb-impl:jar:2.1.3' from repository jboss
(http://repository.jboss.com/maven2): Authorization failed: Access denied to: http://repository.jboss.com/maven2/com/sun/xml/bind/jaxb-impl/2.1.3/jaxb-impl-2.1.3.jar
[WARNING] Unable to get resource 'org.hibernate:hibernate-validator:jar:4.0.0.GA' from repository
jboss (http://repository.jboss.com/maven2): Authorization failed: Access denied to: http://repository.jboss.com/maven2/org/hibernate/hibernate-validator/4.0.0.GA/hibernate-validator-4.0.0.GA.jar
Downloading: http://snapshots.jboss.org/maven2/com/sun/xml/bind/jaxb-impl/2.1.3/jaxb-impl-2.1.3.jar
Downloading: http://snapshots.jboss.org/maven2/org/hibernate/hibernate-validator/4.0.0.GA/hibernate-validator-4.0.0.GA.jar
[INFO] Unable to find resource 'org.hibernate:hibernate-validator:jar:4.0.0.GA' in repository
jboss-snapshot (http://snapshots.jboss.org/maven2)
[INFO] Unable to find resource 'com.sun.xml.bind:jaxb-impl:jar:2.1.3' in repository jboss-snapshot
(http://snapshots.jboss.org/maven2)
Downloading: http://download.java.net/maven/2//org/hibernate/hibernate-validator/4.0.0.GA/hibernate-validator-4.0.0.GA.jar
Downloading: http://download.java.net/maven/2//com/sun/xml/bind/jaxb-impl/2.1.3/jaxb-impl-2.1.3.jar
[INFO] Unable to find resource 'com.sun.xml.bind:jaxb-impl:jar:2.1.3' in repository maven2-repository.dev.java.net
(http://download.java.net/maven/2/)
[INFO] Unable to find resource 'org.hibernate:hibernate-validator:jar:4.0.0.GA' in repository
maven2-repository.dev.java.net (http://download.java.net/maven/2/)
Downloading: http://repo1.maven.org/maven2/com/sun/xml/bind/jaxb-impl/2.1.3/jaxb-impl-2.1.3.jar
Downloading: http://repo1.maven.org/maven2/org/hibernate/hibernate-validator/4.0.0.GA/hibernate-validator-4.0.0.GA.jar

[INFO] [antrun:run {execution: javadoc.resources}]
[INFO] Executing tasks
[INFO] Executed tasks
[INFO] [remote-resources:process {execution: default}]
[INFO] [resources:resources {execution: default-resources}]
[INFO] Using 'UTF-8' encoding to copy filtered resources.
[INFO] skip non existing resourceDirectory <https://builds.apache.org/job/ExtVal%20for%20JSF%201.2%20(nightly)/ws/trunk/test-modules/bean-validation-tests/src/main/config>
[INFO] skip non existing resourceDirectory <https://builds.apache.org/job/ExtVal%20for%20JSF%201.2%20(nightly)/ws/trunk/test-modules/bean-validation-tests/src/main/resources>
[INFO] skip non existing resourceDirectory <https://builds.apache.org/job/ExtVal%20for%20JSF%201.2%20(nightly)/ws/trunk/test-modules/bean-validation-tests/src/main/java>
[INFO] Copying 3 resources
[INFO] [compiler:compile {execution: default-compile}]
[INFO] No sources to compile
[INFO] [resources:testResources {execution: default-testResources}]
[INFO] Using 'UTF-8' encoding to copy filtered resources.
[INFO] Copying 0 resource
[INFO] Copying 3 resources
[INFO] [compiler:testCompile {execution: default-testCompile}]
[INFO] Compiling 62 source files to <https://builds.apache.org/job/ExtVal%20for%20JSF%201.2%20(nightly)/ws/trunk/test-modules/bean-validation-tests/target/test-classes>
[INFO] [surefire:test {execution: default-test}]
[INFO] Surefire report directory: <https://builds.apache.org/job/ExtVal%20for%20JSF%201.2%20(nightly)/ws/trunk/test-modules/bean-validation-tests/target/surefire-reports>
/bin/sh: Syntax error: "(" unexpected
[ERROR] There are test failures.

Please refer to <https://builds.apache.org/job/ExtVal%20for%20JSF%201.2%20(nightly)/ws/trunk/test-modules/bean-validation-tests/target/surefire-reports>
for the individual test results.
[JENKINS] Recording test results
[INFO] [jar:jar {execution: default-jar}]
[INFO] Building jar: <https://builds.apache.org/job/ExtVal%20for%20JSF%201.2%20(nightly)/ws/trunk/test-modules/bean-validation-tests/target/myfaces-extval-bean-validation-tests-1.2.5-SNAPSHOT.jar>
[INFO] Preparing source:jar
[WARNING] Removing: jar from forked lifecycle, to prevent recursive invocation.
[JENKINS] Archiving <https://builds.apache.org/job/ExtVal%20for%20JSF%201.2%20(nightly)/ws/trunk/test-modules/bean-validation-tests/pom.xml>
to /home/hudson/hudson/jobs/ExtVal for JSF 1.2 (nightly)/modules/org.apache.myfaces.extensions.validator.test-modules$myfaces-extval-bean-validation-tests/builds/2011-08-14_00-04-11/archive/org.apache.myfaces.extensions.validator.test-modules/myfaces-extval-bean-validation-tests/1.2.5-SNAPSHOT/myfaces-extval-bean-validation-tests-1.2.5-SNAPSHOT.pom
[JENKINS] Archiving <https://builds.apache.org/job/ExtVal%20for%20JSF%201.2%20(nightly)/ws/trunk/test-modules/bean-validation-tests/target/myfaces-extval-bean-validation-tests-1.2.5-SNAPSHOT.jar>
to /home/hudson/hudson/jobs/ExtVal for JSF 1.2 (nightly)/modules/org.apache.myfaces.extensions.validator.test-modules$myfaces-extval-bean-validation-tests/builds/2011-08-14_00-04-11/archive/org.apache.myfaces.extensions.validator.test-modules/myfaces-extval-bean-validation-tests/1.2.5-SNAPSHOT/myfaces-extval-bean-validation-tests-1.2.5-SNAPSHOT.jar
[INFO] [antrun:run {execution: javadoc.resources}]
[INFO] Executing tasks
[INFO] Executed tasks
[INFO] [source:jar {execution: attach-sources}]
[INFO] META-INF already added, skipping
[INFO] META-INF/LICENSE already added, skipping
[INFO] META-INF/NOTICE already added, skipping
[INFO] META-INF/DEPENDENCIES already added, skipping
[INFO] Building jar: <https://builds.apache.org/job/ExtVal%20for%20JSF%201.2%20(nightly)/ws/trunk/test-modules/bean-validation-tests/target/myfaces-extval-bean-validation-tests-1.2.5-SNAPSHOT-sources.jar>
[INFO] META-INF already added, skipping
[INFO] META-INF/LICENSE already added, skipping
[INFO] META-INF/NOTICE already added, skipping
[INFO] META-INF/DEPENDENCIES already added, skipping
[INFO] [jar:test-jar {execution: default}]
[INFO] Building jar: <https://builds.apache.org/job/ExtVal%20for%20JSF%201.2%20(nightly)/ws/trunk/test-modules/bean-validation-tests/target/myfaces-extval-bean-validation-tests-1.2.5-SNAPSHOT-tests.jar>
[INFO] Preparing checkstyle:check
[JENKINS] Archiving <https://builds.apache.org/job/ExtVal%20for%20JSF%201.2%20(nightly)/ws/trunk/test-modules/bean-validation-tests/target/myfaces-extval-bean-validation-tests-1.2.5-SNAPSHOT-sources.jar>
to /home/hudson/hudson/jobs/ExtVal for JSF 1.2 (nightly)/modules/org.apache.myfaces.extensions.validator.test-modules$myfaces-extval-bean-validation-tests/builds/2011-08-14_00-04-11/archive/org.apache.myfaces.extensions.validator.test-modules/myfaces-extval-bean-validation-tests/1.2.5-SNAPSHOT/myfaces-extval-bean-validation-tests-1.2.5-SNAPSHOT-sources.jar
[JENKINS] Archiving <https://builds.apache.org/job/ExtVal%20for%20JSF%201.2%20(nightly)/ws/trunk/test-modules/bean-validation-tests/target/myfaces-extval-bean-validation-tests-1.2.5-SNAPSHOT-tests.jar>
to /home/hudson/hudson/jobs/ExtVal for JSF 1.2 (nightly)/modules/org.apache.myfaces.extensions.validator.test-modules$myfaces-extval-bean-validation-tests/builds/2011-08-14_00-04-11/archive/org.apache.myfaces.extensions.validator.test-modules/myfaces-extval-bean-validation-tests/1.2.5-SNAPSHOT/myfaces-extval-bean-validation-tests-1.2.5-SNAPSHOT-tests.jar
[INFO] [checkstyle:checkstyle {execution: checkstyle}]
[INFO] Source directory does not exist - skipping report.
[INFO] [checkstyle:check {execution: verify-style}]
[INFO] Unable to perform checkstyle:check, unable to find checkstyle:checkstyle outputFile.
[INFO] [install:install {execution: default-install}]
[INFO] Installing <https://builds.apache.org/job/ExtVal%20for%20JSF%201.2%20(nightly)/ws/trunk/test-modules/bean-validation-tests/target/myfaces-extval-bean-validation-tests-1.2.5-SNAPSHOT.jar>
to /home/jenkins/.m2/repository/org/apache/myfaces/extensions/validator/test-modules/myfaces-extval-bean-validation-tests/1.2.5-SNAPSHOT/myfaces-extval-bean-validation-tests-1.2.5-SNAPSHOT.jar
[INFO] Installing <https://builds.apache.org/job/ExtVal%20for%20JSF%201.2%20(nightly)/ws/trunk/test-modules/bean-validation-tests/target/myfaces-extval-bean-validation-tests-1.2.5-SNAPSHOT-sources.jar>
to /home/jenkins/.m2/repository/org/apache/myfaces/extensions/validator/test-modules/myfaces-extval-bean-validation-tests/1.2.5-SNAPSHOT/myfaces-extval-bean-validation-tests-1.2.5-SNAPSHOT-sources.jar
[INFO] Installing <https://builds.apache.org/job/ExtVal%20for%20JSF%201.2%20(nightly)/ws/trunk/test-modules/bean-validation-tests/target/myfaces-extval-bean-validation-tests-1.2.5-SNAPSHOT-tests.jar>
to /home/jenkins/.m2/repository/org/apache/myfaces/extensions/validator/test-modules/myfaces-extval-bean-validation-tests/1.2.5-SNAPSHOT/myfaces-extval-bean-validation-tests-1.2.5-SNAPSHOT-tests.jar
[INFO] ------------------------------------------------------------------------
[INFO] Building MyFaces Extensions-Validator Trinidad Component-Support-Tests
[INFO]    task-segment: [clean, install]
[INFO] ------------------------------------------------------------------------
[INFO] [clean:clean {execution: default-clean}]
[INFO] [antrun:run {execution: javadoc.resources}]
[INFO] Executing tasks
[INFO] Executed tasks
[INFO] [remote-resources:process {execution: default}]
[INFO] [resources:resources {execution: default-resources}]
[INFO] Using 'UTF-8' encoding to copy filtered resources.
[INFO] skip non existing resourceDirectory <https://builds.apache.org/job/ExtVal%20for%20JSF%201.2%20(nightly)/ws/trunk/test-modules/trinidad-component-support-tests/src/main/config>
[INFO] skip non existing resourceDirectory <https://builds.apache.org/job/ExtVal%20for%20JSF%201.2%20(nightly)/ws/trunk/test-modules/trinidad-component-support-tests/src/main/resources>
[INFO] skip non existing resourceDirectory <https://builds.apache.org/job/ExtVal%20for%20JSF%201.2%20(nightly)/ws/trunk/test-modules/trinidad-component-support-tests/src/main/java>
[INFO] Copying 3 resources
[INFO] [compiler:compile {execution: default-compile}]
[INFO] No sources to compile
[INFO] [resources:testResources {execution: default-testResources}]
[INFO] Using 'UTF-8' encoding to copy filtered resources.
[INFO] skip non existing resourceDirectory <https://builds.apache.org/job/ExtVal%20for%20JSF%201.2%20(nightly)/ws/trunk/test-modules/trinidad-component-support-tests/src/test/resources>
[INFO] Copying 3 resources
[INFO] [compiler:testCompile {execution: default-testCompile}]
[INFO] Compiling 8 source files to <https://builds.apache.org/job/ExtVal%20for%20JSF%201.2%20(nightly)/ws/trunk/test-modules/trinidad-component-support-tests/target/test-classes>
[INFO] [surefire:test {execution: default-test}]
[INFO] Surefire report directory: <https://builds.apache.org/job/ExtVal%20for%20JSF%201.2%20(nightly)/ws/trunk/test-modules/trinidad-component-support-tests/target/surefire-reports>
/bin/sh: Syntax error: "(" unexpected
[ERROR] There are test failures.

Please refer to <https://builds.apache.org/job/ExtVal%20for%20JSF%201.2%20(nightly)/ws/trunk/test-modules/trinidad-component-support-tests/target/surefire-reports>
for the individual test results.
[JENKINS] Recording test results
[INFO] [jar:jar {execution: default-jar}]
[INFO] Building jar: <https://builds.apache.org/job/ExtVal%20for%20JSF%201.2%20(nightly)/ws/trunk/test-modules/trinidad-component-support-tests/target/myfaces-extval-trinidad-support-tests-1.2.5-SNAPSHOT.jar>
[INFO] Preparing source:jar
[WARNING] Removing: jar from forked lifecycle, to prevent recursive invocation.
[JENKINS] Archiving <https://builds.apache.org/job/ExtVal%20for%20JSF%201.2%20(nightly)/ws/trunk/test-modules/trinidad-component-support-tests/pom.xml>
to /home/hudson/hudson/jobs/ExtVal for JSF 1.2 (nightly)/modules/org.apache.myfaces.extensions.validator.test-modules$myfaces-extval-trinidad-support-tests/builds/2011-08-14_00-04-11/archive/org.apache.myfaces.extensions.validator.test-modules/myfaces-extval-trinidad-support-tests/1.2.5-SNAPSHOT/myfaces-extval-trinidad-support-tests-1.2.5-SNAPSHOT.pom
[JENKINS] Archiving <https://builds.apache.org/job/ExtVal%20for%20JSF%201.2%20(nightly)/ws/trunk/test-modules/trinidad-component-support-tests/target/myfaces-extval-trinidad-support-tests-1.2.5-SNAPSHOT.jar>
to /home/hudson/hudson/jobs/ExtVal for JSF 1.2 (nightly)/modules/org.apache.myfaces.extensions.validator.test-modules$myfaces-extval-trinidad-support-tests/builds/2011-08-14_00-04-11/archive/org.apache.myfaces.extensions.validator.test-modules/myfaces-extval-trinidad-support-tests/1.2.5-SNAPSHOT/myfaces-extval-trinidad-support-tests-1.2.5-SNAPSHOT.jar
[INFO] [antrun:run {execution: javadoc.resources}]
[INFO] Executing tasks
[INFO] Executed tasks
[INFO] [source:jar {execution: attach-sources}]
[INFO] META-INF already added, skipping
[INFO] META-INF/LICENSE already added, skipping
[INFO] META-INF/NOTICE already added, skipping
[INFO] META-INF/DEPENDENCIES already added, skipping
[INFO] Building jar: <https://builds.apache.org/job/ExtVal%20for%20JSF%201.2%20(nightly)/ws/trunk/test-modules/trinidad-component-support-tests/target/myfaces-extval-trinidad-support-tests-1.2.5-SNAPSHOT-sources.jar>
[INFO] META-INF already added, skipping
[INFO] META-INF/LICENSE already added, skipping
[INFO] META-INF/NOTICE already added, skipping
[INFO] META-INF/DEPENDENCIES already added, skipping
[INFO] [jar:test-jar {execution: default}]
[INFO] Building jar: <https://builds.apache.org/job/ExtVal%20for%20JSF%201.2%20(nightly)/ws/trunk/test-modules/trinidad-component-support-tests/target/myfaces-extval-trinidad-support-tests-1.2.5-SNAPSHOT-tests.jar>
[INFO] Preparing checkstyle:check
[JENKINS] Archiving <https://builds.apache.org/job/ExtVal%20for%20JSF%201.2%20(nightly)/ws/trunk/test-modules/trinidad-component-support-tests/target/myfaces-extval-trinidad-support-tests-1.2.5-SNAPSHOT-sources.jar>
to /home/hudson/hudson/jobs/ExtVal for JSF 1.2 (nightly)/modules/org.apache.myfaces.extensions.validator.test-modules$myfaces-extval-trinidad-support-tests/builds/2011-08-14_00-04-11/archive/org.apache.myfaces.extensions.validator.test-modules/myfaces-extval-trinidad-support-tests/1.2.5-SNAPSHOT/myfaces-extval-trinidad-support-tests-1.2.5-SNAPSHOT-sources.jar
[JENKINS] Archiving <https://builds.apache.org/job/ExtVal%20for%20JSF%201.2%20(nightly)/ws/trunk/test-modules/trinidad-component-support-tests/target/myfaces-extval-trinidad-support-tests-1.2.5-SNAPSHOT-tests.jar>
to /home/hudson/hudson/jobs/ExtVal for JSF 1.2 (nightly)/modules/org.apache.myfaces.extensions.validator.test-modules$myfaces-extval-trinidad-support-tests/builds/2011-08-14_00-04-11/archive/org.apache.myfaces.extensions.validator.test-modules/myfaces-extval-trinidad-support-tests/1.2.5-SNAPSHOT/myfaces-extval-trinidad-support-tests-1.2.5-SNAPSHOT-tests.jar
[INFO] [checkstyle:checkstyle {execution: checkstyle}]
[INFO] Source directory does not exist - skipping report.
[INFO] [checkstyle:check {execution: verify-style}]
[INFO] Unable to perform checkstyle:check, unable to find checkstyle:checkstyle outputFile.
[INFO] [install:install {execution: default-install}]
[INFO] Installing <https://builds.apache.org/job/ExtVal%20for%20JSF%201.2%20(nightly)/ws/trunk/test-modules/trinidad-component-support-tests/target/myfaces-extval-trinidad-support-tests-1.2.5-SNAPSHOT.jar>
to /home/jenkins/.m2/repository/org/apache/myfaces/extensions/validator/test-modules/myfaces-extval-trinidad-support-tests/1.2.5-SNAPSHOT/myfaces-extval-trinidad-support-tests-1.2.5-SNAPSHOT.jar
[INFO] Installing <https://builds.apache.org/job/ExtVal%20for%20JSF%201.2%20(nightly)/ws/trunk/test-modules/trinidad-component-support-tests/target/myfaces-extval-trinidad-support-tests-1.2.5-SNAPSHOT-sources.jar>
to /home/jenkins/.m2/repository/org/apache/myfaces/extensions/validator/test-modules/myfaces-extval-trinidad-support-tests/1.2.5-SNAPSHOT/myfaces-extval-trinidad-support-tests-1.2.5-SNAPSHOT-sources.jar
[INFO] Installing <https://builds.apache.org/job/ExtVal%20for%20JSF%201.2%20(nightly)/ws/trunk/test-modules/trinidad-component-support-tests/target/myfaces-extval-trinidad-support-tests-1.2.5-SNAPSHOT-tests.jar>
to /home/jenkins/.m2/repository/org/apache/myfaces/extensions/validator/test-modules/myfaces-extval-trinidad-support-tests/1.2.5-SNAPSHOT/myfaces-extval-trinidad-support-tests-1.2.5-SNAPSHOT-tests.jar
[INFO] ------------------------------------------------------------------------
[INFO] Building MyFaces Extensions-Validator examples project
[INFO]    task-segment: [clean, install]
[INFO] ------------------------------------------------------------------------
Downloading: http://repo1.maven.org/maven2/org/mortbay/jetty/maven-jetty-plugin/6.1.8/maven-jetty-plugin-6.1.8.pom

Downloading: http://repo1.maven.org/maven2/org/mortbay/jetty/maven-jetty-plugin/6.1.8/maven-jetty-plugin-6.1.8.jar

[INFO] [clean:clean {execution: default-clean}]
[INFO] [antrun:run {execution: javadoc.resources}]
[INFO] Executing tasks
[INFO] Executed tasks
[INFO] [remote-resources:process {execution: default}]
[INFO] [site:attach-descriptor {execution: default-attach-descriptor}]
[INFO] Preparing checkstyle:check
[JENKINS] Archiving <https://builds.apache.org/job/ExtVal%20for%20JSF%201.2%20(nightly)/ws/trunk/examples/pom.xml>
to /home/hudson/hudson/jobs/ExtVal for JSF 1.2 (nightly)/modules/org.apache.myfaces.extensions.validator.examples$examples-project/builds/2011-08-14_00-04-11/archive/org.apache.myfaces.extensions.validator.examples/examples-project/1.2.5-SNAPSHOT/examples-project-1.2.5-SNAPSHOT.pom
[INFO] [checkstyle:checkstyle {execution: checkstyle}]
[INFO] Source directory does not exist - skipping report.
[INFO] [checkstyle:check {execution: verify-style}]
[INFO] Unable to perform checkstyle:check, unable to find checkstyle:checkstyle outputFile.
[INFO] [install:install {execution: default-install}]
[INFO] Installing <https://builds.apache.org/job/ExtVal%20for%20JSF%201.2%20(nightly)/ws/trunk/examples/pom.xml>
to /home/jenkins/.m2/repository/org/apache/myfaces/extensions/validator/examples/examples-project/1.2.5-SNAPSHOT/examples-project-1.2.5-SNAPSHOT.pom
[INFO] ------------------------------------------------------------------------
[INFO] Building MyFaces Extensions-Validator examples hello world
[INFO]    task-segment: [clean, install]
[INFO] ------------------------------------------------------------------------
[INFO] [clean:clean {execution: default-clean}]
Downloading: http://repository.jboss.com/maven2/jstl/jstl/1.2/jstl-1.2.pom
[WARNING] Unable to get resource 'jstl:jstl:pom:1.2' from repository jboss (http://repository.jboss.com/maven2):
Authorization failed: Access denied to: http://repository.jboss.com/maven2/jstl/jstl/1.2/jstl-1.2.pom
Downloading: http://download.java.net/maven/2//jstl/jstl/1.2/jstl-1.2.pom
[INFO] Unable to find resource 'jstl:jstl:pom:1.2' in repository maven2-repository.dev.java.net
(http://download.java.net/maven/2/)
Downloading: http://repo1.maven.org/maven2/jstl/jstl/1.2/jstl-1.2.pom
[INFO] Unable to find resource 'jstl:jstl:pom:1.2' in repository central (http://repo1.maven.org/maven2)
Downloading: http://repository.jboss.com/maven2/jstl/jstl/1.2/jstl-1.2.jar
[WARNING] Unable to get resource 'jstl:jstl:jar:1.2' from repository jboss (http://repository.jboss.com/maven2):
Authorization failed: Access denied to: http://repository.jboss.com/maven2/jstl/jstl/1.2/jstl-1.2.jar
Downloading: http://download.java.net/maven/2//jstl/jstl/1.2/jstl-1.2.jar
[INFO] Unable to find resource 'jstl:jstl:jar:1.2' in repository maven2-repository.dev.java.net
(http://download.java.net/maven/2/)
Downloading: http://repo1.maven.org/maven2/jstl/jstl/1.2/jstl-1.2.jar
[INFO] Unable to find resource 'jstl:jstl:jar:1.2' in repository central (http://repo1.maven.org/maven2)
[JENKINS] Archiving <https://builds.apache.org/job/ExtVal%20for%20JSF%201.2%20(nightly)/ws/trunk/examples/hello_world/pom.xml>
to /home/hudson/hudson/jobs/ExtVal for JSF 1.2 (nightly)/modules/org.apache.myfaces.extensions.validator.examples$examples-hello_world/builds/2011-08-14_00-04-11/archive/org.apache.myfaces.extensions.validator.examples/examples-hello_world/1.2.5-SNAPSHOT/examples-hello_world-1.2.5-SNAPSHOT.pom
[INFO] ------------------------------------------------------------------------
[ERROR] BUILD ERROR
[INFO] ------------------------------------------------------------------------
[INFO] Failed to resolve artifact.

Missing:
----------
1) jstl:jstl:jar:1.2

  Try downloading the file manually from the project website.

  Then, install it using the command: 
      mvn install:install-file -DgroupId=jstl -DartifactId=jstl -Dversion=1.2 -Dpackaging=jar
-Dfile=/path/to/file

  Alternatively, if you host your own repository you can deploy the file there: 
      mvn deploy:deploy-file -DgroupId=jstl -DartifactId=jstl -Dversion=1.2 -Dpackaging=jar
-Dfile=/path/to/file -Durl=[url] -DrepositoryId=[id]

  Path to dependency: 
  	1) org.apache.myfaces.extensions.validator.examples:examples-hello_world:war:1.2.5-SNAPSHOT
  	2) jstl:jstl:jar:1.2

----------
1 required artifact is missing.

for artifact: 
  org.apache.myfaces.extensions.validator.examples:examples-hello_world:war:1.2.5-SNAPSHOT

from the specified remote repositories:
  central (http://repo1.maven.org/maven2),
  jboss (http://repository.jboss.com/maven2),
  maven2-repository.dev.java.net (http://download.java.net/maven/2/),
  Nexus (http://repository.apache.org/snapshots)



[INFO] ------------------------------------------------------------------------
[INFO] For more information, run Maven with the -e switch
[INFO] ------------------------------------------------------------------------
[INFO] Total time: 2 minutes 12 seconds
[INFO] Finished at: Sun Aug 14 00:06:52 UTC 2011
[INFO] Final Memory: 55M/190M
[INFO] ------------------------------------------------------------------------
channel stopped


Mime
View raw message