myfaces-commits mailing list archives

Site index · List index
Message view « Date » · « Thread »
Top « Date » · « Thread »
From Apache Jenkins Server <jenk...@builds.apache.org>
Subject Build failed in Jenkins: ExtVal for JSF 1.2 (deploy) #30
Date Sun, 04 Sep 2011 00:05:35 GMT
See <https://builds.apache.org/job/ExtVal%20for%20JSF%201.2%20(deploy)/30/>

------------------------------------------
[...truncated 912 lines...]

Results :

Tests run: 0, Failures: 0, Errors: 0, Skipped: 0

[JENKINS] Recording test results
[INFO] [war:war {execution: default-war}]
[INFO] Packaging webapp
[INFO] Assembling webapp[examples-hello_bean-validation] in [<https://builds.apache.org/job/ExtVal%20for%20JSF%201.2%20(deploy)/ws/trunk/examples/hello_bean-validation/target/examples-hello_bean-validation-1.2.5-SNAPSHOT]>
[INFO] Processing war project
[INFO] Copying webapp resources[<https://builds.apache.org/job/ExtVal%20for%20JSF%201.2%20(deploy)/ws/trunk/examples/hello_bean-validation/src/main/webapp]>
[INFO] Webapp assembled in[315 msecs]
[INFO] Building war: <https://builds.apache.org/job/ExtVal%20for%20JSF%201.2%20(deploy)/ws/trunk/examples/hello_bean-validation/target/examples-hello_bean-validation-1.2.5-SNAPSHOT.war>
[INFO] Preparing source:jar
[WARNING] Removing: jar from forked lifecycle, to prevent recursive invocation.
[JENKINS] Archiving <https://builds.apache.org/job/ExtVal%20for%20JSF%201.2%20(deploy)/ws/trunk/examples/hello_bean-validation/pom.xml>
to /home/hudson/hudson/jobs/ExtVal for JSF 1.2 (deploy)/modules/org.apache.myfaces.extensions.validator.examples$examples-hello_bean-validation/builds/2011-09-04_00-01-18/archive/org.apache.myfaces.extensions.validator.examples/examples-hello_bean-validation/1.2.5-SNAPSHOT/examples-hello_bean-validation-1.2.5-SNAPSHOT.pom
[JENKINS] Archiving <https://builds.apache.org/job/ExtVal%20for%20JSF%201.2%20(deploy)/ws/trunk/examples/hello_bean-validation/target/examples-hello_bean-validation-1.2.5-SNAPSHOT.war>
to /home/hudson/hudson/jobs/ExtVal for JSF 1.2 (deploy)/modules/org.apache.myfaces.extensions.validator.examples$examples-hello_bean-validation/builds/2011-09-04_00-01-18/archive/org.apache.myfaces.extensions.validator.examples/examples-hello_bean-validation/1.2.5-SNAPSHOT/examples-hello_bean-validation-1.2.5-SNAPSHOT.war
[INFO] [antrun:run {execution: javadoc.resources}]
[INFO] Executing tasks
[INFO] Executed tasks
[INFO] [source:jar {execution: attach-sources}]
[INFO] META-INF already added, skipping
[INFO] META-INF/LICENSE already added, skipping
[INFO] META-INF/NOTICE already added, skipping
[INFO] META-INF/DEPENDENCIES already added, skipping
[INFO] Building jar: <https://builds.apache.org/job/ExtVal%20for%20JSF%201.2%20(deploy)/ws/trunk/examples/hello_bean-validation/target/examples-hello_bean-validation-1.2.5-SNAPSHOT-sources.jar>
[INFO] META-INF already added, skipping
[INFO] META-INF/LICENSE already added, skipping
[INFO] META-INF/NOTICE already added, skipping
[INFO] META-INF/DEPENDENCIES already added, skipping
[INFO] Preparing checkstyle:check
[JENKINS] Archiving <https://builds.apache.org/job/ExtVal%20for%20JSF%201.2%20(deploy)/ws/trunk/examples/hello_bean-validation/target/examples-hello_bean-validation-1.2.5-SNAPSHOT-sources.jar>
to /home/hudson/hudson/jobs/ExtVal for JSF 1.2 (deploy)/modules/org.apache.myfaces.extensions.validator.examples$examples-hello_bean-validation/builds/2011-09-04_00-01-18/archive/org.apache.myfaces.extensions.validator.examples/examples-hello_bean-validation/1.2.5-SNAPSHOT/examples-hello_bean-validation-1.2.5-SNAPSHOT-sources.jar
[INFO] [checkstyle:checkstyle {execution: checkstyle}]
[INFO] [checkstyle:check {execution: verify-style}]
[INFO] [install:install {execution: default-install}]
[INFO] Installing <https://builds.apache.org/job/ExtVal%20for%20JSF%201.2%20(deploy)/ws/trunk/examples/hello_bean-validation/target/examples-hello_bean-validation-1.2.5-SNAPSHOT.war>
to /export/home/hudson/.m2/repository/org/apache/myfaces/extensions/validator/examples/examples-hello_bean-validation/1.2.5-SNAPSHOT/examples-hello_bean-validation-1.2.5-SNAPSHOT.war
[INFO] Installing <https://builds.apache.org/job/ExtVal%20for%20JSF%201.2%20(deploy)/ws/trunk/examples/hello_bean-validation/target/examples-hello_bean-validation-1.2.5-SNAPSHOT-sources.jar>
to /export/home/hudson/.m2/repository/org/apache/myfaces/extensions/validator/examples/examples-hello_bean-validation/1.2.5-SNAPSHOT/examples-hello_bean-validation-1.2.5-SNAPSHOT-sources.jar
[INFO] ------------------------------------------------------------------------
[INFO] Building MyFaces Extensions-Validator examples feature-set 01
[INFO]    task-segment: [clean, install]
[INFO] ------------------------------------------------------------------------
[INFO] [clean:clean {execution: default-clean}]
[INFO] Deleting file set: <https://builds.apache.org/job/ExtVal%20for%20JSF%201.2%20(deploy)/ws/trunk/examples/feature-set_01/target>
(included: [**], excluded: [])
[INFO] [antrun:run {execution: javadoc.resources}]
[INFO] Executing tasks
[INFO] Executed tasks
[INFO] [remote-resources:process {execution: default}]
[INFO] [resources:resources {execution: default-resources}]
[INFO] Using 'UTF-8' encoding to copy filtered resources.
[INFO] Copying 0 resource to META-INF
[INFO] skip non existing resourceDirectory <https://builds.apache.org/job/ExtVal%20for%20JSF%201.2%20(deploy)/ws/trunk/examples/feature-set_01/src/main/resources>
[INFO] Copying 3 resources
[INFO] [compiler:compile {execution: default-compile}]
[INFO] Compiling 2 source files to <https://builds.apache.org/job/ExtVal%20for%20JSF%201.2%20(deploy)/ws/trunk/examples/feature-set_01/target/classes>
[INFO] [resources:testResources {execution: default-testResources}]
[INFO] Using 'UTF-8' encoding to copy filtered resources.
[INFO] skip non existing resourceDirectory <https://builds.apache.org/job/ExtVal%20for%20JSF%201.2%20(deploy)/ws/trunk/examples/feature-set_01/src/test/resources>
[INFO] Copying 3 resources
[INFO] [compiler:testCompile {execution: default-testCompile}]
[INFO] No sources to compile
[INFO] [surefire:test {execution: default-test}]
[INFO] Surefire report directory: <https://builds.apache.org/job/ExtVal%20for%20JSF%201.2%20(deploy)/ws/trunk/examples/feature-set_01/target/surefire-reports>

-------------------------------------------------------
 T E S T S
-------------------------------------------------------
There are no tests to run.

Results :

Tests run: 0, Failures: 0, Errors: 0, Skipped: 0

[JENKINS] Recording test results
[INFO] [war:war {execution: default-war}]
[INFO] Packaging webapp
[INFO] Assembling webapp[examples-feature-set_01] in [<https://builds.apache.org/job/ExtVal%20for%20JSF%201.2%20(deploy)/ws/trunk/examples/feature-set_01/target/examples-feature-set_01-1.2.5-SNAPSHOT]>
[INFO] Processing war project
[INFO] Copying webapp resources[<https://builds.apache.org/job/ExtVal%20for%20JSF%201.2%20(deploy)/ws/trunk/examples/feature-set_01/src/main/webapp]>
[INFO] Webapp assembled in[702 msecs]
[INFO] Building war: <https://builds.apache.org/job/ExtVal%20for%20JSF%201.2%20(deploy)/ws/trunk/examples/feature-set_01/target/examples-feature-set_01-1.2.5-SNAPSHOT.war>
[INFO] Preparing source:jar
[WARNING] Removing: jar from forked lifecycle, to prevent recursive invocation.
[JENKINS] Archiving <https://builds.apache.org/job/ExtVal%20for%20JSF%201.2%20(deploy)/ws/trunk/examples/feature-set_01/pom.xml>
to /home/hudson/hudson/jobs/ExtVal for JSF 1.2 (deploy)/modules/org.apache.myfaces.extensions.validator.examples$examples-feature-set_01/builds/2011-09-04_00-01-18/archive/org.apache.myfaces.extensions.validator.examples/examples-feature-set_01/1.2.5-SNAPSHOT/examples-feature-set_01-1.2.5-SNAPSHOT.pom
[JENKINS] Archiving <https://builds.apache.org/job/ExtVal%20for%20JSF%201.2%20(deploy)/ws/trunk/examples/feature-set_01/target/examples-feature-set_01-1.2.5-SNAPSHOT.war>
to /home/hudson/hudson/jobs/ExtVal for JSF 1.2 (deploy)/modules/org.apache.myfaces.extensions.validator.examples$examples-feature-set_01/builds/2011-09-04_00-01-18/archive/org.apache.myfaces.extensions.validator.examples/examples-feature-set_01/1.2.5-SNAPSHOT/examples-feature-set_01-1.2.5-SNAPSHOT.war
[INFO] [antrun:run {execution: javadoc.resources}]
[INFO] Executing tasks
[INFO] Executed tasks
[INFO] [source:jar {execution: attach-sources}]
[INFO] META-INF already added, skipping
[INFO] META-INF/NOTICE already added, skipping
[INFO] META-INF/DEPENDENCIES already added, skipping
[INFO] META-INF/LICENSE already added, skipping
[INFO] Building jar: <https://builds.apache.org/job/ExtVal%20for%20JSF%201.2%20(deploy)/ws/trunk/examples/feature-set_01/target/examples-feature-set_01-1.2.5-SNAPSHOT-sources.jar>
[INFO] META-INF already added, skipping
[INFO] META-INF/NOTICE already added, skipping
[INFO] META-INF/DEPENDENCIES already added, skipping
[INFO] META-INF/LICENSE already added, skipping
[INFO] Preparing checkstyle:check
[JENKINS] Archiving <https://builds.apache.org/job/ExtVal%20for%20JSF%201.2%20(deploy)/ws/trunk/examples/feature-set_01/target/examples-feature-set_01-1.2.5-SNAPSHOT-sources.jar>
to /home/hudson/hudson/jobs/ExtVal for JSF 1.2 (deploy)/modules/org.apache.myfaces.extensions.validator.examples$examples-feature-set_01/builds/2011-09-04_00-01-18/archive/org.apache.myfaces.extensions.validator.examples/examples-feature-set_01/1.2.5-SNAPSHOT/examples-feature-set_01-1.2.5-SNAPSHOT-sources.jar
[INFO] [checkstyle:checkstyle {execution: checkstyle}]
[INFO] [checkstyle:check {execution: verify-style}]
[INFO] [install:install {execution: default-install}]
[INFO] Installing <https://builds.apache.org/job/ExtVal%20for%20JSF%201.2%20(deploy)/ws/trunk/examples/feature-set_01/target/examples-feature-set_01-1.2.5-SNAPSHOT.war>
to /export/home/hudson/.m2/repository/org/apache/myfaces/extensions/validator/examples/examples-feature-set_01/1.2.5-SNAPSHOT/examples-feature-set_01-1.2.5-SNAPSHOT.war
[INFO] Installing <https://builds.apache.org/job/ExtVal%20for%20JSF%201.2%20(deploy)/ws/trunk/examples/feature-set_01/target/examples-feature-set_01-1.2.5-SNAPSHOT-sources.jar>
to /export/home/hudson/.m2/repository/org/apache/myfaces/extensions/validator/examples/examples-feature-set_01/1.2.5-SNAPSHOT/examples-feature-set_01-1.2.5-SNAPSHOT-sources.jar
[INFO] ------------------------------------------------------------------------
[INFO] Building MyFaces Extensions-Validator examples feature-set 02
[INFO]    task-segment: [clean, install]
[INFO] ------------------------------------------------------------------------
[INFO] [clean:clean {execution: default-clean}]
[INFO] Deleting file set: <https://builds.apache.org/job/ExtVal%20for%20JSF%201.2%20(deploy)/ws/trunk/examples/feature-set_02/target>
(included: [**], excluded: [])
[INFO] [antrun:run {execution: javadoc.resources}]
[INFO] Executing tasks
[INFO] Executed tasks
[INFO] [remote-resources:process {execution: default}]
[INFO] [resources:resources {execution: default-resources}]
[INFO] Using 'UTF-8' encoding to copy filtered resources.
[INFO] Copying 0 resource to META-INF
[INFO] skip non existing resourceDirectory <https://builds.apache.org/job/ExtVal%20for%20JSF%201.2%20(deploy)/ws/trunk/examples/feature-set_02/src/main/resources>
[INFO] Copying 3 resources
[INFO] [compiler:compile {execution: default-compile}]
[INFO] Compiling 4 source files to <https://builds.apache.org/job/ExtVal%20for%20JSF%201.2%20(deploy)/ws/trunk/examples/feature-set_02/target/classes>
[INFO] [resources:testResources {execution: default-testResources}]
[INFO] Using 'UTF-8' encoding to copy filtered resources.
[INFO] skip non existing resourceDirectory <https://builds.apache.org/job/ExtVal%20for%20JSF%201.2%20(deploy)/ws/trunk/examples/feature-set_02/src/test/resources>
[INFO] Copying 3 resources
[INFO] [compiler:testCompile {execution: default-testCompile}]
[INFO] No sources to compile
[INFO] [surefire:test {execution: default-test}]
[INFO] Surefire report directory: <https://builds.apache.org/job/ExtVal%20for%20JSF%201.2%20(deploy)/ws/trunk/examples/feature-set_02/target/surefire-reports>

-------------------------------------------------------
 T E S T S
-------------------------------------------------------
There are no tests to run.

Results :

Tests run: 0, Failures: 0, Errors: 0, Skipped: 0

[JENKINS] Recording test results
[INFO] [war:war {execution: default-war}]
[INFO] Packaging webapp
[INFO] Assembling webapp[examples-feature-set_02] in [<https://builds.apache.org/job/ExtVal%20for%20JSF%201.2%20(deploy)/ws/trunk/examples/feature-set_02/target/examples-feature-set_02-1.2.5-SNAPSHOT]>
[INFO] Processing war project
[INFO] Copying webapp resources[<https://builds.apache.org/job/ExtVal%20for%20JSF%201.2%20(deploy)/ws/trunk/examples/feature-set_02/src/main/webapp]>
[INFO] Webapp assembled in[384 msecs]
[INFO] Building war: <https://builds.apache.org/job/ExtVal%20for%20JSF%201.2%20(deploy)/ws/trunk/examples/feature-set_02/target/examples-feature-set_02-1.2.5-SNAPSHOT.war>
[INFO] Preparing source:jar
[WARNING] Removing: jar from forked lifecycle, to prevent recursive invocation.
[JENKINS] Archiving <https://builds.apache.org/job/ExtVal%20for%20JSF%201.2%20(deploy)/ws/trunk/examples/feature-set_02/pom.xml>
to /home/hudson/hudson/jobs/ExtVal for JSF 1.2 (deploy)/modules/org.apache.myfaces.extensions.validator.examples$examples-feature-set_02/builds/2011-09-04_00-01-18/archive/org.apache.myfaces.extensions.validator.examples/examples-feature-set_02/1.2.5-SNAPSHOT/examples-feature-set_02-1.2.5-SNAPSHOT.pom
[JENKINS] Archiving <https://builds.apache.org/job/ExtVal%20for%20JSF%201.2%20(deploy)/ws/trunk/examples/feature-set_02/target/examples-feature-set_02-1.2.5-SNAPSHOT.war>
to /home/hudson/hudson/jobs/ExtVal for JSF 1.2 (deploy)/modules/org.apache.myfaces.extensions.validator.examples$examples-feature-set_02/builds/2011-09-04_00-01-18/archive/org.apache.myfaces.extensions.validator.examples/examples-feature-set_02/1.2.5-SNAPSHOT/examples-feature-set_02-1.2.5-SNAPSHOT.war
[INFO] [antrun:run {execution: javadoc.resources}]
[INFO] Executing tasks
[INFO] Executed tasks
[INFO] [source:jar {execution: attach-sources}]
[INFO] META-INF already added, skipping
[INFO] META-INF/NOTICE already added, skipping
[INFO] META-INF/LICENSE already added, skipping
[INFO] META-INF/DEPENDENCIES already added, skipping
[INFO] Building jar: <https://builds.apache.org/job/ExtVal%20for%20JSF%201.2%20(deploy)/ws/trunk/examples/feature-set_02/target/examples-feature-set_02-1.2.5-SNAPSHOT-sources.jar>
[INFO] META-INF already added, skipping
[INFO] META-INF/NOTICE already added, skipping
[INFO] META-INF/LICENSE already added, skipping
[INFO] META-INF/DEPENDENCIES already added, skipping
[INFO] Preparing checkstyle:check
[JENKINS] Archiving <https://builds.apache.org/job/ExtVal%20for%20JSF%201.2%20(deploy)/ws/trunk/examples/feature-set_02/target/examples-feature-set_02-1.2.5-SNAPSHOT-sources.jar>
to /home/hudson/hudson/jobs/ExtVal for JSF 1.2 (deploy)/modules/org.apache.myfaces.extensions.validator.examples$examples-feature-set_02/builds/2011-09-04_00-01-18/archive/org.apache.myfaces.extensions.validator.examples/examples-feature-set_02/1.2.5-SNAPSHOT/examples-feature-set_02-1.2.5-SNAPSHOT-sources.jar
[INFO] [checkstyle:checkstyle {execution: checkstyle}]
[INFO] [checkstyle:check {execution: verify-style}]
[INFO] [install:install {execution: default-install}]
[INFO] Installing <https://builds.apache.org/job/ExtVal%20for%20JSF%201.2%20(deploy)/ws/trunk/examples/feature-set_02/target/examples-feature-set_02-1.2.5-SNAPSHOT.war>
to /export/home/hudson/.m2/repository/org/apache/myfaces/extensions/validator/examples/examples-feature-set_02/1.2.5-SNAPSHOT/examples-feature-set_02-1.2.5-SNAPSHOT.war
[INFO] Installing <https://builds.apache.org/job/ExtVal%20for%20JSF%201.2%20(deploy)/ws/trunk/examples/feature-set_02/target/examples-feature-set_02-1.2.5-SNAPSHOT-sources.jar>
to /export/home/hudson/.m2/repository/org/apache/myfaces/extensions/validator/examples/examples-feature-set_02/1.2.5-SNAPSHOT/examples-feature-set_02-1.2.5-SNAPSHOT-sources.jar
[INFO] 
[INFO] 
[INFO] ------------------------------------------------------------------------
[INFO] Reactor Summary:
[INFO] ------------------------------------------------------------------------
[INFO] Apache MyFaces Extensions-Validator Module ............ SUCCESS [15.630s]
[INFO] MyFaces Extensions-Validator Core ..................... SUCCESS [41.889s]
[INFO] MyFaces Extensions-Validator Validation-Modules ....... SUCCESS [0.673s]
[INFO] MyFaces Extensions-Validator Property-Validation-Module  SUCCESS [23.853s]
[INFO] MyFaces Extensions-Validator Bean-Validation-Integration-Module (JSR 303)  SUCCESS
[14.030s]
[INFO] MyFaces Extensions-Validator Component-Support Modules  SUCCESS [0.913s]
[INFO] MyFaces Extensions-Validator Trinidad Support Module .. SUCCESS [11.392s]
[INFO] MyFaces Extensions-Validator Generic Support Module ... SUCCESS [7.591s]
[INFO] MyFaces Extensions-Validator Test-Modules ............. SUCCESS [1.060s]
[INFO] MyFaces Extensions-Validator Base-Test-Infrastructure . SUCCESS [4.391s]
[INFO] MyFaces Extensions-Validator Core-Tests ............... SUCCESS [11.401s]
[INFO] MyFaces Extensions-Validator Property-Validation-Tests  SUCCESS [11.494s]
[INFO] MyFaces Extensions-Validator Bean-Validation-Integration-Tests  SUCCESS [7.280s]
[INFO] MyFaces Extensions-Validator Trinidad Component-Support-Tests  SUCCESS [4.073s]
[INFO] MyFaces Extensions-Validator examples project ......... SUCCESS [0.631s]
[INFO] MyFaces Extensions-Validator examples hello world ..... SUCCESS [12.479s]
[INFO] MyFaces Extensions-Validator examples hello bean-validation  SUCCESS [13.963s]
[INFO] MyFaces Extensions-Validator examples feature-set 01 .. SUCCESS [25.007s]
[INFO] MyFaces Extensions-Validator examples feature-set 02 .. SUCCESS [20.592s]
[INFO] ------------------------------------------------------------------------
[INFO] ------------------------------------------------------------------------
[INFO] BUILD SUCCESSFUL
[INFO] ------------------------------------------------------------------------
[INFO] Total time: 3 minutes 58 seconds
[INFO] Finished at: Sat Sep 03 20:05:28 EDT 2011
[INFO] Final Memory: 57M/181M
[INFO] ------------------------------------------------------------------------
channel stopped
Maven RedeployPublished use remote solaris2 maven settings from : /export/home/hudson/.m2/settings.xml
[INFO] Deployment in https://repository.apache.org/content/repositories/snapshots (id=apache.snapshots.https,uniqueVersion=false)
Deploying the main artifact myfaces-extval-core-1.2.5-SNAPSHOT.jar
Deploying the main artifact myfaces-extval-core-1.2.5-SNAPSHOT-sources.jar
[INFO] Deployment in https://repository.apache.org/content/repositories/snapshots (id=apache.snapshots.https,uniqueVersion=false)
Deploying the main artifact myfaces-extval-module-1.2.5-SNAPSHOT.pom
Deploying the main artifact myfaces-extval-module-1.2.5-SNAPSHOT-site.xml
[INFO] Deployment in https://repository.apache.org/content/repositories/snapshots (id=apache.snapshots.https,uniqueVersion=false)
Deploying the main artifact component-support-modules-project-1.2.5-SNAPSHOT.pom
[INFO] Deployment in https://repository.apache.org/content/repositories/snapshots (id=apache.snapshots.https,uniqueVersion=false)
Deploying the main artifact myfaces-extval-generic-support-1.2.5-SNAPSHOT.jar
Deploying the main artifact myfaces-extval-generic-support-1.2.5-SNAPSHOT-sources.jar
[INFO] Deployment in https://repository.apache.org/content/repositories/snapshots (id=apache.snapshots.https,uniqueVersion=false)
Deploying the main artifact myfaces-extval-trinidad-support-1.2.5-SNAPSHOT.jar
Deploying the main artifact myfaces-extval-trinidad-support-1.2.5-SNAPSHOT-sources.jar
ERROR: Error installing artifact's metadata: repository metadata for: 'snapshot org.apache.myfaces.extensions.validator.component-support-modules:myfaces-extval-trinidad-support:1.2.5-SNAPSHOT'
could not be retrieved from repository: apache.snapshots.https due to an error: Error copying
temporary file to the final destination: File /home/hudson/.m2/repository/org/apache/myfaces/extensions/validator/component-support-modules/myfaces-extval-trinidad-support/1.2.5-SNAPSHOT/maven-metadata-apache.snapshots.https.xml.tmp
does not exist
org.apache.maven.artifact.deployer.ArtifactDeploymentException: Error installing artifact's
metadata: repository metadata for: 'snapshot org.apache.myfaces.extensions.validator.component-support-modules:myfaces-extval-trinidad-support:1.2.5-SNAPSHOT'
could not be retrieved from repository: apache.snapshots.https due to an error: Error copying
temporary file to the final destination: File /home/hudson/.m2/repository/org/apache/myfaces/extensions/validator/component-support-modules/myfaces-extval-trinidad-support/1.2.5-SNAPSHOT/maven-metadata-apache.snapshots.https.xml.tmp
does not exist
	at hudson.maven.artifact.deployer.DefaultArtifactDeployer.deploy(DefaultArtifactDeployer.java:183)
	at hudson.maven.reporters.MavenArtifactRecord.deploy(MavenArtifactRecord.java:194)
	at hudson.maven.RedeployPublisher.perform(RedeployPublisher.java:152)
	at hudson.tasks.BuildStepMonitor$1.perform(BuildStepMonitor.java:19)
	at hudson.model.AbstractBuild$AbstractRunner.perform(AbstractBuild.java:682)
	at hudson.model.AbstractBuild$AbstractRunner.performAllBuildSteps(AbstractBuild.java:657)
	at hudson.maven.MavenModuleSetBuild$RunnerImpl.post2(MavenModuleSetBuild.java:958)
	at hudson.model.AbstractBuild$AbstractRunner.post(AbstractBuild.java:604)
	at hudson.model.Run.run(Run.java:1401)
	at hudson.maven.MavenModuleSetBuild.run(MavenModuleSetBuild.java:479)
	at hudson.model.ResourceController.execute(ResourceController.java:88)
	at hudson.model.Executor.run(Executor.java:230)
Caused by: org.apache.maven.artifact.repository.metadata.RepositoryMetadataDeploymentException:
repository metadata for: 'snapshot org.apache.myfaces.extensions.validator.component-support-modules:myfaces-extval-trinidad-support:1.2.5-SNAPSHOT'
could not be retrieved from repository: apache.snapshots.https due to an error: Error copying
temporary file to the final destination: File /home/hudson/.m2/repository/org/apache/myfaces/extensions/validator/component-support-modules/myfaces-extval-trinidad-support/1.2.5-SNAPSHOT/maven-metadata-apache.snapshots.https.xml.tmp
does not exist
	at org.apache.maven.artifact.repository.metadata.DefaultRepositoryMetadataManager.deploy(DefaultRepositoryMetadataManager.java:459)
	at hudson.maven.artifact.deployer.DefaultArtifactDeployer.deploy(DefaultArtifactDeployer.java:167)
	... 11 more
Caused by: org.apache.maven.wagon.TransferFailedException: Error copying temporary file to
the final destination: File /home/hudson/.m2/repository/org/apache/myfaces/extensions/validator/component-support-modules/myfaces-extval-trinidad-support/1.2.5-SNAPSHOT/maven-metadata-apache.snapshots.https.xml.tmp
does not exist
	at org.apache.maven.repository.legacy.DefaultWagonManager.getRemoteFile(DefaultWagonManager.java:480)
	at org.apache.maven.repository.legacy.DefaultWagonManager.getArtifactMetadataFromDeploymentRepository(DefaultWagonManager.java:215)
	at org.apache.maven.artifact.repository.metadata.DefaultRepositoryMetadataManager.getArtifactMetadataFromDeploymentRepository(DefaultRepositoryMetadataManager.java:424)
	at org.apache.maven.artifact.repository.metadata.DefaultRepositoryMetadataManager.deploy(DefaultRepositoryMetadataManager.java:455)
	... 12 more
Caused by: java.io.IOException: File /home/hudson/.m2/repository/org/apache/myfaces/extensions/validator/component-support-modules/myfaces-extval-trinidad-support/1.2.5-SNAPSHOT/maven-metadata-apache.snapshots.https.xml.tmp
does not exist
	at org.codehaus.plexus.util.FileUtils.copyFile(FileUtils.java:1038)
	at org.apache.maven.repository.legacy.DefaultWagonManager.getRemoteFile(DefaultWagonManager.java:474)
	... 15 more
[INFO] Deployment failed after 4.9 sec
Build step 'Deploy artifacts to Maven repository' changed build result to FAILURE


Mime
View raw message