myfaces-commits mailing list archives

Site index · List index
Message view « Date » · « Thread »
Top « Date » · « Thread »
From Apache Jenkins Server <jenk...@builds.apache.org>
Subject Build failed in Jenkins: ExtVal for JSF 2.0 (nightly) #106
Date Sun, 01 Jan 2012 00:02:40 GMT
See <https://builds.apache.org/job/ExtVal%20for%20JSF%202.0%20(nightly)/106/>

------------------------------------------
[...truncated 1069 lines...]
A         examples/feature-set_02/src/main/webapp/layout/template.xhtml
A         examples/feature-set_02/pom.xml
A         examples/hello_world
A         examples/hello_world/src
A         examples/hello_world/src/main
A         examples/hello_world/src/main/java
A         examples/hello_world/src/main/java/org
A         examples/hello_world/src/main/java/org/apache
A         examples/hello_world/src/main/java/org/apache/myfaces
A         examples/hello_world/src/main/java/org/apache/myfaces/blank
A         examples/hello_world/src/main/java/org/apache/myfaces/blank/HelloWorldController.java
A         examples/hello_world/src/main/java/org/apache/myfaces/blank/domain
A         examples/hello_world/src/main/java/org/apache/myfaces/blank/domain/Person.java
A         examples/hello_world/src/main/webapp
A         examples/hello_world/src/main/webapp/pages
A         examples/hello_world/src/main/webapp/pages/helloWorld.xhtml
A         examples/hello_world/src/main/webapp/pages/page2.xhtml
A         examples/hello_world/src/main/webapp/index.jsp
A         examples/hello_world/src/main/webapp/WEB-INF
A         examples/hello_world/src/main/webapp/WEB-INF/faces-config.xml
A         examples/hello_world/src/main/webapp/WEB-INF/web.xml
A         examples/hello_world/src/main/webapp/layout
A         examples/hello_world/src/main/webapp/layout/template.xhtml
A         examples/hello_world/pom.xml
A         examples/pom.xml
 U        .
At revision 1226201
no change for https://svn.apache.org/repos/asf/myfaces/extensions/validator/branches/branch_for_jsf_2_0
since the previous build
Parsing POMs
Modules changed, recalculating dependency graph
[branch_for_jsf_2_0] $ /home/hudson/tools/java/latest1.6/bin/java -cp /home/jenkins/jenkins-slave/maven3-agent.jar:/home/hudson/tools/maven/latest/boot/plexus-classworlds-2.4.jar
org.jvnet.hudson.maven3.agent.Maven3Main /home/hudson/tools/maven/latest /x1/jenkins/jenkins-slave/slave.jar
/home/jenkins/jenkins-slave/maven3-interceptor.jar 44541
<===[JENKINS REMOTING CAPACITY]===>   channel started
Executing Maven:  -B -f <https://builds.apache.org/job/ExtVal%20for%20JSF%202.0%20(nightly)/ws/branch_for_jsf_2_0/pom.xml>
clean install -Djdk=16
[INFO] Scanning for projects...
[WARNING] 
[WARNING] Some problems were encountered while building the effective model for org.apache.myfaces.extensions.validator:myfaces-extval-core:jar:2.0.6-SNAPSHOT
[WARNING] 'reporting.plugins.plugin.version' for org.apache.maven.plugins:maven-javadoc-plugin
is missing. @ org.apache.myfaces.extensions.validator:myfaces-extval-module:2.0.6-SNAPSHOT,
<https://builds.apache.org/job/ExtVal%20for%20JSF%202.0%20(nightly)/ws/branch_for_jsf_2_0/pom.xml,>
line 254, column 21
[WARNING] 
[WARNING] Some problems were encountered while building the effective model for org.apache.myfaces.extensions.validator.validation-modules:myfaces-extval-property-validation:jar:2.0.6-SNAPSHOT
[WARNING] 'reporting.plugins.plugin.version' for org.apache.maven.plugins:maven-javadoc-plugin
is missing. @ org.apache.myfaces.extensions.validator:myfaces-extval-module:2.0.6-SNAPSHOT,
<https://builds.apache.org/job/ExtVal%20for%20JSF%202.0%20(nightly)/ws/branch_for_jsf_2_0/pom.xml,>
line 254, column 21
[WARNING] 
[WARNING] Some problems were encountered while building the effective model for org.apache.myfaces.extensions.validator.validation-modules:myfaces-extval-bean-validation:jar:2.0.6-SNAPSHOT
[WARNING] 'reporting.plugins.plugin.version' for org.apache.maven.plugins:maven-javadoc-plugin
is missing. @ org.apache.myfaces.extensions.validator:myfaces-extval-module:2.0.6-SNAPSHOT,
<https://builds.apache.org/job/ExtVal%20for%20JSF%202.0%20(nightly)/ws/branch_for_jsf_2_0/pom.xml,>
line 254, column 21
[WARNING] 
[WARNING] Some problems were encountered while building the effective model for org.apache.myfaces.extensions.validator.validation-modules:validation-modules-project:pom:2.0.6-SNAPSHOT
[WARNING] 'reporting.plugins.plugin.version' for org.apache.maven.plugins:maven-javadoc-plugin
is missing. @ org.apache.myfaces.extensions.validator:myfaces-extval-module:2.0.6-SNAPSHOT,
<https://builds.apache.org/job/ExtVal%20for%20JSF%202.0%20(nightly)/ws/branch_for_jsf_2_0/pom.xml,>
line 254, column 21
[WARNING] 
[WARNING] Some problems were encountered while building the effective model for org.apache.myfaces.extensions.validator.component-support-modules:myfaces-extval-trinidad-support:jar:2.0.6-SNAPSHOT
[WARNING] 'reporting.plugins.plugin.version' for org.apache.maven.plugins:maven-javadoc-plugin
is missing. @ org.apache.myfaces.extensions.validator:myfaces-extval-module:2.0.6-SNAPSHOT,
<https://builds.apache.org/job/ExtVal%20for%20JSF%202.0%20(nightly)/ws/branch_for_jsf_2_0/pom.xml,>
line 254, column 21
[WARNING] 
[WARNING] Some problems were encountered while building the effective model for org.apache.myfaces.extensions.validator.component-support-modules:myfaces-extval-generic-support:jar:2.0.6-SNAPSHOT
[WARNING] 'reporting.plugins.plugin.version' for org.apache.maven.plugins:maven-javadoc-plugin
is missing. @ org.apache.myfaces.extensions.validator:myfaces-extval-module:2.0.6-SNAPSHOT,
<https://builds.apache.org/job/ExtVal%20for%20JSF%202.0%20(nightly)/ws/branch_for_jsf_2_0/pom.xml,>
line 254, column 21
[WARNING] 
[WARNING] Some problems were encountered while building the effective model for org.apache.myfaces.extensions.validator.component-support-modules:component-support-modules-project:pom:2.0.6-SNAPSHOT
[WARNING] 'reporting.plugins.plugin.version' for org.apache.maven.plugins:maven-javadoc-plugin
is missing. @ org.apache.myfaces.extensions.validator:myfaces-extval-module:2.0.6-SNAPSHOT,
<https://builds.apache.org/job/ExtVal%20for%20JSF%202.0%20(nightly)/ws/branch_for_jsf_2_0/pom.xml,>
line 254, column 21
[WARNING] 
[WARNING] Some problems were encountered while building the effective model for org.apache.myfaces.extensions.validator:myfaces-extval-module:pom:2.0.6-SNAPSHOT
[WARNING] 'reporting.plugins.plugin.version' for org.apache.maven.plugins:maven-javadoc-plugin
is missing. @ line 254, column 21
[WARNING] 
[WARNING] It is highly recommended to fix these problems because they threaten the stability
of your build.
[WARNING] 
[WARNING] For this reason, future Maven versions might no longer support building such malformed
projects.
[WARNING] 
[INFO] ------------------------------------------------------------------------
[INFO] Reactor Build Order:
[INFO] 
[INFO] Apache MyFaces Extensions-Validator Module
[INFO] MyFaces Extensions-Validator Core
[INFO] MyFaces Extensions-Validator Validation-Modules
[INFO] MyFaces Extensions-Validator Property-Validation-Module
[INFO] MyFaces Extensions-Validator Bean-Validation-Integration-Module (JSR 303)
[INFO] MyFaces Extensions-Validator Component-Support Modules
[INFO] MyFaces Extensions-Validator Trinidad Support Module
[INFO] MyFaces Extensions-Validator Generic Support Module
[INFO]                                                                         
[INFO] ------------------------------------------------------------------------
[INFO] Building Apache MyFaces Extensions-Validator Module 2.0.6-SNAPSHOT
[INFO] ------------------------------------------------------------------------
[INFO] 
[INFO] --- maven-clean-plugin:2.3:clean (default-clean) @ myfaces-extval-module ---
log4j:WARN No appenders could be found for logger (org.apache.commons.beanutils.converters.BooleanConverter).
log4j:WARN Please initialize the log4j system properly.
[INFO] 
[INFO] --- maven-antrun-plugin:1.3:run (javadoc.resources) @ myfaces-extval-module ---
[INFO] Executing tasks
[INFO] Executed tasks
[INFO] 
[INFO] --- maven-remote-resources-plugin:1.1:process (default) @ myfaces-extval-module ---
[INFO] Setting property: classpath.resource.loader.class => 'org.codehaus.plexus.velocity.ContextClassLoaderResourceLoader'.
[INFO] Setting property: velocimacro.messages.on => 'false'.
[INFO] Setting property: resource.loader => 'classpath'.
[INFO] Setting property: resource.manager.logwhenfound => 'false'.
[INFO] 
[INFO] --- maven-checkstyle-plugin:2.2:checkstyle (checkstyle) @ myfaces-extval-module ---
[INFO] Setting property: classpath.resource.loader.class => 'org.codehaus.plexus.velocity.ContextClassLoaderResourceLoader'.
[INFO] Setting property: velocimacro.messages.on => 'false'.
[INFO] Setting property: resource.loader => 'classpath'.
[INFO] Setting property: resource.manager.logwhenfound => 'false'.
[INFO] ************************************************************** 
[INFO] Starting Jakarta Velocity v1.4
[INFO] RuntimeInstance initializing.
[INFO] Default Properties File: org/apache/velocity/runtime/defaults/velocity.properties
[INFO] Default ResourceManager initializing. (class org.apache.velocity.runtime.resource.ResourceManagerImpl)
[INFO] Resource Loader Instantiated: org.codehaus.plexus.velocity.ContextClassLoaderResourceLoader
[INFO] ClasspathResourceLoader : initialization starting.
[INFO] ClasspathResourceLoader : initialization complete.
[INFO] ResourceCache : initialized. (class org.apache.velocity.runtime.resource.ResourceCacheImpl)
[INFO] Default ResourceManager initialization complete.
[INFO] Loaded System Directive: org.apache.velocity.runtime.directive.Literal
[INFO] Loaded System Directive: org.apache.velocity.runtime.directive.Macro
[INFO] Loaded System Directive: org.apache.velocity.runtime.directive.Parse
[INFO] Loaded System Directive: org.apache.velocity.runtime.directive.Include
[INFO] Loaded System Directive: org.apache.velocity.runtime.directive.Foreach
[INFO] Created: 20 parsers.
[INFO] Velocimacro : initialization starting.
[INFO] Velocimacro : adding VMs from VM library template : VM_global_library.vm
[ERROR] ResourceManager : unable to find resource 'VM_global_library.vm' in any resource loader.
[INFO] Velocimacro : error using  VM library template VM_global_library.vm : org.apache.velocity.exception.ResourceNotFoundException:
Unable to find resource 'VM_global_library.vm'
[INFO] Velocimacro :  VM library template macro registration complete.
[INFO] Velocimacro : allowInline = true : VMs can be defined inline in templates
[INFO] Velocimacro : allowInlineToOverride = false : VMs defined inline may NOT replace previous
VM definitions
[INFO] Velocimacro : allowInlineLocal = false : VMs defined inline will be  global in scope
if allowed.
[INFO] Velocimacro : initialization complete.
[INFO] Velocity successfully started.
[INFO] Source directory does not exist - skipping report.
[JENKINS] Archiving <https://builds.apache.org/job/ExtVal%20for%20JSF%202.0%20(nightly)/ws/branch_for_jsf_2_0/pom.xml>
to /home/hudson/hudson/jobs/ExtVal for JSF 2.0 (nightly)/modules/org.apache.myfaces.extensions.validator$myfaces-extval-module/builds/2012-01-01_00-02-22/archive/org.apache.myfaces.extensions.validator/myfaces-extval-module/2.0.6-SNAPSHOT/myfaces-extval-module-2.0.6-SNAPSHOT.pom
[INFO] [INFO] Unable to perform checkstyle:check, unable to find checkstyle:checkstyle outputFile.

[INFO] --- maven-checkstyle-plugin:2.2:check (verify-style) @ myfaces-extval-module ---
[INFO] 
[INFO] --- maven-install-plugin:2.3:install (default-install) @ myfaces-extval-module ---
[INFO] Installing <https://builds.apache.org/job/ExtVal%20for%20JSF%202.0%20(nightly)/ws/branch_for_jsf_2_0/pom.xml>
to /home/jenkins/.m2/repository/org/apache/myfaces/extensions/validator/myfaces-extval-module/2.0.6-SNAPSHOT/myfaces-extval-module-2.0.6-SNAPSHOT.pom
[INFO]                                                                         
[INFO] ------------------------------------------------------------------------
[INFO] Building MyFaces Extensions-Validator Core 2.0.6-SNAPSHOT
[INFO] ------------------------------------------------------------------------
[INFO] 
[INFO] --- maven-clean-plugin:2.3:clean (default-clean) @ myfaces-extval-core ---
[INFO] [INFO] Executing tasks

[INFO] Executed tasks
[INFO] --- maven-antrun-plugin:1.3:run (javadoc.resources) @ myfaces-extval-core ---
[INFO] 
[INFO] --- maven-remote-resources-plugin:1.1:process (default) @ myfaces-extval-core ---
[INFO] 
[INFO] --- maven-resources-plugin:2.4.3:resources (default-resources) @ myfaces-extval-core
---
[INFO] Using 'UTF-8' encoding to copy filtered resources.
[INFO] Copying 0 resource to META-INF
[INFO] Copying 3 resources
[INFO] Copying 3 resources
[INFO] 
[INFO] --- maven-compiler-plugin:2.3.1:compile (default-compile) @ myfaces-extval-core ---
[INFO] Compiling 210 source files to <https://builds.apache.org/job/ExtVal%20for%20JSF%202.0%20(nightly)/ws/branch_for_jsf_2_0/core/target/classes>
[INFO] [INFO] Using 'UTF-8' encoding to copy filtered resources.
[INFO] skip non existing resourceDirectory <https://builds.apache.org/job/ExtVal%20for%20JSF%202.0%20(nightly)/ws/branch_for_jsf_2_0/core/src/test/resources>
[INFO] Copying 3 resources

[INFO] --- maven-resources-plugin:2.4.3:testResources (default-testResources) @ myfaces-extval-core
---
[INFO] [INFO] No sources to compile

[INFO] --- maven-compiler-plugin:2.3.1:testCompile (default-testCompile) @ myfaces-extval-core
---
[INFO] 
[INFO] --- maven-surefire-plugin:2.5:test (default-test) @ myfaces-extval-core ---
[INFO] Surefire report directory: <https://builds.apache.org/job/ExtVal%20for%20JSF%202.0%20(nightly)/ws/branch_for_jsf_2_0/core/target/surefire-reports>

-------------------------------------------------------
 T E S T S
-------------------------------------------------------
There are no tests to run.

Results :

Tests run: 0, Failures: 0, Errors: 0, Skipped: 0

[JENKINS] Recording test results
[INFO] 
[INFO] --- maven-jar-plugin:2.2:jar (default-jar) @ myfaces-extval-core ---
[INFO] Building jar: <https://builds.apache.org/job/ExtVal%20for%20JSF%202.0%20(nightly)/ws/branch_for_jsf_2_0/core/target/myfaces-extval-core-2.0.6-SNAPSHOT.jar>
[INFO] [INFO] Executing tasks
[INFO] Executed tasks

[INFO] --- maven-antrun-plugin:1.3:run (javadoc.resources) @ myfaces-extval-core ---
[JENKINS] Archiving <https://builds.apache.org/job/ExtVal%20for%20JSF%202.0%20(nightly)/ws/branch_for_jsf_2_0/core/pom.xml>
to /home/hudson/hudson/jobs/ExtVal for JSF 2.0 (nightly)/modules/org.apache.myfaces.extensions.validator$myfaces-extval-core/builds/2012-01-01_00-02-22/archive/org.apache.myfaces.extensions.validator/myfaces-extval-core/2.0.6-SNAPSHOT/myfaces-extval-core-2.0.6-SNAPSHOT.pom
[JENKINS] Archiving <https://builds.apache.org/job/ExtVal%20for%20JSF%202.0%20(nightly)/ws/branch_for_jsf_2_0/core/target/myfaces-extval-core-2.0.6-SNAPSHOT.jar>
to /home/hudson/hudson/jobs/ExtVal for JSF 2.0 (nightly)/modules/org.apache.myfaces.extensions.validator$myfaces-extval-core/builds/2012-01-01_00-02-22/archive/org.apache.myfaces.extensions.validator/myfaces-extval-core/2.0.6-SNAPSHOT/myfaces-extval-core-2.0.6-SNAPSHOT.jar
[INFO] ------------------------------------------------------------------------
[INFO] Reactor Summary:
[INFO] 
[INFO] Apache MyFaces Extensions-Validator Module ........ SUCCESS [8.496s]
[INFO] MyFaces Extensions-Validator Core ................. FAILURE [5.200s]
[INFO] MyFaces Extensions-Validator Validation-Modules ... SKIPPED
[INFO] MyFaces Extensions-Validator Property-Validation-Module  SKIPPED
[INFO] MyFaces Extensions-Validator Bean-Validation-Integration-Module (JSR 303)  SKIPPED
[INFO] MyFaces Extensions-Validator Component-Support Modules  SKIPPED
[INFO] MyFaces Extensions-Validator Trinidad Support Module  SKIPPED
[INFO] MyFaces Extensions-Validator Generic Support Module  SKIPPED
[INFO] ------------------------------------------------------------------------
[INFO] BUILD FAILURE
[INFO] ------------------------------------------------------------------------
[INFO] Total time: 14.419s
[INFO] Finished at: Sun Jan 01 00:02:39 UTC 2012
[INFO] Final Memory: 18M/79M
[INFO] ------------------------------------------------------------------------
mavenExecutionResult exceptions not empty
message : Internal error: java.lang.NullPointerException
cause : null
Stack trace : 
org.apache.maven.InternalErrorException: Internal error: java.lang.NullPointerException
	at org.apache.maven.lifecycle.internal.BuilderCommon.handleBuildError(BuilderCommon.java:128)
	at org.apache.maven.lifecycle.internal.LifecycleModuleBuilder.buildProject(LifecycleModuleBuilder.java:95)
	at org.apache.maven.lifecycle.internal.LifecycleModuleBuilder.buildProject(LifecycleModuleBuilder.java:59)
	at org.apache.maven.lifecycle.internal.LifecycleStarter.singleThreadedBuild(LifecycleStarter.java:183)
	at org.apache.maven.lifecycle.internal.LifecycleStarter.execute(LifecycleStarter.java:161)
	at org.apache.maven.DefaultMaven.doExecute(DefaultMaven.java:319)
	at org.apache.maven.DefaultMaven.execute(DefaultMaven.java:156)
	at org.jvnet.hudson.maven3.launcher.Maven3Launcher.main(Maven3Launcher.java:79)
	at sun.reflect.NativeMethodAccessorImpl.invoke0(Native Method)
	at sun.reflect.NativeMethodAccessorImpl.invoke(NativeMethodAccessorImpl.java:39)
	at sun.reflect.DelegatingMethodAccessorImpl.invoke(DelegatingMethodAccessorImpl.java:25)
	at java.lang.reflect.Method.invoke(Method.java:597)
	at org.codehaus.plexus.classworlds.launcher.Launcher.launchStandard(Launcher.java:329)
	at org.codehaus.plexus.classworlds.launcher.Launcher.launch(Launcher.java:239)
	at org.jvnet.hudson.maven3.agent.Maven3Main.launch(Maven3Main.java:158)
	at hudson.maven.Maven3Builder.call(Maven3Builder.java:112)
	at hudson.maven.Maven3Builder.call(Maven3Builder.java:70)
	at hudson.remoting.UserRequest.perform(UserRequest.java:118)
	at hudson.remoting.UserRequest.perform(UserRequest.java:48)
	at hudson.remoting.Request$2.run(Request.java:287)
	at java.util.concurrent.Executors$RunnableAdapter.call(Executors.java:441)
	at java.util.concurrent.FutureTask$Sync.innerRun(FutureTask.java:303)
	at java.util.concurrent.FutureTask.run(FutureTask.java:138)
	at java.util.concurrent.ThreadPoolExecutor$Worker.runTask(ThreadPoolExecutor.java:886)
	at java.util.concurrent.ThreadPoolExecutor$Worker.run(ThreadPoolExecutor.java:908)
	at java.lang.Thread.run(Thread.java:662)
Caused by: java.lang.NullPointerException
	at hudson.maven.ExecutedMojo.getMojoClass(ExecutedMojo.java:114)
	at hudson.maven.ExecutedMojo.<init>(ExecutedMojo.java:99)
	at hudson.maven.Maven3Builder$MavenExecutionListener.recordExecutionTime(Maven3Builder.java:524)
	at hudson.maven.Maven3Builder$MavenExecutionListener.recordMojoSucceeded(Maven3Builder.java:493)
	at hudson.maven.Maven3Builder$MavenExecutionListener.forkSucceeded(Maven3Builder.java:601)
	at org.apache.maven.lifecycle.internal.DefaultExecutionEventCatapult.fire(DefaultExecutionEventCatapult.java:97)
	at org.apache.maven.lifecycle.internal.DefaultExecutionEventCatapult.fire(DefaultExecutionEventCatapult.java:42)
	at org.apache.maven.lifecycle.internal.MojoExecutor.executeForkedExecutions(MojoExecutor.java:383)
	at org.apache.maven.lifecycle.internal.MojoExecutor.execute(MojoExecutor.java:199)
	at org.apache.maven.lifecycle.internal.MojoExecutor.execute(MojoExecutor.java:153)
	at org.apache.maven.lifecycle.internal.MojoExecutor.execute(MojoExecutor.java:145)
	at org.apache.maven.lifecycle.internal.LifecycleModuleBuilder.buildProject(LifecycleModuleBuilder.java:84)
	... 24 more
Sending e-mails to: commits@myfaces.apache.org
channel stopped


Mime
View raw message