myfaces-commits mailing list archives

Site index · List index
Message view « Date » · « Thread »
Top « Date » · « Thread »
From Apache Jenkins Server <jenk...@builds.apache.org>
Subject Build failed in Jenkins: myfaces-trinidad-plugins-1 #10
Date Sun, 11 Dec 2011 00:25:16 GMT
See <https://builds.apache.org/job/myfaces-trinidad-plugins-1/10/changes>

Changes:

[mcooper] TRINIDAD-2137 Improve Trinidad component and tagdoc generation plugin to handle
deprecated classes

Thanks to Dave Robinson for the patch.

------------------------------------------
[...truncated 796 lines...]

Tests run: 0, Failures: 0, Errors: 0, Skipped: 0

[JENKINS] Recording test results
[INFO] [INFO] Building jar: <https://builds.apache.org/job/myfaces-trinidad-plugins-1/ws/maven-jdev-plugin/target/maven-jdev-plugin-1.2.14-SNAPSHOT.jar>

[INFO] --- maven-jar-plugin:2.1:jar (default-jar) @ maven-jdev-plugin ---
[INFO] 
[INFO] --- maven-plugin-plugin:2.5.1:addPluginArtifactMetadata (default-addPluginArtifactMetadata)
@ maven-jdev-plugin ---
[INFO] [INFO] Installing <https://builds.apache.org/job/myfaces-trinidad-plugins-1/ws/maven-jdev-plugin/target/maven-jdev-plugin-1.2.14-SNAPSHOT.jar>
to /home/jenkins/.m2/repository/org/apache/myfaces/trinidadbuild/maven-jdev-plugin/1.2.14-SNAPSHOT/maven-jdev-plugin-1.2.14-SNAPSHOT.jar
[INFO] Installing <https://builds.apache.org/job/myfaces-trinidad-plugins-1/ws/maven-jdev-plugin/pom.xml>
to /home/jenkins/.m2/repository/org/apache/myfaces/trinidadbuild/maven-jdev-plugin/1.2.14-SNAPSHOT/maven-jdev-plugin-1.2.14-SNAPSHOT.pom

[INFO] --- maven-install-plugin:2.3:install (default-install) @ maven-jdev-plugin ---
[JENKINS] Archiving <https://builds.apache.org/job/myfaces-trinidad-plugins-1/ws/maven-jdev-plugin/pom.xml>
to /home/hudson/hudson/jobs/myfaces-trinidad-plugins-1/modules/org.apache.myfaces.trinidadbuild$maven-jdev-plugin/builds/2011-12-11_00-23-46/archive/org.apache.myfaces.trinidadbuild/maven-jdev-plugin/1.2.14-SNAPSHOT/maven-jdev-plugin-1.2.14-SNAPSHOT.pom
[JENKINS] Archiving <https://builds.apache.org/job/myfaces-trinidad-plugins-1/ws/maven-jdev-plugin/target/maven-jdev-plugin-1.2.14-SNAPSHOT.jar>
to /home/hudson/hudson/jobs/myfaces-trinidad-plugins-1/modules/org.apache.myfaces.trinidadbuild$maven-jdev-plugin/builds/2011-12-11_00-23-46/archive/org.apache.myfaces.trinidadbuild/maven-jdev-plugin/1.2.14-SNAPSHOT/maven-jdev-plugin-1.2.14-SNAPSHOT.jar
[INFO]                                                                         
[INFO] ------------------------------------------------------------------------
[INFO] Building Apache Trinidad Maven Javascript Plugin 1.2.14-SNAPSHOT
[INFO] ------------------------------------------------------------------------
[INFO] 
[INFO] --- maven-javacc-plugin:1.2.14-SNAPSHOT:generate (default) @ maven-javascript-plugin
---
Java Compiler Compiler Version 3.2 (Parser Generator)
(type "javacc" with no arguments for help)
Reading from file <https://builds.apache.org/job/myfaces-trinidad-plugins-1/ws/maven-javascript-plugin/src/main/java/org/apache/myfaces/trinidadbuild/plugin/javascript/obfuscator/javascript15parser/js1.5.jj>
. . .
File "TokenMgrError.java" does not exist.  Will create one.
File "ParseException.java" does not exist.  Will create one.
File "Token.java" does not exist.  Will create one.
File "SimpleCharStream.java" does not exist.  Will create one.
Parser generated successfully.
[INFO] Using 'UTF-8' encoding to read mojo metadata.
[INFO] [INFO] Applying mojo extractor for language: java

[INFO] --- maven-plugin-plugin:2.5.1:descriptor (default-descriptor) @ maven-javascript-plugin
---
[INFO] Mojo extractor for language: java found 2 mojo descriptors.
[INFO] Applying mojo extractor for language: bsh
[INFO] Mojo extractor for language: bsh found 0 mojo descriptors.
[INFO] 
[INFO] --- maven-remote-resources-plugin:1.0-alpha-6:process (default) @ maven-javascript-plugin
---
[INFO] [INFO] Using 'UTF-8' encoding to copy filtered resources.
[INFO] Copying 0 resource
[INFO] Copying 2 resources

[INFO] --- maven-resources-plugin:2.4.3:resources (default-resources) @ maven-javascript-plugin
---
[INFO] 
[INFO] --- maven-compiler-plugin:2.3.1:compile (default-compile) @ maven-javascript-plugin
---
[INFO] Compiling 197 source files to <https://builds.apache.org/job/myfaces-trinidad-plugins-1/ws/maven-javascript-plugin/target/classes>
[INFO] [INFO] Using 'UTF-8' encoding to copy filtered resources.
[INFO] skip non existing resourceDirectory <https://builds.apache.org/job/myfaces-trinidad-plugins-1/ws/maven-javascript-plugin/src/test/resources>
[INFO] Copying 2 resources

[INFO] --- maven-resources-plugin:2.4.3:testResources (default-testResources) @ maven-javascript-plugin
---
[INFO] [INFO] No sources to compile

[INFO] --- maven-compiler-plugin:2.3.1:testCompile (default-testCompile) @ maven-javascript-plugin
---
[INFO] [INFO] Surefire report directory: <https://builds.apache.org/job/myfaces-trinidad-plugins-1/ws/maven-javascript-plugin/target/surefire-reports>

[INFO] --- maven-surefire-plugin:2.5:test (default-test) @ maven-javascript-plugin ---

-------------------------------------------------------
 T E S T S
-------------------------------------------------------
There are no tests to run.

Results :

Tests run: 0, Failures: 0, Errors: 0, Skipped: 0

[JENKINS] Recording test results
[INFO] [INFO] Building jar: <https://builds.apache.org/job/myfaces-trinidad-plugins-1/ws/maven-javascript-plugin/target/maven-javascript-plugin-1.2.14-SNAPSHOT.jar>

[INFO] --- maven-jar-plugin:2.1:jar (default-jar) @ maven-javascript-plugin ---
[INFO] 
[INFO] --- maven-plugin-plugin:2.5.1:addPluginArtifactMetadata (default-addPluginArtifactMetadata)
@ maven-javascript-plugin ---
[INFO] [INFO] Installing <https://builds.apache.org/job/myfaces-trinidad-plugins-1/ws/maven-javascript-plugin/target/maven-javascript-plugin-1.2.14-SNAPSHOT.jar>
to /home/jenkins/.m2/repository/org/apache/myfaces/trinidadbuild/maven-javascript-plugin/1.2.14-SNAPSHOT/maven-javascript-plugin-1.2.14-SNAPSHOT.jar
[INFO] Installing <https://builds.apache.org/job/myfaces-trinidad-plugins-1/ws/maven-javascript-plugin/pom.xml>
to /home/jenkins/.m2/repository/org/apache/myfaces/trinidadbuild/maven-javascript-plugin/1.2.14-SNAPSHOT/maven-javascript-plugin-1.2.14-SNAPSHOT.pom

[INFO] --- maven-install-plugin:2.3:install (default-install) @ maven-javascript-plugin ---
[JENKINS] Archiving <https://builds.apache.org/job/myfaces-trinidad-plugins-1/ws/maven-javascript-plugin/pom.xml>
to /home/hudson/hudson/jobs/myfaces-trinidad-plugins-1/modules/org.apache.myfaces.trinidadbuild$maven-javascript-plugin/builds/2011-12-11_00-23-46/archive/org.apache.myfaces.trinidadbuild/maven-javascript-plugin/1.2.14-SNAPSHOT/maven-javascript-plugin-1.2.14-SNAPSHOT.pom
[JENKINS] Archiving <https://builds.apache.org/job/myfaces-trinidad-plugins-1/ws/maven-javascript-plugin/target/maven-javascript-plugin-1.2.14-SNAPSHOT.jar>
to /home/hudson/hudson/jobs/myfaces-trinidad-plugins-1/modules/org.apache.myfaces.trinidadbuild$maven-javascript-plugin/builds/2011-12-11_00-23-46/archive/org.apache.myfaces.trinidadbuild/maven-javascript-plugin/1.2.14-SNAPSHOT/maven-javascript-plugin-1.2.14-SNAPSHOT.jar
[INFO] [INFO] Using 2 extractors.
[INFO] Applying extractor for language: java
                                                                        [INFO] Extractor for
language: java found 2 mojo descriptors.
[INFO] Applying extractor for language: bsh
[INFO] Extractor for language: bsh found 0 mojo descriptors.

[INFO] ------------------------------------------------------------------------
[INFO] Building Apache Trinidad Maven XRTS Plugin 1.2.14-SNAPSHOT
[INFO] ------------------------------------------------------------------------
[INFO] 
[INFO] --- maven-plugin-plugin:2.2:descriptor (default-descriptor) @ maven-xrts-plugin ---
[INFO] 
[INFO] --- maven-remote-resources-plugin:1.0-alpha-6:process (default) @ maven-xrts-plugin
---
[INFO] [INFO] Using 'UTF-8' encoding to copy filtered resources.
[INFO] Copying 0 resource
[INFO] Copying 2 resources

[INFO] --- maven-resources-plugin:2.4.3:resources (default-resources) @ maven-xrts-plugin
---
[INFO] [INFO] Compiling 8 source files to <https://builds.apache.org/job/myfaces-trinidad-plugins-1/ws/maven-xrts-plugin/target/classes>

[INFO] --- maven-compiler-plugin:2.3.1:compile (default-compile) @ maven-xrts-plugin ---
[INFO] [INFO] Using 'UTF-8' encoding to copy filtered resources.
[INFO] skip non existing resourceDirectory <https://builds.apache.org/job/myfaces-trinidad-plugins-1/ws/maven-xrts-plugin/src/test/resources>
[INFO] Copying 2 resources

[INFO] --- maven-resources-plugin:2.4.3:testResources (default-testResources) @ maven-xrts-plugin
---
[INFO] [INFO] No sources to compile

[INFO] --- maven-compiler-plugin:2.3.1:testCompile (default-testCompile) @ maven-xrts-plugin
---
[INFO] [INFO] Surefire report directory: <https://builds.apache.org/job/myfaces-trinidad-plugins-1/ws/maven-xrts-plugin/target/surefire-reports>

[INFO] --- maven-surefire-plugin:2.5:test (default-test) @ maven-xrts-plugin ---

-------------------------------------------------------
 T E S T S
-------------------------------------------------------
There are no tests to run.

Results :

Tests run: 0, Failures: 0, Errors: 0, Skipped: 0

[JENKINS] Recording test results
[INFO] [INFO] Building jar: <https://builds.apache.org/job/myfaces-trinidad-plugins-1/ws/maven-xrts-plugin/target/maven-xrts-plugin-1.2.14-SNAPSHOT.jar>

[INFO] --- maven-jar-plugin:2.1:jar (default-jar) @ maven-xrts-plugin ---
[INFO] 
[INFO] --- maven-plugin-plugin:2.2:addPluginArtifactMetadata (default-addPluginArtifactMetadata)
@ maven-xrts-plugin ---
[INFO] [INFO] Installing <https://builds.apache.org/job/myfaces-trinidad-plugins-1/ws/maven-xrts-plugin/target/maven-xrts-plugin-1.2.14-SNAPSHOT.jar>
to /home/jenkins/.m2/repository/org/apache/myfaces/trinidadbuild/maven-xrts-plugin/1.2.14-SNAPSHOT/maven-xrts-plugin-1.2.14-SNAPSHOT.jar
[INFO] Installing <https://builds.apache.org/job/myfaces-trinidad-plugins-1/ws/maven-xrts-plugin/pom.xml>
to /home/jenkins/.m2/repository/org/apache/myfaces/trinidadbuild/maven-xrts-plugin/1.2.14-SNAPSHOT/maven-xrts-plugin-1.2.14-SNAPSHOT.pom

[INFO] --- maven-install-plugin:2.3:install (default-install) @ maven-xrts-plugin ---
[JENKINS] Archiving <https://builds.apache.org/job/myfaces-trinidad-plugins-1/ws/maven-xrts-plugin/pom.xml>
to /home/hudson/hudson/jobs/myfaces-trinidad-plugins-1/modules/org.apache.myfaces.trinidadbuild$maven-xrts-plugin/builds/2011-12-11_00-23-46/archive/org.apache.myfaces.trinidadbuild/maven-xrts-plugin/1.2.14-SNAPSHOT/maven-xrts-plugin-1.2.14-SNAPSHOT.pom
[JENKINS] Archiving <https://builds.apache.org/job/myfaces-trinidad-plugins-1/ws/maven-xrts-plugin/target/maven-xrts-plugin-1.2.14-SNAPSHOT.jar>
to /home/hudson/hudson/jobs/myfaces-trinidad-plugins-1/modules/org.apache.myfaces.trinidadbuild$maven-xrts-plugin/builds/2011-12-11_00-23-46/archive/org.apache.myfaces.trinidadbuild/maven-xrts-plugin/1.2.14-SNAPSHOT/maven-xrts-plugin-1.2.14-SNAPSHOT.jar
[INFO]                                                                         
[INFO] ------------------------------------------------------------------------
[INFO] Building Apache Trinidad Maven Tag Documentation Report 1.2.14-SNAPSHOT
[INFO] ------------------------------------------------------------------------
[INFO] Using 'UTF-8' encoding to read mojo metadata.
[INFO] Applying mojo extractor for language: java
[INFO] 
[INFO] --- maven-plugin-plugin:2.5.1:descriptor (default-descriptor) @ maven-tagdoc-plugin
---
[INFO] Mojo extractor for language: java found 1 mojo descriptors.
[INFO] Applying mojo extractor for language: bsh
[INFO] Mojo extractor for language: bsh found 0 mojo descriptors.
[INFO] 
[INFO] --- maven-remote-resources-plugin:1.0-alpha-6:process (default) @ maven-tagdoc-plugin
---
[INFO] [INFO] Using 'UTF-8' encoding to copy filtered resources.
[INFO] Copying 0 resource
[INFO] Copying 2 resources

[INFO] --- maven-resources-plugin:2.4.3:resources (default-resources) @ maven-tagdoc-plugin
---
[INFO] [INFO] Compiling 1 source file to <https://builds.apache.org/job/myfaces-trinidad-plugins-1/ws/maven-tagdoc-plugin/target/classes>

[INFO] --- maven-compiler-plugin:2.3.1:compile (default-compile) @ maven-tagdoc-plugin ---
[INFO] [INFO] Using 'UTF-8' encoding to copy filtered resources.
[INFO] skip non existing resourceDirectory <https://builds.apache.org/job/myfaces-trinidad-plugins-1/ws/maven-tagdoc-plugin/src/test/resources>
[INFO] Copying 2 resources

[INFO] --- maven-resources-plugin:2.4.3:testResources (default-testResources) @ maven-tagdoc-plugin
---
[INFO] [INFO] No sources to compile

[INFO] --- maven-compiler-plugin:2.3.1:testCompile (default-testCompile) @ maven-tagdoc-plugin
---
[INFO] [INFO] Surefire report directory: <https://builds.apache.org/job/myfaces-trinidad-plugins-1/ws/maven-tagdoc-plugin/target/surefire-reports>

[INFO] --- maven-surefire-plugin:2.5:test (default-test) @ maven-tagdoc-plugin ---

-------------------------------------------------------
 T E S T S
-------------------------------------------------------
There are no tests to run.

Results :

Tests run: 0, Failures: 0, Errors: 0, Skipped: 0

[JENKINS] Recording test results
[INFO] [INFO] Building jar: <https://builds.apache.org/job/myfaces-trinidad-plugins-1/ws/maven-tagdoc-plugin/target/maven-tagdoc-plugin-1.2.14-SNAPSHOT.jar>

[INFO] --- maven-jar-plugin:2.1:jar (default-jar) @ maven-tagdoc-plugin ---
[INFO] 
[INFO] --- maven-plugin-plugin:2.5.1:addPluginArtifactMetadata (default-addPluginArtifactMetadata)
@ maven-tagdoc-plugin ---
[INFO] [INFO] Installing <https://builds.apache.org/job/myfaces-trinidad-plugins-1/ws/maven-tagdoc-plugin/target/maven-tagdoc-plugin-1.2.14-SNAPSHOT.jar>
to /home/jenkins/.m2/repository/org/apache/myfaces/trinidadbuild/maven-tagdoc-plugin/1.2.14-SNAPSHOT/maven-tagdoc-plugin-1.2.14-SNAPSHOT.jar
[INFO] Installing <https://builds.apache.org/job/myfaces-trinidad-plugins-1/ws/maven-tagdoc-plugin/pom.xml>
to /home/jenkins/.m2/repository/org/apache/myfaces/trinidadbuild/maven-tagdoc-plugin/1.2.14-SNAPSHOT/maven-tagdoc-plugin-1.2.14-SNAPSHOT.pom

[INFO] --- maven-install-plugin:2.3:install (default-install) @ maven-tagdoc-plugin ---
[JENKINS] Archiving <https://builds.apache.org/job/myfaces-trinidad-plugins-1/ws/maven-tagdoc-plugin/pom.xml>
to /home/hudson/hudson/jobs/myfaces-trinidad-plugins-1/modules/org.apache.myfaces.trinidadbuild$maven-tagdoc-plugin/builds/2011-12-11_00-23-46/archive/org.apache.myfaces.trinidadbuild/maven-tagdoc-plugin/1.2.14-SNAPSHOT/maven-tagdoc-plugin-1.2.14-SNAPSHOT.pom
[JENKINS] Archiving <https://builds.apache.org/job/myfaces-trinidad-plugins-1/ws/maven-tagdoc-plugin/target/maven-tagdoc-plugin-1.2.14-SNAPSHOT.jar>
to /home/hudson/hudson/jobs/myfaces-trinidad-plugins-1/modules/org.apache.myfaces.trinidadbuild$maven-tagdoc-plugin/builds/2011-12-11_00-23-46/archive/org.apache.myfaces.trinidadbuild/maven-tagdoc-plugin/1.2.14-SNAPSHOT/maven-tagdoc-plugin-1.2.14-SNAPSHOT.jar
[INFO] ------------------------------------------------------------------------
[INFO] Reactor Summary:
[INFO] 
[INFO] Apache Trinidad Maven Plugin Parent ............... SUCCESS [7.425s]
[INFO] Apache Trinidad Maven Faces Plugin ................ SUCCESS [39.980s]
[INFO] Apache Trinidad Maven Javacc Plugin ............... SUCCESS [2.643s]
[INFO] Apache Trinidad Maven i18n Plugin ................. SUCCESS [4.632s]
[INFO] Apache Trinidad Maven JDev Plugin ................. SUCCESS [2.026s]
[INFO] Apache Trinidad Maven Javascript Plugin ........... SUCCESS [4.902s]
[INFO] Apache Trinidad Maven XRTS Plugin ................. SUCCESS [1.942s]
[INFO] Apache Trinidad Maven Tag Documentation Report .... SUCCESS [2.178s]
[INFO] ------------------------------------------------------------------------
[INFO] BUILD SUCCESS
[INFO] ------------------------------------------------------------------------
[INFO] Total time: 1:17.576s
[INFO] Finished at: Sun Dec 11 00:25:14 UTC 2011
[INFO] Final Memory: 42M/256M
[INFO] ------------------------------------------------------------------------
channel stopped
Maven RedeployPublished use remote ubuntu4 maven settings from : /home/jenkins/.m2/settings.xml
[ERROR] uniqueVersion == false is not anymore supported in maven 3
[INFO] Deployment in https://repository.apache.org/content/repositories/snapshots (id=,uniqueVersion=false)
Deploying the main artifact maven-faces-plugin-1.2.14-SNAPSHOT.jar
Downloading: https://repository.apache.org/content/repositories/snapshots/org/apache/myfaces/trinidadbuild/maven-faces-plugin/1.2.14-SNAPSHOT/maven-metadata.xml
Downloaded: https://repository.apache.org/content/repositories/snapshots/org/apache/myfaces/trinidadbuild/maven-faces-plugin/1.2.14-SNAPSHOT/maven-metadata.xml
(297 B at 0.7 KB/sec)
Uploading: https://repository.apache.org/content/repositories/snapshots/org/apache/myfaces/trinidadbuild/maven-faces-plugin/1.2.14-SNAPSHOT/maven-faces-plugin-1.2.14-20111211.002515-1.jar
Uploading: https://repository.apache.org/content/repositories/snapshots/org/apache/myfaces/trinidadbuild/maven-faces-plugin/1.2.14-SNAPSHOT/maven-faces-plugin-1.2.14-20111211.002515-1.pom
ERROR: Failed to deploy artifacts: Could not transfer artifact org.apache.myfaces.trinidadbuild:maven-faces-plugin:jar:1.2.14-20111211.002515-1
from/to  (https://repository.apache.org/content/repositories/snapshots): Failed to transfer
file: https://repository.apache.org/content/repositories/snapshots/org/apache/myfaces/trinidadbuild/maven-faces-plugin/1.2.14-SNAPSHOT/maven-faces-plugin-1.2.14-20111211.002515-1.jar.
Return code is: 401
org.apache.maven.artifact.deployer.ArtifactDeploymentException: Failed to deploy artifacts:
Could not transfer artifact org.apache.myfaces.trinidadbuild:maven-faces-plugin:jar:1.2.14-20111211.002515-1
from/to  (https://repository.apache.org/content/repositories/snapshots): Failed to transfer
file: https://repository.apache.org/content/repositories/snapshots/org/apache/myfaces/trinidadbuild/maven-faces-plugin/1.2.14-SNAPSHOT/maven-faces-plugin-1.2.14-20111211.002515-1.jar.
Return code is: 401
	at org.apache.maven.artifact.deployer.DefaultArtifactDeployer.deploy(DefaultArtifactDeployer.java:141)
	at hudson.maven.reporters.MavenArtifactRecord.deploy(MavenArtifactRecord.java:189)
	at hudson.maven.RedeployPublisher.perform(RedeployPublisher.java:158)
	at hudson.tasks.BuildStepMonitor$1.perform(BuildStepMonitor.java:19)
	at hudson.model.AbstractBuild$AbstractRunner.perform(AbstractBuild.java:693)
	at hudson.model.AbstractBuild$AbstractRunner.performAllBuildSteps(AbstractBuild.java:668)
	at hudson.maven.MavenModuleSetBuild$RunnerImpl.post2(MavenModuleSetBuild.java:953)
	at hudson.model.AbstractBuild$AbstractRunner.post(AbstractBuild.java:615)
	at hudson.model.Run.run(Run.java:1401)
	at hudson.maven.MavenModuleSetBuild.run(MavenModuleSetBuild.java:474)
	at hudson.model.ResourceController.execute(ResourceController.java:88)
	at hudson.model.Executor.run(Executor.java:230)
Caused by: org.sonatype.aether.deployment.DeploymentException: Failed to deploy artifacts:
Could not transfer artifact org.apache.myfaces.trinidadbuild:maven-faces-plugin:jar:1.2.14-20111211.002515-1
from/to  (https://repository.apache.org/content/repositories/snapshots): Failed to transfer
file: https://repository.apache.org/content/repositories/snapshots/org/apache/myfaces/trinidadbuild/maven-faces-plugin/1.2.14-SNAPSHOT/maven-faces-plugin-1.2.14-20111211.002515-1.jar.
Return code is: 401
	at org.sonatype.aether.impl.internal.DefaultDeployer.deploy(DefaultDeployer.java:284)
	at org.sonatype.aether.impl.internal.DefaultDeployer.deploy(DefaultDeployer.java:215)
	at org.sonatype.aether.impl.internal.DefaultRepositorySystem.deploy(DefaultRepositorySystem.java:480)
	at org.apache.maven.artifact.deployer.DefaultArtifactDeployer.deploy(DefaultArtifactDeployer.java:137)
	... 11 more
Caused by: org.sonatype.aether.transfer.ArtifactTransferException: Could not transfer artifact
org.apache.myfaces.trinidadbuild:maven-faces-plugin:jar:1.2.14-20111211.002515-1 from/to 
(https://repository.apache.org/content/repositories/snapshots): Failed to transfer file: https://repository.apache.org/content/repositories/snapshots/org/apache/myfaces/trinidadbuild/maven-faces-plugin/1.2.14-SNAPSHOT/maven-faces-plugin-1.2.14-20111211.002515-1.jar.
Return code is: 401
	at org.sonatype.aether.connector.wagon.WagonRepositoryConnector$4.wrap(WagonRepositoryConnector.java:949)
	at org.sonatype.aether.connector.wagon.WagonRepositoryConnector$4.wrap(WagonRepositoryConnector.java:940)
	at org.sonatype.aether.connector.wagon.WagonRepositoryConnector$PutTask.flush(WagonRepositoryConnector.java:864)
	at org.sonatype.aether.connector.wagon.WagonRepositoryConnector.put(WagonRepositoryConnector.java:466)
	at org.sonatype.aether.impl.internal.DefaultDeployer.deploy(DefaultDeployer.java:278)
	... 14 more
Caused by: org.apache.maven.wagon.TransferFailedException: Failed to transfer file: https://repository.apache.org/content/repositories/snapshots/org/apache/myfaces/trinidadbuild/maven-faces-plugin/1.2.14-SNAPSHOT/maven-faces-plugin-1.2.14-20111211.002515-1.jar.
Return code is: 401
	at org.apache.maven.wagon.shared.http.AbstractHttpClientWagon.put(AbstractHttpClientWagon.java:368)
	at org.apache.maven.wagon.shared.http.AbstractHttpClientWagon.put(AbstractHttpClientWagon.java:280)
	at org.sonatype.aether.connector.wagon.WagonRepositoryConnector$PutTask.run(WagonRepositoryConnector.java:825)
	at org.sonatype.aether.connector.wagon.WagonRepositoryConnector.put(WagonRepositoryConnector.java:465)
	... 15 more
[INFO] Deployment failed after 1.6 sec
Build step 'Deploy artifacts to Maven repository' changed build result to FAILURE


Mime
View raw message