myfaces-commits mailing list archives

Site index · List index
Message view « Date » · « Thread »
Top « Date » · « Thread »
From Apache Jenkins Server <jenk...@builds.apache.org>
Subject Build failed in Jenkins: myfaces-current-2.0 #667
Date Sun, 01 Jan 2012 00:07:14 GMT
See <https://builds.apache.org/job/myfaces-current-2.0/667/>

------------------------------------------
[...truncated 2974 lines...]
[WARNING] 'reporting.plugins.plugin.version' for org.apache.maven.plugins:maven-surefire-report-plugin
is missing. @ line 712, column 21
[WARNING] 'reporting.plugins.plugin.version' for org.codehaus.mojo:taglist-maven-plugin is
missing. @ line 716, column 21
[WARNING] 
[WARNING] Some problems were encountered while building the effective model for org.apache.myfaces.core.internal:myfaces-impl-shared:jar:2.0.12-SNAPSHOT
[INFO] [WARNING] 'reporting.plugins.plugin.version' for org.apache.maven.plugins:maven-javadoc-plugin
is missing. @ line 234, column 15
[WARNING] 'reporting.plugins.plugin.version' for org.apache.maven.plugins:maven-jxr-plugin
is missing. @ line 237, column 15
[WARNING] 'reporting.plugins.plugin.version' for org.apache.maven.plugins:maven-changelog-plugin
is missing. @ line 240, column 15
[WARNING] 'reporting.plugins.plugin.version' for org.codehaus.mojo:taglist-maven-plugin is
missing. @ line 263, column 15
[WARNING] 
[WARNING] Some problems were encountered while building the effective model for org.apache.myfaces.core:myfaces-impl:jar:2.0.12-SNAPSHOT
[WARNING] 'build.plugins.plugin.(groupId:artifactId)' must be unique but found duplicate declaration
of plugin org.apache.maven.plugins:maven-jar-plugin @ line 339, column 21
[WARNING] 'reporting.plugins.plugin.version' for org.apache.maven.plugins:maven-javadoc-plugin
is missing. @ line 1118, column 21
[WARNING] 'reporting.plugins.plugin.version' for org.apache.maven.plugins:maven-changelog-plugin
is missing. @ line 1124, column 21
[WARNING] 'reporting.plugins.plugin.version' for org.apache.maven.plugins:maven-jxr-plugin
is missing. @ line 1142, column 21
[WARNING] 'reporting.plugins.plugin.version' for org.apache.maven.plugins:maven-surefire-report-plugin
is missing. @ line 1146, column 21
[WARNING] 'reporting.plugins.plugin.version' for org.codehaus.mojo:taglist-maven-plugin is
missing. @ line 1150, column 21
[WARNING] 
[WARNING] It is highly recommended to fix these problems because they threaten the stability
of your build.
[WARNING] 
[WARNING] For this reason, future Maven versions might no longer support building such malformed
projects.
[WARNING] 
------------------------------------------------------------------------
[INFO] Reactor Build Order:
[INFO] 
[INFO] Apache MyFaces Shared For JSF 2.0 - Project
[INFO] Apache MyFaces Shared For JSF 2.0 - Core Mirror
[INFO] MyFaces Shared Tomahawk
[INFO] Apache MyFaces JSF-2.0 Core Project
[INFO] Apache MyFaces JSF-2.0 Core API
[INFO] Apache MyFaces Shared For JSF 2.0 - Core
[INFO] Apache MyFaces JSF-2.0 Core Impl for Java EE 6
[INFO] Apache MyFaces JSF-2.0 Core Impl
[INFO] Apache MyFaces JSF-2.0 Core OSGi Bundle
[INFO] Apache MyFaces Composite Build
[INFO]                                                                         
[INFO] ------------------------------------------------------------------------
[INFO] Building Apache MyFaces Shared For JSF 2.0 - Project 4.0.12-SNAPSHOT
[INFO] ------------------------------------------------------------------------
[INFO] 
[INFO] --- maven-clean-plugin:2.4.1:clean (default-clean) @ myfaces-shared-project ---
log4j:WARN No appenders could be found for logger (org.apache.commons.beanutils.converters.BooleanConverter).
log4j:WARN Please initialize the log4j system properly.
[INFO] 
[INFO] --- maven-remote-resources-plugin:1.1:process (default) @ myfaces-shared-project ---
[INFO] Setting property: classpath.resource.loader.class => 'org.codehaus.plexus.velocity.ContextClassLoaderResourceLoader'.
[INFO] Setting property: velocimacro.messages.on => 'false'.
[INFO] Setting property: resource.loader => 'classpath'.
[INFO] Setting property: resource.manager.logwhenfound => 'false'.
[INFO] 
[INFO] --- maven-checkstyle-plugin:2.6:check (verify-style) @ myfaces-shared-project ---
[INFO] 
[INFO] [INFO] Installing <https://builds.apache.org/job/myfaces-current-2.0/ws/current20/shared/pom.xml>
to /home/jenkins/.m2/repository/org/apache/myfaces/shared/myfaces-shared-project/4.0.12-SNAPSHOT/myfaces-shared-project-4.0.12-SNAPSHOT.pom

[INFO] --- maven-install-plugin:2.3:install (default-install) @ myfaces-shared-project ---
[INFO] 
[INFO] --- maven-deploy-plugin:2.5:deploy (default-deploy) @ myfaces-shared-project ---
Downloading: https://repository.apache.org/content/repositories/snapshots/org/apache/myfaces/shared/myfaces-shared-project/4.0.12-SNAPSHOT/maven-metadata.xml
Downloaded: https://repository.apache.org/content/repositories/snapshots/org/apache/myfaces/shared/myfaces-shared-project/4.0.12-SNAPSHOT/maven-metadata.xml
(628 B at 0.4 KB/sec)
Uploading: https://repository.apache.org/content/repositories/snapshots/org/apache/myfaces/shared/myfaces-shared-project/4.0.12-SNAPSHOT/myfaces-shared-project-4.0.12-20120101.000644-59.pom
Uploaded: https://repository.apache.org/content/repositories/snapshots/org/apache/myfaces/shared/myfaces-shared-project/4.0.12-SNAPSHOT/myfaces-shared-project-4.0.12-20120101.000644-59.pom
(8 KB at 10.0 KB/sec)
Downloading: https://repository.apache.org/content/repositories/snapshots/org/apache/myfaces/shared/myfaces-shared-project/maven-metadata.xml
Downloaded: https://repository.apache.org/content/repositories/snapshots/org/apache/myfaces/shared/myfaces-shared-project/maven-metadata.xml
(571 B at 5.2 KB/sec)
Uploading: https://repository.apache.org/content/repositories/snapshots/org/apache/myfaces/shared/myfaces-shared-project/4.0.12-SNAPSHOT/maven-metadata.xml
Uploaded: https://repository.apache.org/content/repositories/snapshots/org/apache/myfaces/shared/myfaces-shared-project/4.0.12-SNAPSHOT/maven-metadata.xml
(628 B at 3.0 KB/sec)
Uploading: https://repository.apache.org/content/repositories/snapshots/org/apache/myfaces/shared/myfaces-shared-project/maven-metadata.xml
Uploaded: https://repository.apache.org/content/repositories/snapshots/org/apache/myfaces/shared/myfaces-shared-project/maven-metadata.xml
(571 B at 1.8 KB/sec)
[JENKINS] Archiving <https://builds.apache.org/job/myfaces-current-2.0/ws/current20/shared/pom.xml>
to /home/hudson/hudson/jobs/myfaces-current-2.0/modules/org.apache.myfaces.shared$myfaces-shared-project/builds/2012-01-01_00-05-57/archive/org.apache.myfaces.shared/myfaces-shared-project/4.0.12-SNAPSHOT/myfaces-shared-project-4.0.12-SNAPSHOT.pom
[INFO]                                                                         
[INFO] ------------------------------------------------------------------------
[INFO] Building Apache MyFaces Shared For JSF 2.0 - Core Mirror 4.0.12-SNAPSHOT
[INFO] ------------------------------------------------------------------------
[INFO] 
[INFO] --- maven-clean-plugin:2.4.1:clean (default-clean) @ myfaces-shared-core ---
[INFO] 
[INFO] --- maven-remote-resources-plugin:1.1:process (default) @ myfaces-shared-core ---
[INFO] Setting property: classpath.resource.loader.class => 'org.codehaus.plexus.velocity.ContextClassLoaderResourceLoader'.
[INFO] Setting property: velocimacro.messages.on => 'false'.
[INFO] Setting property: resource.loader => 'classpath'.
[INFO] Setting property: resource.manager.logwhenfound => 'false'.
[INFO] 
[INFO] --- build-helper-maven-plugin:1.5:add-resource (add-resource) @ myfaces-shared-core
---
[INFO] 
[INFO] --- myfaces-javascript-plugin:1.0.1:compile (compile-myfacesscripts) @ myfaces-shared-core
---
[INFO] Reading assembler descriptor <https://builds.apache.org/job/myfaces-current-2.0/ws/current20/shared/core/src/assembler/myfacesscripts-compiler.xml>
[INFO] [INFO] Reading assembler descriptor <https://builds.apache.org/job/myfaces-current-2.0/ws/current20/shared/core/src/assembler/myfacesscripts-uncompressed-compiler.xml>

[INFO] --- myfaces-javascript-plugin:1.0.1:compile (compile-myfacesscripts-uncompressed) @
myfaces-shared-core ---
[INFO] [INFO] Compressing javascript using YahooUI
[INFO] ------------------------------------------------------------------------------

[INFO] --- myfaces-javascript-plugin:1.0.1:compress (compress-myfacesscripts) @ myfaces-shared-core
---

[WARNING] [WARNING] The variable i has already been declared in the same scope...
&&params!=null){for(var i ---> = <--- 0,param;(param=params[

[WARNING] [WARNING] The variable param has already been declared in the same scope...
){for(var i=0,param ---> ; <--- (param=params[i]);
[INFO] oamSubmit.js (5,742 bytes) ................................. compressed at 67%
[INFO] ------------------------------------------------------------------------------
[INFO] compression saved 3,868 bytes
[INFO] 
[INFO] --- maven-resources-plugin:2.4.3:resources (default-resources) @ myfaces-shared-core
---
[INFO] Using 'UTF-8' encoding to copy filtered resources.
[INFO] Copying 3 resources
[INFO] Copying 3 resources
[INFO] Copying 2 resources
[INFO] 
[INFO] --- maven-compiler-plugin:2.3.1:compile (default-compile) @ myfaces-shared-core ---
[INFO] Compiling 124 source files to <https://builds.apache.org/job/myfaces-current-2.0/ws/current20/shared/core/target/classes>
[INFO] [INFO] Using 'UTF-8' encoding to copy filtered resources.
[INFO] Copying 15 resources
[INFO] Copying 3 resources

[INFO] --- maven-resources-plugin:2.4.3:testResources (default-testResources) @ myfaces-shared-core
---
[INFO] [INFO] Compiling 21 source files to <https://builds.apache.org/job/myfaces-current-2.0/ws/current20/shared/core/target/test-classes>

[INFO] --- maven-compiler-plugin:2.3.1:testCompile (default-testCompile) @ myfaces-shared-core
---
[INFO] 
[INFO] --- maven-surefire-plugin:2.5:test (default-test) @ myfaces-shared-core ---
[INFO] Surefire report directory: <https://builds.apache.org/job/myfaces-current-2.0/ws/current20/shared/core/target/surefire-reports>

-------------------------------------------------------
 T E S T S
-------------------------------------------------------
Running org.apache.myfaces.shared.util.CommentUtilsTest
Tests run: 5, Failures: 0, Errors: 0, Skipped: 0, Time elapsed: 0.199 sec
Running org.apache.myfaces.shared.util.StateUtilsAES_CBCTest
Tests run: 11, Failures: 0, Errors: 0, Skipped: 0, Time elapsed: 0.435 sec
Running org.apache.myfaces.shared.renderkit.html.HtmlRendererUtilsTest
No Renderer found for component {Component-Path : [Class: javax.faces.component.html.HtmlInputText,Id:
j_id0]} (component-family=javax.faces.Input, renderer-type=javax.faces.Text)
Jan 1, 2012 12:06:55 AM javax.faces.component.UIComponentBase getRenderer
WARNING: No Renderer found for component {Component-Path : [Class: javax.faces.component.html.HtmlInputText,Id:
j_id0]} (component-family=javax.faces.Input, renderer-type=javax.faces.Text)
Tests run: 2, Failures: 0, Errors: 0, Skipped: 0, Time elapsed: 0.038 sec
Running org.apache.myfaces.shared.context.flash.FlashImplTest
Tests run: 13, Failures: 0, Errors: 0, Skipped: 0, Time elapsed: 0.068 sec
Running org.apache.myfaces.shared.util.CachedStateUtilsBlowfish_ECBTest
Tests run: 11, Failures: 0, Errors: 0, Skipped: 0, Time elapsed: 0.026 sec
Running org.apache.myfaces.shared.util.CachedStateUtilsTripleDES_ECBTest
Tests run: 11, Failures: 0, Errors: 0, Skipped: 0, Time elapsed: 0.024 sec
Running org.apache.myfaces.shared.renderkit.html.util.HTMLEncoderTest
Tests run: 26, Failures: 0, Errors: 0, Skipped: 0, Time elapsed: 0.024 sec
Running org.apache.myfaces.shared.renderkit.html.HtmlResponseWriterImplTest
Tests run: 13, Failures: 0, Errors: 0, Skipped: 0, Time elapsed: 0.015 sec
Running org.apache.myfaces.shared.util.InitVector_CBCTestCase
Tests run: 2, Failures: 0, Errors: 0, Skipped: 0, Time elapsed: 0.004 sec
Running org.apache.myfaces.shared.util.StateUtilsBlowfish_ECBTest
Tests run: 11, Failures: 0, Errors: 0, Skipped: 0, Time elapsed: 0.019 sec
Running org.apache.myfaces.shared.util.SecretKeyConfigurationTest
Tests run: 4, Failures: 0, Errors: 0, Skipped: 0, Time elapsed: 0.004 sec
Running org.apache.myfaces.shared.application.DefaultViewHandlerSupportTest
Tests run: 8, Failures: 0, Errors: 0, Skipped: 0, Time elapsed: 0.014 sec
Running org.apache.myfaces.shared.util.StateUtilsTripleDES_ECBTest
Tests run: 11, Failures: 0, Errors: 0, Skipped: 0, Time elapsed: 0.015 sec
Running org.apache.myfaces.shared.util.StateUtilsDefaultTest
Tests run: 11, Failures: 0, Errors: 0, Skipped: 0, Time elapsed: 0.013 sec
Running org.apache.myfaces.shared.util.MessageUtilsTest
currency ?100.00
Tests run: 11, Failures: 0, Errors: 0, Skipped: 0, Time elapsed: 0.043 sec
Running org.apache.myfaces.shared.webapp.webxml.ServletMappingTest
Tests run: 2, Failures: 0, Errors: 0, Skipped: 0, Time elapsed: 0.008 sec
Running org.apache.myfaces.shared.util.CachedStateUtilsDefaultTest
Tests run: 11, Failures: 0, Errors: 0, Skipped: 0, Time elapsed: 0.013 sec
Running org.apache.myfaces.shared.util.CachedStateUtilsAES_CBCTest
Tests run: 11, Failures: 0, Errors: 0, Skipped: 0, Time elapsed: 0.012 sec
Running org.apache.myfaces.shared.renderkit.RendererUtilsTest
No Renderer found for component {Component-Path : [Class: javax.faces.component.html.HtmlGraphicImage,Id:
graphicImageId]} (component-family=javax.faces.Graphic, renderer-type=javax.faces.Image)
Jan 1, 2012 12:06:56 AM javax.faces.component.UIComponentBase getRenderer
WARNING: No Renderer found for component {Component-Path : [Class: javax.faces.component.html.HtmlGraphicImage,Id:
graphicImageId]} (component-family=javax.faces.Graphic, renderer-type=javax.faces.Image)
Tests run: 7, Failures: 0, Errors: 0, Skipped: 0, Time elapsed: 0.568 sec
Running org.apache.myfaces.shared.util.SecretKeyCacheTest
Tests run: 3, Failures: 0, Errors: 0, Skipped: 0, Time elapsed: 0.003 sec

Results :

Tests run: 184, Failures: 0, Errors: 0, Skipped: 0

[JENKINS] Recording test results
[INFO] 
[INFO] --- maven-jar-plugin:2.3.1:jar (default-jar) @ myfaces-shared-core ---
[INFO] Building jar: <https://builds.apache.org/job/myfaces-current-2.0/ws/current20/shared/core/target/myfaces-shared-core-4.0.12-SNAPSHOT.jar>
[JENKINS] Archiving <https://builds.apache.org/job/myfaces-current-2.0/ws/current20/shared/core/pom.xml>
to /home/hudson/hudson/jobs/myfaces-current-2.0/modules/org.apache.myfaces.shared$myfaces-shared-core/builds/2012-01-01_00-05-57/archive/org.apache.myfaces.shared/myfaces-shared-core/4.0.12-SNAPSHOT/myfaces-shared-core-4.0.12-SNAPSHOT.pom
[JENKINS] Archiving <https://builds.apache.org/job/myfaces-current-2.0/ws/current20/shared/core/target/myfaces-shared-core-4.0.12-SNAPSHOT.jar>
to /home/hudson/hudson/jobs/myfaces-current-2.0/modules/org.apache.myfaces.shared$myfaces-shared-core/builds/2012-01-01_00-05-57/archive/org.apache.myfaces.shared/myfaces-shared-core/4.0.12-SNAPSHOT/myfaces-shared-core-4.0.12-SNAPSHOT.jar
[INFO] ------------------------------------------------------------------------
[INFO] Reactor Summary:
[INFO] 
[INFO] Apache MyFaces Shared For JSF 2.0 - Project ....... SUCCESS [35.455s]
[INFO] Apache MyFaces Shared For JSF 2.0 - Core Mirror ... FAILURE [20.471s]
[INFO] MyFaces Shared Tomahawk ........................... SKIPPED
[INFO] Apache MyFaces JSF-2.0 Core Project ............... SKIPPED
[INFO] Apache MyFaces JSF-2.0 Core API ................... SKIPPED
[INFO] Apache MyFaces Shared For JSF 2.0 - Core .......... SKIPPED
[INFO] Apache MyFaces JSF-2.0 Core Impl for Java EE 6 .... SKIPPED
[INFO] Apache MyFaces JSF-2.0 Core Impl .................. SKIPPED
[INFO] Apache MyFaces JSF-2.0 Core OSGi Bundle ........... SKIPPED
[INFO] Apache MyFaces Composite Build .................... SKIPPED
[INFO] ------------------------------------------------------------------------
[INFO] BUILD FAILURE
[INFO] ------------------------------------------------------------------------
[INFO] Total time: 1:02.691s
[INFO] Finished at: Sun Jan 01 00:07:11 UTC 2012
[INFO] Final Memory: 37M/154M
[INFO] ------------------------------------------------------------------------
mavenExecutionResult exceptions not empty
message : Internal error: java.lang.NullPointerException
cause : null
Stack trace : 
org.apache.maven.InternalErrorException: Internal error: java.lang.NullPointerException
	at org.apache.maven.lifecycle.internal.BuilderCommon.handleBuildError(BuilderCommon.java:128)
	at org.apache.maven.lifecycle.internal.LifecycleModuleBuilder.buildProject(LifecycleModuleBuilder.java:95)
	at org.apache.maven.lifecycle.internal.LifecycleModuleBuilder.buildProject(LifecycleModuleBuilder.java:59)
	at org.apache.maven.lifecycle.internal.LifecycleStarter.singleThreadedBuild(LifecycleStarter.java:183)
	at org.apache.maven.lifecycle.internal.LifecycleStarter.execute(LifecycleStarter.java:161)
	at org.apache.maven.DefaultMaven.doExecute(DefaultMaven.java:319)
	at org.apache.maven.DefaultMaven.execute(DefaultMaven.java:156)
	at org.jvnet.hudson.maven3.launcher.Maven3Launcher.main(Maven3Launcher.java:79)
	at sun.reflect.NativeMethodAccessorImpl.invoke0(Native Method)
	at sun.reflect.NativeMethodAccessorImpl.invoke(NativeMethodAccessorImpl.java:39)
	at sun.reflect.DelegatingMethodAccessorImpl.invoke(DelegatingMethodAccessorImpl.java:25)
	at java.lang.reflect.Method.invoke(Method.java:597)
	at org.codehaus.plexus.classworlds.launcher.Launcher.launchStandard(Launcher.java:329)
	at org.codehaus.plexus.classworlds.launcher.Launcher.launch(Launcher.java:239)
	at org.jvnet.hudson.maven3.agent.Maven3Main.launch(Maven3Main.java:158)
	at hudson.maven.Maven3Builder.call(Maven3Builder.java:112)
	at hudson.maven.Maven3Builder.call(Maven3Builder.java:70)
	at hudson.remoting.UserRequest.perform(UserRequest.java:118)
	at hudson.remoting.UserRequest.perform(UserRequest.java:48)
	at hudson.remoting.Request$2.run(Request.java:287)
	at java.util.concurrent.Executors$RunnableAdapter.call(Executors.java:441)
	at java.util.concurrent.FutureTask$Sync.innerRun(FutureTask.java:303)
	at java.util.concurrent.FutureTask.run(FutureTask.java:138)
	at java.util.concurrent.ThreadPoolExecutor$Worker.runTask(ThreadPoolExecutor.java:886)
	at java.util.concurrent.ThreadPoolExecutor$Worker.run(ThreadPoolExecutor.java:908)
	at java.lang.Thread.run(Thread.java:662)
Caused by: java.lang.NullPointerException
	at hudson.maven.ExecutedMojo.getMojoClass(ExecutedMojo.java:114)
	at hudson.maven.ExecutedMojo.<init>(ExecutedMojo.java:99)
	at hudson.maven.Maven3Builder$MavenExecutionListener.recordExecutionTime(Maven3Builder.java:524)
	at hudson.maven.Maven3Builder$MavenExecutionListener.recordMojoSucceeded(Maven3Builder.java:493)
	at hudson.maven.Maven3Builder$MavenExecutionListener.forkSucceeded(Maven3Builder.java:601)
	at org.apache.maven.lifecycle.internal.DefaultExecutionEventCatapult.fire(DefaultExecutionEventCatapult.java:97)
	at org.apache.maven.lifecycle.internal.DefaultExecutionEventCatapult.fire(DefaultExecutionEventCatapult.java:42)
	at org.apache.maven.lifecycle.internal.MojoExecutor.executeForkedExecutions(MojoExecutor.java:383)
	at org.apache.maven.lifecycle.internal.MojoExecutor.execute(MojoExecutor.java:199)
	at org.apache.maven.lifecycle.internal.MojoExecutor.execute(MojoExecutor.java:153)
	at org.apache.maven.lifecycle.internal.MojoExecutor.execute(MojoExecutor.java:145)
	at org.apache.maven.lifecycle.internal.LifecycleModuleBuilder.buildProject(LifecycleModuleBuilder.java:84)
	... 24 more
Sending e-mails to: grantsmith@apache.org commits@myfaces.apache.org
channel stopped


Mime
View raw message