myfaces-commits mailing list archives

Site index · List index
Message view « Date » · « Thread »
Top « Date » · « Thread »
From Apache Jenkins Server <jenk...@builds.apache.org>
Subject Build failed in Jenkins: Trinidad Core 2.0.x (sanity) #679
Date Wed, 07 Mar 2012 16:42:23 GMT
See <https://builds.apache.org/job/Trinidad%20Core%202.0.x%20(sanity)/679/>

------------------------------------------
Started by user sobryan
Building remotely on ubuntu2 in workspace <https://builds.apache.org/job/Trinidad%20Core%202.0.x%20(sanity)/ws/>
Updating https://svn.apache.org/repos/asf/myfaces/trinidad/trunk
At revision 1298016
no change for https://svn.apache.org/repos/asf/myfaces/trinidad/trunk since the previous build
[Trinidad Core 2.0.x (sanity)] $ /home/hudson/tools/maven/latest3/bin/mvn -f https://svn.apache.org/repos/asf/myfaces/trinidad-maven/trunk/pom.xml
"-Dmaven.repo.local=<https://builds.apache.org/job/Trinidad%20Core%202.0.x%20(sanity)/ws/.repository">
install
[INFO] Scanning for projects...
[ERROR] The build could not read 1 project -> [Help 1]
[ERROR]   
[ERROR]   The project  (<https://builds.apache.org/job/Trinidad%20Core%202.0.x%20(sanity)/ws/https>:/svn.apache.org/repos/asf/myfaces/trinidad-maven/trunk/pom.xml)
has 1 error
[ERROR]     Non-readable POM <https://builds.apache.org/job/Trinidad%20Core%202.0.x%20(sanity)/ws/https>:/svn.apache.org/repos/asf/myfaces/trinidad-maven/trunk/pom.xml:
<https://builds.apache.org/job/Trinidad%20Core%202.0.x%20(sanity)/ws/https>:/svn.apache.org/repos/asf/myfaces/trinidad-maven/trunk/pom.xml
(No such file or directory)
[ERROR] 
[ERROR] To see the full stack trace of the errors, re-run Maven with the -e switch.
[ERROR] Re-run Maven using the -X switch to enable full debug logging.
[ERROR] 
[ERROR] For more information about the errors and possible solutions, please read the following
articles:
[ERROR] [Help 1] http://cwiki.apache.org/confluence/display/MAVEN/ProjectBuildingException
ERROR: Failed to parse POMs
java.io.IOException: Could not execute pre-build steps
	at hudson.plugins.m2extrasteps.M2ExtraStepsWrapper.setUp(M2ExtraStepsWrapper.java:127)
	at hudson.maven.MavenModuleSetBuild$RunnerImpl.doRun(MavenModuleSetBuild.java:605)
	at hudson.model.AbstractBuild$AbstractRunner.run(AbstractBuild.java:473)
	at hudson.model.Run.run(Run.java:1408)
	at hudson.maven.MavenModuleSetBuild.run(MavenModuleSetBuild.java:481)
	at hudson.model.ResourceController.execute(ResourceController.java:88)
	at hudson.model.Executor.run(Executor.java:238)


Mime
View raw message