myfaces-commits mailing list archives

Site index · List index
Message view « Date » · « Thread »
Top « Date » · « Thread »
From Apache Jenkins Server <jenk...@builds.apache.org>
Subject Build failed in Jenkins: tobago-trunk #718
Date Mon, 21 May 2012 17:26:09 GMT
See <https://builds.apache.org/job/tobago-trunk/718/>

------------------------------------------
[...truncated 2763 lines...]
	at hudson.remoting.InterceptingExecutorService$1.call(InterceptingExecutorService.java:72)
	at java.util.concurrent.FutureTask$Sync.innerRun(FutureTask.java:269)
	at java.util.concurrent.FutureTask.run(FutureTask.java:123)
	at java.util.concurrent.ThreadPoolExecutor$Worker.runTask(ThreadPoolExecutor.java:651)
	at java.util.concurrent.ThreadPoolExecutor$Worker.run(ThreadPoolExecutor.java:676)
	at java.lang.Thread.run(Thread.java:595)
Caused by: org.tmatesoft.svn.core.SVNErrorMessage: svn: '<https://builds.apache.org/job/tobago-trunk/ws/tobago-trunk/src/site/resources/tobago-config_1_0.dtd'>
is not under version control
	at org.tmatesoft.svn.core.SVNErrorMessage.create(SVNErrorMessage.java:163)
	at org.tmatesoft.svn.core.SVNErrorMessage.create(SVNErrorMessage.java:118)
	... 17 more
ERROR: Failed to parse svn info for external https://svn.apache.org/repos/asf/myfaces/tobago/trunk/tobago-core/src/main/resources/org/apache/myfaces/tobago/config/tobago-config-1.0.29.dtd
at tobago-trunk/src/site/resources//tobago-config-1.0.29.dtd
org.tmatesoft.svn.core.SVNException: svn: '<https://builds.apache.org/job/tobago-trunk/ws/tobago-trunk/src/site/resources/tobago-config-1.0.29.dtd'>
is not under version control
	at org.tmatesoft.svn.core.internal.wc.SVNErrorManager.error(SVNErrorManager.java:64)
	at org.tmatesoft.svn.core.internal.wc.SVNErrorManager.error(SVNErrorManager.java:51)
	at org.tmatesoft.svn.core.wc.SVNWCClient$13.handleError(SVNWCClient.java:3327)
	at org.tmatesoft.svn.core.internal.wc.admin.SVNWCAccess.walkEntries(SVNWCAccess.java:771)
	at org.tmatesoft.svn.core.internal.wc.admin.SVNWCAccess.walkEntries(SVNWCAccess.java:754)
	at org.tmatesoft.svn.core.wc.SVNWCClient.crawlEntries(SVNWCClient.java:3305)
	at org.tmatesoft.svn.core.wc.SVNWCClient.doInfo(SVNWCClient.java:2506)
	at org.tmatesoft.svn.core.wc.SVNWCClient.doInfo(SVNWCClient.java:2873)
	at hudson.scm.SubversionSCM$BuildRevisionMapTask.invoke(SubversionSCM.java:1039)
	at hudson.scm.SubversionSCM$BuildRevisionMapTask.invoke(SubversionSCM.java:1009)
	at hudson.FilePath$FileCallableWrapper.call(FilePath.java:2154)
	at hudson.remoting.UserRequest.perform(UserRequest.java:118)
	at hudson.remoting.UserRequest.perform(UserRequest.java:48)
	at hudson.remoting.Request$2.run(Request.java:287)
	at hudson.remoting.InterceptingExecutorService$1.call(InterceptingExecutorService.java:72)
	at java.util.concurrent.FutureTask$Sync.innerRun(FutureTask.java:269)
	at java.util.concurrent.FutureTask.run(FutureTask.java:123)
	at java.util.concurrent.ThreadPoolExecutor$Worker.runTask(ThreadPoolExecutor.java:651)
	at java.util.concurrent.ThreadPoolExecutor$Worker.run(ThreadPoolExecutor.java:676)
	at java.lang.Thread.run(Thread.java:595)
Caused by: org.tmatesoft.svn.core.SVNErrorMessage: svn: '<https://builds.apache.org/job/tobago-trunk/ws/tobago-trunk/src/site/resources/tobago-config-1.0.29.dtd'>
is not under version control
	at org.tmatesoft.svn.core.SVNErrorMessage.create(SVNErrorMessage.java:163)
	at org.tmatesoft.svn.core.SVNErrorMessage.create(SVNErrorMessage.java:118)
	... 17 more
ERROR: Failed to parse svn info for external https://svn.apache.org/repos/asf/myfaces/tobago/trunk/tobago-core/src/main/resources/org/apache/myfaces/tobago/config/tobago-config-1.0.30.dtd
at tobago-trunk/src/site/resources//tobago-config-1.0.30.dtd
org.tmatesoft.svn.core.SVNException: svn: '<https://builds.apache.org/job/tobago-trunk/ws/tobago-trunk/src/site/resources/tobago-config-1.0.30.dtd'>
is not under version control
	at org.tmatesoft.svn.core.internal.wc.SVNErrorManager.error(SVNErrorManager.java:64)
	at org.tmatesoft.svn.core.internal.wc.SVNErrorManager.error(SVNErrorManager.java:51)
	at org.tmatesoft.svn.core.wc.SVNWCClient$13.handleError(SVNWCClient.java:3327)
	at org.tmatesoft.svn.core.internal.wc.admin.SVNWCAccess.walkEntries(SVNWCAccess.java:771)
	at org.tmatesoft.svn.core.internal.wc.admin.SVNWCAccess.walkEntries(SVNWCAccess.java:754)
	at org.tmatesoft.svn.core.wc.SVNWCClient.crawlEntries(SVNWCClient.java:3305)
	at org.tmatesoft.svn.core.wc.SVNWCClient.doInfo(SVNWCClient.java:2506)
	at org.tmatesoft.svn.core.wc.SVNWCClient.doInfo(SVNWCClient.java:2873)
	at hudson.scm.SubversionSCM$BuildRevisionMapTask.invoke(SubversionSCM.java:1039)
	at hudson.scm.SubversionSCM$BuildRevisionMapTask.invoke(SubversionSCM.java:1009)
	at hudson.FilePath$FileCallableWrapper.call(FilePath.java:2154)
	at hudson.remoting.UserRequest.perform(UserRequest.java:118)
	at hudson.remoting.UserRequest.perform(UserRequest.java:48)
	at hudson.remoting.Request$2.run(Request.java:287)
	at hudson.remoting.InterceptingExecutorService$1.call(InterceptingExecutorService.java:72)
	at java.util.concurrent.FutureTask$Sync.innerRun(FutureTask.java:269)
	at java.util.concurrent.FutureTask.run(FutureTask.java:123)
	at java.util.concurrent.ThreadPoolExecutor$Worker.runTask(ThreadPoolExecutor.java:651)
	at java.util.concurrent.ThreadPoolExecutor$Worker.run(ThreadPoolExecutor.java:676)
	at java.lang.Thread.run(Thread.java:595)
Caused by: org.tmatesoft.svn.core.SVNErrorMessage: svn: '<https://builds.apache.org/job/tobago-trunk/ws/tobago-trunk/src/site/resources/tobago-config-1.0.30.dtd'>
is not under version control
	at org.tmatesoft.svn.core.SVNErrorMessage.create(SVNErrorMessage.java:163)
	at org.tmatesoft.svn.core.SVNErrorMessage.create(SVNErrorMessage.java:118)
	... 17 more
ERROR: Failed to parse svn info for external https://svn.apache.org/repos/asf/myfaces/tobago/trunk/tobago-core/src/main/resources/org/apache/myfaces/tobago/config/tobago-config-1.0.34.dtd
at tobago-trunk/src/site/resources//tobago-config-1.0.34.dtd
org.tmatesoft.svn.core.SVNException: svn: '<https://builds.apache.org/job/tobago-trunk/ws/tobago-trunk/src/site/resources/tobago-config-1.0.34.dtd'>
is not under version control
	at org.tmatesoft.svn.core.internal.wc.SVNErrorManager.error(SVNErrorManager.java:64)
	at org.tmatesoft.svn.core.internal.wc.SVNErrorManager.error(SVNErrorManager.java:51)
	at org.tmatesoft.svn.core.wc.SVNWCClient$13.handleError(SVNWCClient.java:3327)
	at org.tmatesoft.svn.core.internal.wc.admin.SVNWCAccess.walkEntries(SVNWCAccess.java:771)
	at org.tmatesoft.svn.core.internal.wc.admin.SVNWCAccess.walkEntries(SVNWCAccess.java:754)
	at org.tmatesoft.svn.core.wc.SVNWCClient.crawlEntries(SVNWCClient.java:3305)
	at org.tmatesoft.svn.core.wc.SVNWCClient.doInfo(SVNWCClient.java:2506)
	at org.tmatesoft.svn.core.wc.SVNWCClient.doInfo(SVNWCClient.java:2873)
	at hudson.scm.SubversionSCM$BuildRevisionMapTask.invoke(SubversionSCM.java:1039)
	at hudson.scm.SubversionSCM$BuildRevisionMapTask.invoke(SubversionSCM.java:1009)
	at hudson.FilePath$FileCallableWrapper.call(FilePath.java:2154)
	at hudson.remoting.UserRequest.perform(UserRequest.java:118)
	at hudson.remoting.UserRequest.perform(UserRequest.java:48)
	at hudson.remoting.Request$2.run(Request.java:287)
	at hudson.remoting.InterceptingExecutorService$1.call(InterceptingExecutorService.java:72)
	at java.util.concurrent.FutureTask$Sync.innerRun(FutureTask.java:269)
	at java.util.concurrent.FutureTask.run(FutureTask.java:123)
	at java.util.concurrent.ThreadPoolExecutor$Worker.runTask(ThreadPoolExecutor.java:651)
	at java.util.concurrent.ThreadPoolExecutor$Worker.run(ThreadPoolExecutor.java:676)
	at java.lang.Thread.run(Thread.java:595)
Caused by: org.tmatesoft.svn.core.SVNErrorMessage: svn: '<https://builds.apache.org/job/tobago-trunk/ws/tobago-trunk/src/site/resources/tobago-config-1.0.34.dtd'>
is not under version control
	at org.tmatesoft.svn.core.SVNErrorMessage.create(SVNErrorMessage.java:163)
	at org.tmatesoft.svn.core.SVNErrorMessage.create(SVNErrorMessage.java:118)
	... 17 more
ERROR: Failed to parse svn info for external https://svn.apache.org/repos/asf/myfaces/tobago/trunk/tobago-core/src/main/resources/org/apache/myfaces/tobago/config/tobago-config-1.5.xsd
at tobago-trunk/src/site/resources//tobago-config-1.5.xsd
org.tmatesoft.svn.core.SVNException: svn: '<https://builds.apache.org/job/tobago-trunk/ws/tobago-trunk/src/site/resources/tobago-config-1.5.xsd'>
is not under version control
	at org.tmatesoft.svn.core.internal.wc.SVNErrorManager.error(SVNErrorManager.java:64)
	at org.tmatesoft.svn.core.internal.wc.SVNErrorManager.error(SVNErrorManager.java:51)
	at org.tmatesoft.svn.core.wc.SVNWCClient$13.handleError(SVNWCClient.java:3327)
	at org.tmatesoft.svn.core.internal.wc.admin.SVNWCAccess.walkEntries(SVNWCAccess.java:771)
	at org.tmatesoft.svn.core.internal.wc.admin.SVNWCAccess.walkEntries(SVNWCAccess.java:754)
	at org.tmatesoft.svn.core.wc.SVNWCClient.crawlEntries(SVNWCClient.java:3305)
	at org.tmatesoft.svn.core.wc.SVNWCClient.doInfo(SVNWCClient.java:2506)
	at org.tmatesoft.svn.core.wc.SVNWCClient.doInfo(SVNWCClient.java:2873)
	at hudson.scm.SubversionSCM$BuildRevisionMapTask.invoke(SubversionSCM.java:1039)
	at hudson.scm.SubversionSCM$BuildRevisionMapTask.invoke(SubversionSCM.java:1009)
	at hudson.FilePath$FileCallableWrapper.call(FilePath.java:2154)
	at hudson.remoting.UserRequest.perform(UserRequest.java:118)
	at hudson.remoting.UserRequest.perform(UserRequest.java:48)
	at hudson.remoting.Request$2.run(Request.java:287)
	at hudson.remoting.InterceptingExecutorService$1.call(InterceptingExecutorService.java:72)
	at java.util.concurrent.FutureTask$Sync.innerRun(FutureTask.java:269)
	at java.util.concurrent.FutureTask.run(FutureTask.java:123)
	at java.util.concurrent.ThreadPoolExecutor$Worker.runTask(ThreadPoolExecutor.java:651)
	at java.util.concurrent.ThreadPoolExecutor$Worker.run(ThreadPoolExecutor.java:676)
	at java.lang.Thread.run(Thread.java:595)
Caused by: org.tmatesoft.svn.core.SVNErrorMessage: svn: '<https://builds.apache.org/job/tobago-trunk/ws/tobago-trunk/src/site/resources/tobago-config-1.5.xsd'>
is not under version control
	at org.tmatesoft.svn.core.SVNErrorMessage.create(SVNErrorMessage.java:163)
	at org.tmatesoft.svn.core.SVNErrorMessage.create(SVNErrorMessage.java:118)
	... 17 more
no change for https://svn.apache.org/repos/asf/myfaces/tobago/trunk since the previous build
no revision recorded for null in the previous build
no revision recorded for null in the previous build
no revision recorded for null in the previous build
no revision recorded for null in the previous build
no revision recorded for null in the previous build
Parsing POMs
Modules changed, recalculating dependency graph
[tobago-trunk] $ /home/hudson/tools/java/latest1.6/bin/java -cp /export/home/hudson/hudson-slave/maven-agent.jar:/export/home/hudson/hudson-slave/classworlds.jar
hudson.maven.agent.Main /home/hudson/tools/maven/apache-maven-2.2.1 /zonestorage/hudson_solaris/home/hudson/hudson-slave/slave.jar
/export/home/hudson/hudson-slave/maven-interceptor.jar 38966 /export/home/hudson/hudson-slave/maven2.1-interceptor.jar
<===[JENKINS REMOTING CAPACITY]===>   channel started
log4j:WARN No appenders could be found for logger (org.apache.commons.beanutils.converters.BooleanConverter).
log4j:WARN Please initialize the log4j system properly.
Executing Maven:  -B -f <https://builds.apache.org/job/tobago-trunk/ws/tobago-trunk/pom.xml>
-Dmaven.repo.local=/export/home/hudson/hudson-slave/maven-repositories/1 -Pall-modules clean
animal-sniffer:check checkstyle:check install
[INFO] Scanning for projects...
[INFO] Reactor build order: 
[INFO]   Apache Tobago
[INFO]   Tobago Tool
[INFO]   Tobago Tool Annotation
[INFO]   Tobago Tool Apt
[INFO]   Tobago JSF Compatibility
[INFO]   Tobago Core
[INFO]   Tobago Extensions
[INFO]   Tobago Taglib Extension
[INFO]   Tobago Themes
[INFO]   Tobago Theme Standard
[INFO]   Tobago Theme Scarborough
[INFO]   Tobago Theme Speyside
[INFO]   Tobago Theme Richmond
[INFO]   Tobago Theme Charlotteville
[INFO]   Tobago Deprecation
[INFO]   Tobago Facelets
[INFO]   Tobago Fileupload
[INFO]   Tobago Sandbox
[INFO]   Tobago Security
[INFO]   Tobago Examples
[INFO]   Tobago Example Addressbook
[INFO]   Tobago Example Blank
[INFO]   Tobago Example Data
[INFO]   Tobago Example Demo
[INFO]   Tobago Example Non-Faces-Request
[INFO]   Tobago Example Experimental
[INFO]   Tobago Example Test
[INFO]   Tobago Example for Portlets
[INFO]   Tobago Example Sandbox
[INFO]   Tobago Example Security
[INFO]   Tobago Example Assembly
[INFO]   Tobago Theme Example
[INFO]   Tobago Assembly
[INFO] ------------------------------------------------------------------------
[INFO] Building Apache Tobago
[INFO]    task-segment: [clean, animal-sniffer:check, checkstyle:check, install]
[INFO] ------------------------------------------------------------------------
[INFO] [clean:clean {execution: default-clean}]
[JENKINS] Archiving <https://builds.apache.org/job/tobago-trunk/ws/tobago-trunk/pom.xml>
to /home/hudson/hudson/jobs/tobago-trunk/modules/org.apache.myfaces.tobago$tobago/builds/2012-05-21_14-38-55/archive/org.apache.myfaces.tobago/tobago/1.5.7-SNAPSHOT/tobago-1.5.7-SNAPSHOT.pom
[JENKINS] Archiving <https://builds.apache.org/job/tobago-trunk/ws/tobago-trunk/target/tobago-1.5.7-SNAPSHOT-site.xml>
to /home/hudson/hudson/jobs/tobago-trunk/modules/org.apache.myfaces.tobago$tobago/builds/2012-05-21_14-38-55/archive/org.apache.myfaces.tobago/tobago/1.5.7-SNAPSHOT/tobago-1.5.7-SNAPSHOT-site.xml
Build timed out (after 150 minutes). Marking the build as failed.
[INFO] [animal-sniffer:check {execution: default-cli}]
[INFO] Checking unresolved references to org.codehaus.mojo.signature:java15:1.0
[INFO] [checkstyle:check {execution: default-cli}]
[INFO] 
[INFO] [enforcer:enforce {execution: enforce}]
[INFO] [remote-resources:process {execution: default}]
[INFO] [build-helper:add-source {execution: default}]
[INFO] Source directory: <https://builds.apache.org/job/tobago-trunk/ws/tobago-trunk/src/main/java-jsf-1.2>
added.
[INFO] [site:attach-descriptor {execution: default-attach-descriptor}]
[INFO] [install:install {execution: default-install}]
[INFO] Installing <https://builds.apache.org/job/tobago-trunk/ws/tobago-trunk/pom.xml>
to /export/home/hudson/hudson-slave/maven-repositories/1/org/apache/myfaces/tobago/tobago/1.5.7-SNAPSHOT/tobago-1.5.7-SNAPSHOT.pom
[INFO] Installing <https://builds.apache.org/job/tobago-trunk/ws/tobago-trunk/target/tobago-1.5.7-SNAPSHOT-site.xml>
to /export/home/hudson/hudson-slave/maven-repositories/1/org/apache/myfaces/tobago/tobago/1.5.7-SNAPSHOT/tobago-1.5.7-SNAPSHOT-site.xml
channel stopped
[INFO] ------------------------------------------------------------------------
[ERROR] FATAL ERROR
[INFO] ------------------------------------------------------------------------
[INFO] null
[INFO] ------------------------------------------------------------------------
[INFO] Trace
java.lang.reflect.UndeclaredThrowableException
	at $Proxy2.isArchivingDisabled(Unknown Source)
	at hudson.maven.MavenBuildProxy$Filter.isArchivingDisabled(MavenBuildProxy.java:227)
	at hudson.maven.reporters.MavenArtifact.archive(MavenArtifact.java:223)
	at hudson.maven.reporters.MavenArtifactArchiver.postBuild(MavenArtifactArchiver.java:108)
	at hudson.maven.Maven2Builder.postModule(Maven2Builder.java:127)
	at hudson.maven.MavenBuilder$Adapter.fireLeaveModule(MavenBuilder.java:327)
	at hudson.maven.MavenBuilder$Adapter.postBuild(MavenBuilder.java:285)
	at org.apache.maven.lifecycle.LifecycleExecutorInterceptor.execute(LifecycleExecutorInterceptor.java:68)
	at org.apache.maven.DefaultMaven.doExecute(DefaultMaven.java:328)
	at org.apache.maven.DefaultMaven.execute(DefaultMaven.java:138)
	at org.apache.maven.cli.MavenCli.main(MavenCli.java:362)
	at sun.reflect.NativeMethodAccessorImpl.invoke0(Native Method)
	at sun.reflect.NativeMethodAccessorImpl.invoke(NativeMethodAccessorImpl.java:39)
	at sun.reflect.DelegatingMethodAccessorImpl.invoke(DelegatingMethodAccessorImpl.java:25)
	at java.lang.reflect.Method.invoke(Method.java:597)
	at org.codehaus.classworlds.Launcher.launchEnhanced(Launcher.java:315)
	at org.codehaus.classworlds.Launcher.launch(Launcher.java:255)
	at hudson.maven.agent.Main.launch(Main.java:185)
	at hudson.maven.MavenBuilder.call(MavenBuilder.java:151)
	at hudson.maven.Maven2Builder.call(Maven2Builder.java:77)
	at hudson.maven.Maven2Builder.call(Maven2Builder.java:53)
	at hudson.remoting.UserRequest.perform(UserRequest.java:118)
	at hudson.remoting.UserRequest.perform(UserRequest.java:48)
	at hudson.remoting.Request$2.run(Request.java:287)
	at hudson.remoting.InterceptingExecutorService$1.call(InterceptingExecutorService.java:72)
	at java.util.concurrent.FutureTask$Sync.innerRun(FutureTask.java:303)
	at java.util.concurrent.FutureTask.run(FutureTask.java:138)
	at java.util.concurrent.ThreadPoolExecutor$Worker.runTask(ThreadPoolExecutor.java:886)
	at java.util.concurrent.ThreadPoolExecutor$Worker.run(ThreadPoolExecutor.java:908)
	at java.lang.Thread.run(Thread.java:662)
Caused by: hudson.remoting.ChannelClosedException: channel is already closed
	at hudson.remoting.Channel.send(Channel.java:475)
	at hudson.remoting.Request.call(Request.java:110)
	at hudson.remoting.Channel.call(Channel.java:646)
	at hudson.remoting.RemoteInvocationHandler.invoke(RemoteInvocationHandler.java:158)
	... 30 more
Caused by: hudson.remoting.Channel$OrderlyShutdown
	at hudson.remoting.Channel$CloseCommand.execute(Channel.java:818)
	at hudson.remoting.Channel$1.handle(Channel.java:416)
	at hudson.remoting.SynchronousCommandTransport$ReaderThread.run(SynchronousCommandTransport.java:60)
Caused by: Command close created at
	at hudson.remoting.Command.<init>(Command.java:54)
	at hudson.remoting.Channel$CloseCommand.<init>(Channel.java:812)
	at hudson.remoting.Channel$CloseCommand.<init>(Channel.java:810)
	at hudson.remoting.Channel.close(Channel.java:877)
	at hudson.remoting.Channel.close(Channel.java:860)
	at hudson.slaves.Channels$1.close(Channels.java:91)
	at hudson.maven.ProcessCache$MavenProcess.discard(ProcessCache.java:145)
	at hudson.maven.MavenModuleSetBuild$RunnerImpl.doRun(MavenModuleSetBuild.java:796)
	at hudson.model.AbstractBuild$AbstractRunner.run(AbstractBuild.java:475)
	at hudson.model.Run.run(Run.java:1434)
	at hudson.maven.MavenModuleSetBuild.run(MavenModuleSetBuild.java:477)
	at hudson.model.ResourceController.execute(ResourceController.java:88)
	at hudson.model.Executor.run(Executor.java:239)
[INFO] ------------------------------------------------------------------------
[INFO] Total time: 66 minutes 23 seconds
[INFO] Finished at: Mon May 21 16:36:34 GMT+00:00 2012
[INFO] Final Memory: 49M/386M
[INFO] ------------------------------------------------------------------------

Mime
View raw message