myfaces-commits mailing list archives

Site index · List index
Message view « Date » · « Thread »
Top « Date » · « Thread »
From Apache Jenkins Server <jenk...@builds.apache.org>
Subject Build failed in Jenkins: tobago-trunk #738
Date Wed, 30 May 2012 08:04:16 GMT
See <https://builds.apache.org/job/tobago-trunk/738/changes>

Changes:

[lofwyr] TOBAGO-1145: The tobago-deprecation.jar will be reduced in Tobago 1.6 
 - incompatible TreeState class
 - empty packages

[lofwyr] incompatible TreeState class

------------------------------------------
[...truncated 17692 lines...]
[JENKINS] Recording test results
[INFO] [jar:jar {execution: default-jar}]
[INFO] Building jar: <https://builds.apache.org/job/tobago-trunk/ws/tobago-trunk/tobago-theme/tobago-theme-scarborough/target/tobago-theme-scarborough-1.6.0-SNAPSHOT.jar>
[INFO] [install:install {execution: default-install}]
[INFO] Installing <https://builds.apache.org/job/tobago-trunk/ws/tobago-trunk/tobago-theme/tobago-theme-scarborough/target/tobago-theme-scarborough-1.6.0-SNAPSHOT.jar>
to /home/jenkins/jenkins-slave/maven-repositories/1/org/apache/myfaces/tobago/tobago-theme-scarborough/1.6.0-SNAPSHOT/tobago-theme-scarborough-1.6.0-SNAPSHOT.jar
[JENKINS] Archiving <https://builds.apache.org/job/tobago-trunk/ws/tobago-trunk/tobago-theme/tobago-theme-scarborough/pom.xml>
to /home/hudson/hudson/jobs/tobago-trunk/modules/org.apache.myfaces.tobago$tobago-theme-scarborough/builds/2012-05-30_08-01-18/archive/org.apache.myfaces.tobago/tobago-theme-scarborough/1.6.0-SNAPSHOT/tobago-theme-scarborough-1.6.0-SNAPSHOT.pom
[JENKINS] Archiving <https://builds.apache.org/job/tobago-trunk/ws/tobago-trunk/tobago-theme/tobago-theme-scarborough/target/tobago-theme-scarborough-1.6.0-SNAPSHOT.jar>
to /home/hudson/hudson/jobs/tobago-trunk/modules/org.apache.myfaces.tobago$tobago-theme-scarborough/builds/2012-05-30_08-01-18/archive/org.apache.myfaces.tobago/tobago-theme-scarborough/1.6.0-SNAPSHOT/tobago-theme-scarborough-1.6.0-SNAPSHOT.jar
[INFO] ------------------------------------------------------------------------
[INFO] Building Tobago Theme Speyside
[INFO]    task-segment: [clean, animal-sniffer:check, checkstyle:check, install]
[INFO] ------------------------------------------------------------------------
Downloading: http://repo1.maven.org/maven2/org/lesscss/lesscss-maven-plugin/1.3.0/lesscss-maven-plugin-1.3.0.pom

Downloading: http://repo1.maven.org/maven2/org/lesscss/lesscss-maven-plugin/1.3.0/lesscss-maven-plugin-1.3.0.jar

[INFO] [clean:clean {execution: default-clean}]
[INFO] [animal-sniffer:check {execution: default-cli}]
[INFO] Checking unresolved references to org.codehaus.mojo.signature:java15:1.0
[INFO] [checkstyle:check {execution: default-cli}]
[INFO] 
[INFO] [enforcer:enforce {execution: enforce}]
Downloading: http://repo1.maven.org/maven2/org/lesscss/lesscss/1.3.0/lesscss-1.3.0.pom

Downloading: http://repo1.maven.org/maven2/org/sonatype/plexus/plexus-build-api/0.0.7/plexus-build-api-0.0.7.pom

Downloading: http://repo1.maven.org/maven2/org/lesscss/lesscss/1.3.0/lesscss-1.3.0.jar
Downloading: http://repo1.maven.org/maven2/org/sonatype/plexus/plexus-build-api/0.0.7/plexus-build-api-0.0.7.jar


[INFO] [lesscss:compile {execution: default}]
[INFO] Compiling LESS source: org/apache/myfaces/tobago/renderkit/html/speyside/standard/style/style.less...
[  Envjs/1.6 (Rhino; U; Linux i386 2.6.32-33-server; en-US; rv:1.7.0.rc2) Resig/20070309 PilotFish/1.2.13
 ]
[INFO] Compilation finished in 3101 ms
[INFO] [remote-resources:process {execution: default}]
[debug] execute contextualize
[INFO] [resources:resources {execution: default-resources}]
[INFO] Using 'UTF-8' encoding to copy filtered resources.
[INFO] Copying 90 resources
[INFO] Copying 3 resources
[INFO] [build-helper:add-source {execution: default}]
[INFO] Source directory: <https://builds.apache.org/job/tobago-trunk/ws/tobago-trunk/tobago-theme/tobago-theme-speyside/src/main/java-jsf-1.2>
added.
[INFO] [yuicompressor:compress {execution: default}]
[INFO] style.css (1617b) -> style.min.css (434b)[26%]
[INFO] style.css (16824b) -> style.min.css (9665b)[57%]
[INFO] style.css (962b) -> style.min.css (28b)[2%]
[INFO] style.css (1245b) -> style.min.css (209b)[16%]
[INFO] style.css (1617b) -> style.min.css (434b)[26%]
[INFO] style.css (962b) -> style.min.css (28b)[2%]
[INFO] style.css (1245b) -> style.min.css (209b)[16%]
[INFO] total input (24472b) -> output (11007b)[44%]
[INFO] nb warnings: 0, nb errors: 0
[INFO] [compiler:compile {execution: default-compile}]
[INFO] Compiling 2 source files to <https://builds.apache.org/job/tobago-trunk/ws/tobago-trunk/tobago-theme/tobago-theme-speyside/target/classes>
[debug] execute contextualize
[INFO] [resources:testResources {execution: default-testResources}]
[INFO] Using 'UTF-8' encoding to copy filtered resources.
[INFO] skip non existing resourceDirectory <https://builds.apache.org/job/tobago-trunk/ws/tobago-trunk/tobago-theme/tobago-theme-speyside/src/test/resources>
[INFO] Copying 3 resources
[INFO] [compiler:testCompile {execution: default-testCompile}]
[INFO] No sources to compile
[INFO] [surefire:test {execution: default-test}]
[INFO] Surefire report directory: <https://builds.apache.org/job/tobago-trunk/ws/tobago-trunk/tobago-theme/tobago-theme-speyside/target/surefire-reports>

-------------------------------------------------------
 T E S T S
-------------------------------------------------------

Results :

Tests run: 0, Failures: 0, Errors: 0, Skipped: 0

[JENKINS] Recording test results[INFO] [dependency:unpack {execution: unpack-external-images}]
[INFO] Configured Artifact: org.tango-project:tango-icon-theme:0.8.0:jar
[INFO] Unpacking /home/jenkins/jenkins-slave/maven-repositories/1/org/tango-project/tango-icon-theme/0.8.0/tango-icon-theme-0.8.0.jar
to <https://builds.apache.org/job/tobago-trunk/ws/tobago-trunk/tobago-theme/tobago-theme-speyside/target/external-images>
with includes "" and excludes ""

[debug] execute contextualize
[INFO] [resources:copy-resources {execution: copy-external-images}]
[INFO] Using 'UTF-8' encoding to copy filtered resources.
[INFO] Copying 3 resources to org/apache/myfaces/tobago/renderkit/html/speyside/standard/image
[INFO] Copying 1 resource to org/apache/myfaces/tobago/renderkit/html/speyside/standard/image
[INFO] [jar:jar {execution: default-jar}]
[INFO] Building jar: <https://builds.apache.org/job/tobago-trunk/ws/tobago-trunk/tobago-theme/tobago-theme-speyside/target/tobago-theme-speyside-1.6.0-SNAPSHOT.jar>
[INFO] [install:install {execution: default-install}]
[INFO] Installing <https://builds.apache.org/job/tobago-trunk/ws/tobago-trunk/tobago-theme/tobago-theme-speyside/target/tobago-theme-speyside-1.6.0-SNAPSHOT.jar>
to /home/jenkins/jenkins-slave/maven-repositories/1/org/apache/myfaces/tobago/tobago-theme-speyside/1.6.0-SNAPSHOT/tobago-theme-speyside-1.6.0-SNAPSHOT.jar
[JENKINS] Archiving <https://builds.apache.org/job/tobago-trunk/ws/tobago-trunk/tobago-theme/tobago-theme-speyside/pom.xml>
to /home/hudson/hudson/jobs/tobago-trunk/modules/org.apache.myfaces.tobago$tobago-theme-speyside/builds/2012-05-30_08-01-18/archive/org.apache.myfaces.tobago/tobago-theme-speyside/1.6.0-SNAPSHOT/tobago-theme-speyside-1.6.0-SNAPSHOT.pom
[JENKINS] Archiving <https://builds.apache.org/job/tobago-trunk/ws/tobago-trunk/tobago-theme/tobago-theme-speyside/target/tobago-theme-speyside-1.6.0-SNAPSHOT.jar>
to /home/hudson/hudson/jobs/tobago-trunk/modules/org.apache.myfaces.tobago$tobago-theme-speyside/builds/2012-05-30_08-01-18/archive/org.apache.myfaces.tobago/tobago-theme-speyside/1.6.0-SNAPSHOT/tobago-theme-speyside-1.6.0-SNAPSHOT.jar
[INFO] ------------------------------------------------------------------------
[INFO] Building Tobago Theme Richmond
[INFO]    task-segment: [clean, animal-sniffer:check, checkstyle:check, install]
[INFO] ------------------------------------------------------------------------
[INFO] [clean:clean {execution: default-clean}]
[INFO] [animal-sniffer:check {execution: default-cli}]
[INFO] Checking unresolved references to org.codehaus.mojo.signature:java15:1.0
[INFO] [checkstyle:check {execution: default-cli}]
[INFO] 
[INFO] [enforcer:enforce {execution: enforce}]
[INFO] [remote-resources:process {execution: default}]
[debug] execute contextualize
[INFO] [resources:resources {execution: default-resources}]
[INFO] Using 'UTF-8' encoding to copy filtered resources.
[INFO] Copying 57 resources
[INFO] Copying 3 resources
[INFO] [build-helper:add-source {execution: default}]
[INFO] Source directory: <https://builds.apache.org/job/tobago-trunk/ws/tobago-trunk/tobago-theme/tobago-theme-richmond/src/main/java-jsf-1.2>
added.
[INFO] [yuicompressor:compress {execution: default}]
[INFO] style.css (1227b) -> style.min.css (246b)[20%]
[INFO] style.css (8223b) -> style.min.css (4572b)[55%]
[INFO] total input (9450b) -> output (4818b)[50%]
[INFO] nb warnings: 0, nb errors: 0
[INFO] [compiler:compile {execution: default-compile}]
[INFO] No sources to compile
[debug] execute contextualize
[INFO] [resources:testResources {execution: default-testResources}]
[INFO] Using 'UTF-8' encoding to copy filtered resources.
[INFO] skip non existing resourceDirectory <https://builds.apache.org/job/tobago-trunk/ws/tobago-trunk/tobago-theme/tobago-theme-richmond/src/test/resources>
[INFO] Copying 3 resources
[INFO] [compiler:testCompile {execution: default-testCompile}]
[INFO] No sources to compile
[INFO] [surefire:test {execution: default-test}]
[INFO] Surefire report directory: <https://builds.apache.org/job/tobago-trunk/ws/tobago-trunk/tobago-theme/tobago-theme-richmond/target/surefire-reports>

-------------------------------------------------------
 T E S T S
-------------------------------------------------------

Results :

Tests run: 0, Failures: 0, Errors: 0, Skipped: 0

[JENKINS] Recording test results
[INFO] [jar:jar {execution: default-jar}]
[INFO] Building jar: <https://builds.apache.org/job/tobago-trunk/ws/tobago-trunk/tobago-theme/tobago-theme-richmond/target/tobago-theme-richmond-1.6.0-SNAPSHOT.jar>
[INFO] [install:install {execution: default-install}]
[INFO] Installing <https://builds.apache.org/job/tobago-trunk/ws/tobago-trunk/tobago-theme/tobago-theme-richmond/target/tobago-theme-richmond-1.6.0-SNAPSHOT.jar>
to /home/jenkins/jenkins-slave/maven-repositories/1/org/apache/myfaces/tobago/tobago-theme-richmond/1.6.0-SNAPSHOT/tobago-theme-richmond-1.6.0-SNAPSHOT.jar
[JENKINS] Archiving <https://builds.apache.org/job/tobago-trunk/ws/tobago-trunk/tobago-theme/tobago-theme-richmond/pom.xml>
to /home/hudson/hudson/jobs/tobago-trunk/modules/org.apache.myfaces.tobago$tobago-theme-richmond/builds/2012-05-30_08-01-18/archive/org.apache.myfaces.tobago/tobago-theme-richmond/1.6.0-SNAPSHOT/tobago-theme-richmond-1.6.0-SNAPSHOT.pom
[JENKINS] Archiving <https://builds.apache.org/job/tobago-trunk/ws/tobago-trunk/tobago-theme/tobago-theme-richmond/target/tobago-theme-richmond-1.6.0-SNAPSHOT.jar>
to /home/hudson/hudson/jobs/tobago-trunk/modules/org.apache.myfaces.tobago$tobago-theme-richmond/builds/2012-05-30_08-01-18/archive/org.apache.myfaces.tobago/tobago-theme-richmond/1.6.0-SNAPSHOT/tobago-theme-richmond-1.6.0-SNAPSHOT.jar
[INFO] ------------------------------------------------------------------------
[INFO] Building Tobago Theme Charlotteville
[INFO]    task-segment: [clean, animal-sniffer:check, checkstyle:check, install]
[INFO] ------------------------------------------------------------------------
[INFO] [clean:clean {execution: default-clean}]
[INFO] [animal-sniffer:check {execution: default-cli}]
[INFO] Checking unresolved references to org.codehaus.mojo.signature:java15:1.0
[INFO] [checkstyle:check {execution: default-cli}]
[INFO] 
[INFO] [enforcer:enforce {execution: enforce}]
[INFO] [remote-resources:process {execution: default}]
[debug] execute contextualize
[INFO] [resources:resources {execution: default-resources}]
[INFO] Using 'UTF-8' encoding to copy filtered resources.
[INFO] Copying 4 resources
[INFO] Copying 3 resources
[INFO] [build-helper:add-source {execution: default}]
[INFO] Source directory: <https://builds.apache.org/job/tobago-trunk/ws/tobago-trunk/tobago-theme/tobago-theme-charlotteville/src/main/java-jsf-1.2>
added.
[INFO] [yuicompressor:compress {execution: default}]
[INFO] style.css (4780b) -> style.min.css (2498b)[52%]
[INFO] total input (4780b) -> output (2498b)[52%]
[INFO] nb warnings: 0, nb errors: 0
[INFO] [compiler:compile {execution: default-compile}]
[INFO] No sources to compile
[debug] execute contextualize
[INFO] [resources:testResources {execution: default-testResources}]
[INFO] Using 'UTF-8' encoding to copy filtered resources.
[INFO] skip non existing resourceDirectory <https://builds.apache.org/job/tobago-trunk/ws/tobago-trunk/tobago-theme/tobago-theme-charlotteville/src/test/resources>
[INFO] Copying 3 resources
[INFO] [compiler:testCompile {execution: default-testCompile}]
[INFO] No sources to compile
[INFO] [surefire:test {execution: default-test}]
[INFO] Surefire report directory: <https://builds.apache.org/job/tobago-trunk/ws/tobago-trunk/tobago-theme/tobago-theme-charlotteville/target/surefire-reports>

-------------------------------------------------------
 T E S T S
-------------------------------------------------------

Results :

Tests run: 0, Failures: 0, Errors: 0, Skipped: 0

[JENKINS] Recording test results
[INFO] [jar:jar {execution: default-jar}]
[INFO] Building jar: <https://builds.apache.org/job/tobago-trunk/ws/tobago-trunk/tobago-theme/tobago-theme-charlotteville/target/tobago-theme-charlotteville-1.6.0-SNAPSHOT.jar>
[INFO] [install:install {execution: default-install}]
[INFO] Installing <https://builds.apache.org/job/tobago-trunk/ws/tobago-trunk/tobago-theme/tobago-theme-charlotteville/target/tobago-theme-charlotteville-1.6.0-SNAPSHOT.jar>
to /home/jenkins/jenkins-slave/maven-repositories/1/org/apache/myfaces/tobago/tobago-theme-charlotteville/1.6.0-SNAPSHOT/tobago-theme-charlotteville-1.6.0-SNAPSHOT.jar
[JENKINS] Archiving <https://builds.apache.org/job/tobago-trunk/ws/tobago-trunk/tobago-theme/tobago-theme-charlotteville/pom.xml>
to /home/hudson/hudson/jobs/tobago-trunk/modules/org.apache.myfaces.tobago$tobago-theme-charlotteville/builds/2012-05-30_08-01-18/archive/org.apache.myfaces.tobago/tobago-theme-charlotteville/1.6.0-SNAPSHOT/tobago-theme-charlotteville-1.6.0-SNAPSHOT.pom
[JENKINS] Archiving <https://builds.apache.org/job/tobago-trunk/ws/tobago-trunk/tobago-theme/tobago-theme-charlotteville/target/tobago-theme-charlotteville-1.6.0-SNAPSHOT.jar>
to /home/hudson/hudson/jobs/tobago-trunk/modules/org.apache.myfaces.tobago$tobago-theme-charlotteville/builds/2012-05-30_08-01-18/archive/org.apache.myfaces.tobago/tobago-theme-charlotteville/1.6.0-SNAPSHOT/tobago-theme-charlotteville-1.6.0-SNAPSHOT.jar
[INFO] ------------------------------------------------------------------------
[INFO] Building Tobago Deprecation
[INFO]    task-segment: [clean, animal-sniffer:check, checkstyle:check, install]
[INFO] ------------------------------------------------------------------------
[INFO] [clean:clean {execution: default-clean}]
[INFO] [animal-sniffer:check {execution: default-cli}]
[INFO] Checking unresolved references to org.codehaus.mojo.signature:java15:1.0
[INFO] [checkstyle:check {execution: default-cli}]
[INFO] 
[INFO] [enforcer:enforce {execution: enforce}]
[INFO] [remote-resources:process {execution: default}]
[debug] execute contextualize
[INFO] [resources:resources {execution: default-resources}]
[INFO] Using 'UTF-8' encoding to copy filtered resources.
[INFO] skip non existing resourceDirectory <https://builds.apache.org/job/tobago-trunk/ws/tobago-trunk/tobago-extension/tobago-deprecation/src/main/resources>
[INFO] Copying 3 resources
[INFO] [build-helper:add-source {execution: default}]
[INFO] Source directory: <https://builds.apache.org/job/tobago-trunk/ws/tobago-trunk/tobago-extension/tobago-deprecation/src/main/java-jsf-1.2>
added.
[INFO] [compiler:compile {execution: default-compile}]
[INFO] Compiling 16 source files to <https://builds.apache.org/job/tobago-trunk/ws/tobago-trunk/tobago-extension/tobago-deprecation/target/classes>
[INFO] -------------------------------------------------------------
[ERROR] COMPILATION ERROR : 
[INFO] -------------------------------------------------------------
[ERROR] <https://builds.apache.org/job/tobago-trunk/ws/tobago-trunk/tobago-extension/tobago-deprecation/src/main/java/org/apache/myfaces/tobago/component/UITreeOld.java>:[313,34]
cannot find symbol
symbol  : method getSelection()
location: class org.apache.myfaces.tobago.model.TreeState
[ERROR] <https://builds.apache.org/job/tobago-trunk/ws/tobago-trunk/tobago-extension/tobago-deprecation/src/main/java/org/apache/myfaces/tobago/component/UITreeOld.java>:[324,56]
cannot find symbol
symbol  : method getSelection()
location: class org.apache.myfaces.tobago.model.TreeState
[ERROR] <https://builds.apache.org/job/tobago-trunk/ws/tobago-trunk/tobago-extension/tobago-deprecation/src/main/java/org/apache/myfaces/tobago/component/UITreeOld.java>:[411,16]
cannot find symbol
symbol  : constructor TreeState()
location: class org.apache.myfaces.tobago.model.TreeState
[ERROR] <https://builds.apache.org/job/tobago-trunk/ws/tobago-trunk/tobago-extension/tobago-deprecation/src/main/java/org/apache/myfaces/tobago/component/UITreeOld.java>:[416,18]
cannot find symbol
symbol  : constructor TreeState()
location: class org.apache.myfaces.tobago.model.TreeState
[INFO] 4 errors 
[INFO] -------------------------------------------------------------
[JENKINS] Archiving <https://builds.apache.org/job/tobago-trunk/ws/tobago-trunk/tobago-extension/tobago-deprecation/pom.xml>
to /home/hudson/hudson/jobs/tobago-trunk/modules/org.apache.myfaces.tobago$tobago-deprecation/builds/2012-05-30_08-01-18/archive/org.apache.myfaces.tobago/tobago-deprecation/1.6.0-SNAPSHOT/tobago-deprecation-1.6.0-SNAPSHOT.pom
[INFO] ------------------------------------------------------------------------
[ERROR] BUILD FAILURE
[INFO] ------------------------------------------------------------------------
[INFO] Compilation failure

<https://builds.apache.org/job/tobago-trunk/ws/tobago-trunk/tobago-extension/tobago-deprecation/src/main/java/org/apache/myfaces/tobago/component/UITreeOld.java>:[313,34]
cannot find symbol
symbol  : method getSelection()
location: class org.apache.myfaces.tobago.model.TreeState
<https://builds.apache.org/job/tobago-trunk/ws/tobago-trunk/tobago-extension/tobago-deprecation/src/main/java/org/apache/myfaces/tobago/component/UITreeOld.java>:[324,56]
cannot find symbol
symbol  : method getSelection()
location: class org.apache.myfaces.tobago.model.TreeState
<https://builds.apache.org/job/tobago-trunk/ws/tobago-trunk/tobago-extension/tobago-deprecation/src/main/java/org/apache/myfaces/tobago/component/UITreeOld.java>:[411,16]
cannot find symbol
symbol  : constructor TreeState()
location: class org.apache.myfaces.tobago.model.TreeState
<https://builds.apache.org/job/tobago-trunk/ws/tobago-trunk/tobago-extension/tobago-deprecation/src/main/java/org/apache/myfaces/tobago/component/UITreeOld.java>:[416,18]
cannot find symbol
symbol  : constructor TreeState()
location: class org.apache.myfaces.tobago.model.TreeState

[INFO] ------------------------------------------------------------------------
[INFO] For more information, run Maven with the -e switch
[INFO] ------------------------------------------------------------------------
[INFO] Total time: 2 minutes 30 seconds
[INFO] Finished at: Wed May 30 08:04:15 UTC 2012
[INFO] Final Memory: 111M/432M
[INFO] ------------------------------------------------------------------------
channel stopped

Mime
View raw message