myfaces-commits mailing list archives

Site index · List index
Message view « Date » · « Thread »
Top « Date » · « Thread »
From Apache Jenkins Server <jenk...@builds.apache.org>
Subject Build failed in Jenkins: Trinidad Core Trunk (sanity) #714
Date Fri, 25 May 2012 20:33:08 GMT
See <https://builds.apache.org/job/Trinidad%20Core%20Trunk%20(sanity)/714/changes>

Changes:

[gcrawford] TRINIDAD-2269 tr:convertDateTime with dateStyle="long", locale="tr_TR" gives error
for certain days 

Thanks to yee-wah

------------------------------------------
Started by an SCM change
Building remotely on ubuntu1 in workspace <https://builds.apache.org/job/Trinidad%20Core%20Trunk%20(sanity)/ws/>
Updating https://svn.apache.org/repos/asf/myfaces/trinidad/trunk
U         trinidad-api/src/main/java/org/apache/myfaces/trinidad/webapp/UploadedFileProcessor.java
U         trinidad-impl/src/main/java/org/apache/myfaces/trinidadinternal/config/upload/UploadedFileProcessorImpl.java
U         trinidad-impl/src/main/java/org/apache/myfaces/trinidadinternal/config/upload/CompositeUploadedFileProcessorImpl.java
U         trinidad-impl/src/main/javascript/META-INF/adf/jsLibs/DateFormat.js
At revision 1342803
Parsing POMs
Modules changed, recalculating dependency graph
[Trinidad Core Trunk (sanity)] $ /home/hudson/tools/java/latest1.6/bin/java -Xms512m -Xmx1024m
-XX:PermSize=256m -XX:MaxPermSize=512m -cp /home/jenkins/jenkins-slave/maven3-agent.jar:/home/hudson/tools/maven/latest3/boot/plexus-classworlds-2.4.jar
org.jvnet.hudson.maven3.agent.Maven3Main /home/hudson/tools/maven/latest3 /home/jenkins/jenkins-slave/slave.jar
/home/jenkins/jenkins-slave/maven3-interceptor.jar 37246
<===[JENKINS REMOTING CAPACITY]===>channel started
   log4j:WARN No appenders could be found for logger (org.apache.commons.beanutils.converters.BooleanConverter).
log4j:WARN Please initialize the log4j system properly.
Executing Maven:  -B -f <https://builds.apache.org/job/Trinidad%20Core%20Trunk%20(sanity)/ws/pom.xml>
-Dmaven.repo.local=/home/jenkins/jenkins-slave/maven-repositories/0 clean install -B -U -e
-fae -V -Dmaven.repo.remote=https://repository.apache.org/content/groups/snapshots/
Apache Maven 3.0.3 (r1075438; 2011-02-28 17:31:09+0000)
Maven home: /home/jenkins/tools/maven/apache-maven-3.0.3
Java version: 1.6.0_27, vendor: Sun Microsystems Inc.
Java home: /home/jenkins/tools/java/jdk1.6.0_27-32/jre
Default locale: en_US, platform encoding: ANSI_X3.4-1968
OS name: "linux", version: "2.6.38-8-server", arch: "i386", family: "unix"
[INFO] Error stacktraces are turned on.
[INFO] Scanning for projects...
[INFO] ------------------------------------------------------------------------
[INFO] Reactor Build Order:
[INFO] 
[INFO] Apache MyFaces Trinidad
[INFO] Apache MyFaces Trinidad Build
[INFO] Apache MyFaces Trinidad API
[INFO] Apache MyFaces Trinidad Impl
[INFO] Apache MyFaces Trinidad Examples
[INFO] Apache MyFaces Trinidad Blank Demo
[INFO] Apache MyFaces Trinidad Demo
[INFO] Apache MyFaces Trinidad Components Showcase
Projects to build: [MavenProject: org.apache.myfaces.trinidad:trinidad:2.1.0-SNAPSHOT @ <https://builds.apache.org/job/Trinidad%20Core%20Trunk%20(sanity)/ws/pom.xml,>
MavenProject: org.apache.myfaces.trinidad:trinidad-build:2.1.0-SNAPSHOT @ <https://builds.apache.org/job/Trinidad%20Core%20Trunk%20(sanity)/ws/trinidad-build/pom.xml,>
MavenProject: org.apache.myfaces.trinidad:trinidad-api:2.1.0-SNAPSHOT @ <https://builds.apache.org/job/Trinidad%20Core%20Trunk%20(sanity)/ws/trinidad-api/pom.xml,>
MavenProject: org.apache.myfaces.trinidad:trinidad-impl:2.1.0-SNAPSHOT @ <https://builds.apache.org/job/Trinidad%20Core%20Trunk%20(sanity)/ws/trinidad-impl/pom.xml,>
MavenProject: org.apache.myfaces.trinidad:trinidad-example:2.1.0-SNAPSHOT @ <https://builds.apache.org/job/Trinidad%20Core%20Trunk%20(sanity)/ws/trinidad-examples/pom.xml,>
MavenProject: org.apache.myfaces.trinidad:trinidad-blank:2.1.0-SNAPSHOT @ <https://builds.apache.org/job/Trinidad%20Core%20Trunk%20(sanity)/ws/trinidad-examples/trinidad-blank/pom.xml,>
MavenProject: org.apache.myfaces.trinidad:trinidad-demo:2.1.0-SNAPSHOT @ <https://builds.apache.org/job/Trinidad%20Core%20Trunk%20(sanity)/ws/trinidad-examples/trinidad-demo/pom.xml,>
MavenProject: org.apache.myfaces.trinidad:trinidad-components-showcase:2.1.0-SNAPSHOT @ <https://builds.apache.org/job/Trinidad%20Core%20Trunk%20(sanity)/ws/trinidad-examples/trinidad-components-showcase/pom.xml]>
projectStarted org.apache.myfaces.trinidad:trinidad:2.1.0-SNAPSHOT
[INFO]                                                                         
[INFO] ------------------------------------------------------------------------
[INFO] Building Apache MyFaces Trinidad 2.1.0-SNAPSHOT
[INFO] ------------------------------------------------------------------------
[WARNING] The POM for org.apache.myfaces.trinidadbuild:maven-xrts-plugin:jar:2.0.8-SNAPSHOT
is missing, no dependency information available
projectFailed org.apache.myfaces.trinidad:trinidad:2.1.0-SNAPSHOT
projectSkipped org.apache.myfaces.trinidad:trinidad-build:2.1.0-SNAPSHOT
[INFO]                                                                         
[INFO] ------------------------------------------------------------------------
[INFO] Skipping Apache MyFaces Trinidad Build
[INFO] This project has been banned from the build due to previous failures.
[INFO] ------------------------------------------------------------------------
projectSkipped org.apache.myfaces.trinidad:trinidad-api:2.1.0-SNAPSHOT
[INFO]                                                                         
[INFO] ------------------------------------------------------------------------
[INFO] Skipping Apache MyFaces Trinidad API
[INFO] This project has been banned from the build due to previous failures.
[INFO] ------------------------------------------------------------------------
projectSkipped org.apache.myfaces.trinidad:trinidad-impl:2.1.0-SNAPSHOT
[INFO]                                                                         
[INFO] ------------------------------------------------------------------------
[INFO] Skipping Apache MyFaces Trinidad Impl
[INFO] This project has been banned from the build due to previous failures.
[INFO] ------------------------------------------------------------------------
projectSkipped org.apache.myfaces.trinidad:trinidad-example:2.1.0-SNAPSHOT
[INFO]                                                                         
[INFO] ------------------------------------------------------------------------
[INFO] Skipping Apache MyFaces Trinidad Examples
[INFO] This project has been banned from the build due to previous failures.
[INFO] ------------------------------------------------------------------------
projectSkipped org.apache.myfaces.trinidad:trinidad-blank:2.1.0-SNAPSHOT
[INFO]                                                                         
[INFO] ------------------------------------------------------------------------
[INFO] Skipping Apache MyFaces Trinidad Blank Demo
[INFO] This project has been banned from the build due to previous failures.
[INFO] ------------------------------------------------------------------------
projectSkipped org.apache.myfaces.trinidad:trinidad-demo:2.1.0-SNAPSHOT
[INFO]                                                                         
[INFO] ------------------------------------------------------------------------
[INFO] Skipping Apache MyFaces Trinidad Demo
[INFO] This project has been banned from the build due to previous failures.
[INFO] ------------------------------------------------------------------------
projectSkipped org.apache.myfaces.trinidad:trinidad-components-showcase:2.1.0-SNAPSHOT
[INFO]                                                                         
[INFO] ------------------------------------------------------------------------
[INFO] Skipping Apache MyFaces Trinidad Components Showcase
[INFO] This project has been banned from the build due to previous failures.
[INFO] ------------------------------------------------------------------------
sessionEnded
[INFO] ------------------------------------------------------------------------
[INFO] Reactor Summary:
[INFO] 
[INFO] Apache MyFaces Trinidad ........................... FAILURE [0.437s]
[INFO] Apache MyFaces Trinidad Build ..................... SKIPPED
[INFO] Apache MyFaces Trinidad API ....................... SKIPPED
[INFO] Apache MyFaces Trinidad Impl ...................... SKIPPED
[INFO] Apache MyFaces Trinidad Examples .................. SKIPPED
[INFO] Apache MyFaces Trinidad Blank Demo ................ SKIPPED
[INFO] Apache MyFaces Trinidad Demo ...................... SKIPPED
[INFO] Apache MyFaces Trinidad Components Showcase ....... SKIPPED
[INFO] ------------------------------------------------------------------------
[INFO] BUILD FAILURE
[INFO] ------------------------------------------------------------------------
[INFO] Total time: 2.228s
[INFO] Finished at: Fri May 25 20:32:45 UTC 2012
[INFO] Final Memory: 7M/490M
[INFO] ------------------------------------------------------------------------
Projects to build: [MavenProject: org.apache.myfaces.trinidad:trinidad:2.1.0-SNAPSHOT @ <https://builds.apache.org/job/Trinidad%20Core%20Trunk%20(sanity)/ws/pom.xml,>
MavenProject: org.apache.myfaces.trinidad:trinidad-build:2.1.0-SNAPSHOT @ <https://builds.apache.org/job/Trinidad%20Core%20Trunk%20(sanity)/ws/trinidad-build/pom.xml,>
MavenProject: org.apache.myfaces.trinidad:trinidad-api:2.1.0-SNAPSHOT @ <https://builds.apache.org/job/Trinidad%20Core%20Trunk%20(sanity)/ws/trinidad-api/pom.xml,>
MavenProject: org.apache.myfaces.trinidad:trinidad-impl:2.1.0-SNAPSHOT @ <https://builds.apache.org/job/Trinidad%20Core%20Trunk%20(sanity)/ws/trinidad-impl/pom.xml,>
MavenProject: org.apache.myfaces.trinidad:trinidad-example:2.1.0-SNAPSHOT @ <https://builds.apache.org/job/Trinidad%20Core%20Trunk%20(sanity)/ws/trinidad-examples/pom.xml,>
MavenProject: org.apache.myfaces.trinidad:trinidad-blank:2.1.0-SNAPSHOT @ <https://builds.apache.org/job/Trinidad%20Core%20Trunk%20(sanity)/ws/trinidad-examples/trinidad-blank/pom.xml,>
MavenProject: org.apache.myfaces.trinidad:trinidad-demo:2.1.0-SNAPSHOT @ <https://builds.apache.org/job/Trinidad%20Core%20Trunk%20(sanity)/ws/trinidad-examples/trinidad-demo/pom.xml,>
MavenProject: org.apache.myfaces.trinidad:trinidad-components-showcase:2.1.0-SNAPSHOT @ <https://builds.apache.org/job/Trinidad%20Core%20Trunk%20(sanity)/ws/trinidad-examples/trinidad-components-showcase/pom.xml]>
[JENKINS] Archiving <https://builds.apache.org/job/Trinidad%20Core%20Trunk%20(sanity)/ws/pom.xml>
to /home/hudson/hudson/jobs/Trinidad Core Trunk (sanity)/modules/org.apache.myfaces.trinidad$trinidad/builds/2012-05-25_20-32-27/archive/org.apache.myfaces.trinidad/trinidad/2.1.0-SNAPSHOT/trinidad-2.1.0-SNAPSHOT.pom
[JENKINS] Archiving <https://builds.apache.org/job/Trinidad%20Core%20Trunk%20(sanity)/ws/trinidad-api/pom.xml>
to /home/hudson/hudson/jobs/Trinidad Core Trunk (sanity)/modules/org.apache.myfaces.trinidad$trinidad-api/builds/2012-05-25_20-32-28/archive/org.apache.myfaces.trinidad/trinidad-api/2.1.0-SNAPSHOT/trinidad-api-2.1.0-SNAPSHOT.pom
[JENKINS] Archiving <https://builds.apache.org/job/Trinidad%20Core%20Trunk%20(sanity)/ws/trinidad-examples/trinidad-components-showcase/pom.xml>
to /home/hudson/hudson/jobs/Trinidad Core Trunk (sanity)/modules/org.apache.myfaces.trinidad$trinidad-components-showcase/builds/2012-05-25_20-32-28/archive/org.apache.myfaces.trinidad/trinidad-components-showcase/2.1.0-SNAPSHOT/trinidad-components-showcase-2.1.0-SNAPSHOT.pom
[JENKINS] Archiving <https://builds.apache.org/job/Trinidad%20Core%20Trunk%20(sanity)/ws/trinidad-examples/trinidad-blank/pom.xml>
to /home/hudson/hudson/jobs/Trinidad Core Trunk (sanity)/modules/org.apache.myfaces.trinidad$trinidad-blank/builds/2012-05-25_20-32-28/archive/org.apache.myfaces.trinidad/trinidad-blank/2.1.0-SNAPSHOT/trinidad-blank-2.1.0-SNAPSHOT.pom
[JENKINS] Archiving <https://builds.apache.org/job/Trinidad%20Core%20Trunk%20(sanity)/ws/trinidad-examples/trinidad-demo/pom.xml>
to /home/hudson/hudson/jobs/Trinidad Core Trunk (sanity)/modules/org.apache.myfaces.trinidad$trinidad-demo/builds/2012-05-25_20-32-28/archive/org.apache.myfaces.trinidad/trinidad-demo/2.1.0-SNAPSHOT/trinidad-demo-2.1.0-SNAPSHOT.pom
[JENKINS] Archiving <https://builds.apache.org/job/Trinidad%20Core%20Trunk%20(sanity)/ws/trinidad-impl/pom.xml>
to /home/hudson/hudson/jobs/Trinidad Core Trunk (sanity)/modules/org.apache.myfaces.trinidad$trinidad-impl/builds/2012-05-25_20-32-28/archive/org.apache.myfaces.trinidad/trinidad-impl/2.1.0-SNAPSHOT/trinidad-impl-2.1.0-SNAPSHOT.pom
[JENKINS] Archiving <https://builds.apache.org/job/Trinidad%20Core%20Trunk%20(sanity)/ws/trinidad-examples/pom.xml>
to /home/hudson/hudson/jobs/Trinidad Core Trunk (sanity)/modules/org.apache.myfaces.trinidad$trinidad-example/builds/2012-05-25_20-32-28/archive/org.apache.myfaces.trinidad/trinidad-example/2.1.0-SNAPSHOT/trinidad-example-2.1.0-SNAPSHOT.pom
[JENKINS] Archiving <https://builds.apache.org/job/Trinidad%20Core%20Trunk%20(sanity)/ws/trinidad-build/pom.xml>
to /home/hudson/hudson/jobs/Trinidad Core Trunk (sanity)/modules/org.apache.myfaces.trinidad$trinidad-build/builds/2012-05-25_20-32-27/archive/org.apache.myfaces.trinidad/trinidad-build/2.1.0-SNAPSHOT/trinidad-build-2.1.0-SNAPSHOT.pom
Waiting for Jenkins to finish collecting data
mavenExecutionResult exceptions not empty
message : Plugin org.apache.myfaces.trinidadbuild:maven-xrts-plugin:2.0.8-SNAPSHOT or one
of its dependencies could not be resolved: Failed to read artifact descriptor for org.apache.myfaces.trinidadbuild:maven-xrts-plugin:jar:2.0.8-SNAPSHOT
cause : Failed to read artifact descriptor for org.apache.myfaces.trinidadbuild:maven-xrts-plugin:jar:2.0.8-SNAPSHOT
Stack trace : 
org.apache.maven.plugin.PluginResolutionException: Plugin org.apache.myfaces.trinidadbuild:maven-xrts-plugin:2.0.8-SNAPSHOT
or one of its dependencies could not be resolved: Failed to read artifact descriptor for org.apache.myfaces.trinidadbuild:maven-xrts-plugin:jar:2.0.8-SNAPSHOT
	at org.apache.maven.plugin.internal.DefaultPluginDependenciesResolver.resolve(DefaultPluginDependenciesResolver.java:129)
	at org.apache.maven.plugin.internal.DefaultMavenPluginManager.getPluginDescriptor(DefaultMavenPluginManager.java:142)
	at org.apache.maven.plugin.internal.DefaultMavenPluginManager.getMojoDescriptor(DefaultMavenPluginManager.java:261)
	at org.apache.maven.plugin.DefaultBuildPluginManager.getMojoDescriptor(DefaultBuildPluginManager.java:185)
	at org.apache.maven.lifecycle.internal.DefaultLifecycleExecutionPlanCalculator.calculateLifecycleMappings(DefaultLifecycleExecutionPlanCalculator.java:280)
	at org.apache.maven.lifecycle.internal.DefaultLifecycleExecutionPlanCalculator.calculateMojoExecutions(DefaultLifecycleExecutionPlanCalculator.java:193)
	at org.apache.maven.lifecycle.internal.DefaultLifecycleExecutionPlanCalculator.calculateExecutionPlan(DefaultLifecycleExecutionPlanCalculator.java:112)
	at org.apache.maven.lifecycle.internal.DefaultLifecycleExecutionPlanCalculator.calculateExecutionPlan(DefaultLifecycleExecutionPlanCalculator.java:129)
	at org.apache.maven.lifecycle.internal.BuilderCommon.resolveBuildPlan(BuilderCommon.java:92)
	at org.apache.maven.lifecycle.internal.LifecycleModuleBuilder.buildProject(LifecycleModuleBuilder.java:81)
	at org.apache.maven.lifecycle.internal.LifecycleModuleBuilder.buildProject(LifecycleModuleBuilder.java:59)
	at org.apache.maven.lifecycle.internal.LifecycleStarter.singleThreadedBuild(LifecycleStarter.java:183)
	at org.apache.maven.lifecycle.internal.LifecycleStarter.execute(LifecycleStarter.java:161)
	at org.apache.maven.DefaultMaven.doExecute(DefaultMaven.java:319)
	at org.apache.maven.DefaultMaven.execute(DefaultMaven.java:156)
	at org.jvnet.hudson.maven3.launcher.Maven3Launcher.main(Maven3Launcher.java:79)
	at sun.reflect.NativeMethodAccessorImpl.invoke0(Native Method)
	at sun.reflect.NativeMethodAccessorImpl.invoke(NativeMethodAccessorImpl.java:39)
	at sun.reflect.DelegatingMethodAccessorImpl.invoke(DelegatingMethodAccessorImpl.java:25)
	at java.lang.reflect.Method.invoke(Method.java:597)
	at org.codehaus.plexus.classworlds.launcher.Launcher.launchStandard(Launcher.java:329)
	at org.codehaus.plexus.classworlds.launcher.Launcher.launch(Launcher.java:239)
	at org.jvnet.hudson.maven3.agent.Maven3Main.launch(Maven3Main.java:158)
	at hudson.maven.Maven3Builder.call(Maven3Builder.java:98)
	at hudson.maven.Maven3Builder.call(Maven3Builder.java:64)
	at hudson.remoting.UserRequest.perform(UserRequest.java:118)
	at hudson.remoting.UserRequest.perform(UserRequest.java:48)
	at hudson.remoting.Request$2.run(Request.java:287)
	at hudson.remoting.InterceptingExecutorService$1.call(InterceptingExecutorService.java:72)
	at java.util.concurrent.FutureTask$Sync.innerRun(FutureTask.java:303)
	at java.util.concurrent.FutureTask.run(FutureTask.java:138)
	at java.util.concurrent.ThreadPoolExecutor$Worker.runTask(ThreadPoolExecutor.java:886)
	at java.util.concurrent.ThreadPoolExecutor$Worker.run(ThreadPoolExecutor.java:908)
	at java.lang.Thread.run(Thread.java:662)
Caused by: org.sonatype.aether.resolution.ArtifactDescriptorException: Failed to read artifact
descriptor for org.apache.myfaces.trinidadbuild:maven-xrts-plugin:jar:2.0.8-SNAPSHOT
	at org.apache.maven.repository.internal.DefaultArtifactDescriptorReader.loadPom(DefaultArtifactDescriptorReader.java:282)
	at org.apache.maven.repository.internal.DefaultArtifactDescriptorReader.readArtifactDescriptor(DefaultArtifactDescriptorReader.java:172)
	at org.sonatype.aether.impl.internal.DefaultRepositorySystem.readArtifactDescriptor(DefaultRepositorySystem.java:316)
	at org.apache.maven.plugin.internal.DefaultPluginDependenciesResolver.resolve(DefaultPluginDependenciesResolver.java:115)
	... 33 more
Caused by: org.sonatype.aether.resolution.ArtifactResolutionException: Could not find artifact
org.apache.myfaces.trinidadbuild:maven-xrts-plugin:pom:2.0.8-SNAPSHOT
	at org.sonatype.aether.impl.internal.DefaultArtifactResolver.resolve(DefaultArtifactResolver.java:541)
	at org.sonatype.aether.impl.internal.DefaultArtifactResolver.resolveArtifacts(DefaultArtifactResolver.java:220)
	at org.sonatype.aether.impl.internal.DefaultArtifactResolver.resolveArtifact(DefaultArtifactResolver.java:197)
	at org.apache.maven.repository.internal.DefaultArtifactDescriptorReader.loadPom(DefaultArtifactDescriptorReader.java:267)
	... 36 more
Caused by: org.sonatype.aether.transfer.ArtifactNotFoundException: Could not find artifact
org.apache.myfaces.trinidadbuild:maven-xrts-plugin:pom:2.0.8-SNAPSHOT
	at org.sonatype.aether.impl.internal.DefaultArtifactResolver.resolve(DefaultArtifactResolver.java:531)
	... 39 more
Sending e-mails to: commits@myfaces.apache.org
channel stopped

Mime
View raw message