myfaces-commits mailing list archives

Site index · List index
Message view « Date » · « Thread »
Top « Date » · « Thread »
From Apache Jenkins Server <jenk...@builds.apache.org>
Subject Build failed in Jenkins: tobago-trunk-deploy #253
Date Fri, 01 Jun 2012 02:51:23 GMT
See <https://builds.apache.org/job/tobago-trunk-deploy/253/changes>

Changes:

[bommel] TOBAGO-1149
UITreeNode should be subclass of UIColumn

[bommel] (TOBAGO-1148) Skip Layout processing for unrendered LayoutContainer

[bommel] TOBAGO-1147
Avoid prepareRenderer call for unrendered Components during Ajax Call

------------------------------------------
[...truncated 33526 lines...]
[INFO] META-INF/NOTICE already added, skipping
[INFO] [assembly:single {execution: source-release-assembly}]
[INFO] Skipping the assembly in this project because it's not the Execution Root
[INFO] [install:install {execution: default-install}]
[INFO] Installing <https://builds.apache.org/job/tobago-trunk-deploy/ws/trunk-deploy/tobago-example/tobago-example-test/target/tobago-example-test.war>
to /export/home/hudson/hudson-slave/maven-repositories/0/org/apache/myfaces/tobago/tobago-example-test/1.6.0-SNAPSHOT/tobago-example-test-1.6.0-SNAPSHOT.war
[INFO] Installing <https://builds.apache.org/job/tobago-trunk-deploy/ws/trunk-deploy/tobago-example/tobago-example-test/target/tobago-example-test-javadoc.jar>
to /export/home/hudson/hudson-slave/maven-repositories/0/org/apache/myfaces/tobago/tobago-example-test/1.6.0-SNAPSHOT/tobago-example-test-1.6.0-SNAPSHOT-javadoc.jar
[INFO] Installing <https://builds.apache.org/job/tobago-trunk-deploy/ws/trunk-deploy/tobago-example/tobago-example-test/target/tobago-example-test-sources.jar>
to /export/home/hudson/hudson-slave/maven-repositories/0/org/apache/myfaces/tobago/tobago-example-test/1.6.0-SNAPSHOT/tobago-example-test-1.6.0-SNAPSHOT-sources.jar
[INFO] [deploy:deploy {execution: default-deploy}]
[INFO] Retrieving previous build number from apache.snapshots.https
[WARNING] *** CHECKSUM FAILED - Checksum failed on download: local = '6e1454a876de05b2d6c7f97b059f1c20dae688b7';
remote = 'e8062016e329c6bf299d58256f283ffc5fc685d9' - RETRYING
[WARNING] *** CHECKSUM FAILED - Checksum failed on download: local = '6e1454a876de05b2d6c7f97b059f1c20dae688b7';
remote = 'e8062016e329c6bf299d58256f283ffc5fc685d9' - IGNORING
Uploading: https://repository.apache.org/content/repositories/snapshots/org/apache/myfaces/tobago/tobago-example-test/1.6.0-SNAPSHOT/tobago-example-test-1.6.0-SNAPSHOT.war
9549K uploaded  (tobago-example-test-1.6.0-SNAPSHOT.war)
[INFO] Retrieving previous metadata from apache.snapshots.https
[INFO] Uploading repository metadata for: 'artifact org.apache.myfaces.tobago:tobago-example-test'
[INFO] Uploading project information for tobago-example-test 1.6.0-SNAPSHOT
[INFO] Retrieving previous metadata from apache.snapshots.https
[WARNING] *** CHECKSUM FAILED - Checksum failed on download: local = '6e1454a876de05b2d6c7f97b059f1c20dae688b7';
remote = 'e8062016e329c6bf299d58256f283ffc5fc685d9' - RETRYING
[WARNING] *** CHECKSUM FAILED - Checksum failed on download: local = '6e1454a876de05b2d6c7f97b059f1c20dae688b7';
remote = 'e8062016e329c6bf299d58256f283ffc5fc685d9' - IGNORING
[INFO] Uploading repository metadata for: 'snapshot org.apache.myfaces.tobago:tobago-example-test:1.6.0-SNAPSHOT'
[INFO] Retrieving previous build number from apache.snapshots.https
Uploading: https://repository.apache.org/content/repositories/snapshots/org/apache/myfaces/tobago/tobago-example-test/1.6.0-SNAPSHOT/tobago-example-test-1.6.0-SNAPSHOT-javadoc.jar
235K uploaded  (tobago-example-test-1.6.0-SNAPSHOT-javadoc.jar)
[INFO] Retrieving previous build number from apache.snapshots.https
Uploading: https://repository.apache.org/content/repositories/snapshots/org/apache/myfaces/tobago/tobago-example-test/1.6.0-SNAPSHOT/tobago-example-test-1.6.0-SNAPSHOT-sources.jar
35K uploaded  (tobago-example-test-1.6.0-SNAPSHOT-sources.jar)
[JENKINS] Archiving <https://builds.apache.org/job/tobago-trunk-deploy/ws/trunk-deploy/tobago-example/tobago-example-test/target/tobago-example-test-sources.jar>
to /home/hudson/hudson/jobs/tobago-trunk-deploy/modules/org.apache.myfaces.tobago$tobago-example-test/builds/2012-06-01_00-35-18/archive/org.apache.myfaces.tobago/tobago-example-test/1.6.0-SNAPSHOT/tobago-example-test-1.6.0-SNAPSHOT-sources.jar
[INFO] ------------------------------------------------------------------------
[INFO] Building Tobago Example Assembly
[INFO]    task-segment: [clean, animal-sniffer:check, deploy]
[INFO] ------------------------------------------------------------------------
[INFO] [clean:clean {execution: default-clean}]
[INFO] Deleting <https://builds.apache.org/job/tobago-trunk-deploy/ws/trunk-deploy/tobago-example/tobago-example-assembly/target>
[INFO] [animal-sniffer:check {execution: default-cli}]
[INFO] Checking unresolved references to org.codehaus.mojo.signature:java15:1.0
[INFO] [enforcer:enforce {execution: enforce}]
[INFO] [buildnumber:create {execution: default}]
[INFO] [remote-resources:process {execution: default}]
[INFO] [dependency:copy {execution: copy-example}]
[INFO] Configured Artifact: org.apache.myfaces.tobago:tobago-example-blank:1.6.0-SNAPSHOT:war
[INFO] Copying tobago-example-blank.war to <https://builds.apache.org/job/tobago-trunk-deploy/ws/trunk-deploy/tobago-example/tobago-example-assembly/target/webapp/tobago-example-blank-1.6.0-SNAPSHOT.war>
[INFO] [build-helper:add-source {execution: default}]
[INFO] Source directory: <https://builds.apache.org/job/tobago-trunk-deploy/ws/trunk-deploy/tobago-example/tobago-example-assembly/src/main/java-jsf-1.2>
added.
[INFO] [site:attach-descriptor {execution: default-attach-descriptor}]
[INFO] [javadoc:jar {execution: attach-javadoc}]
[INFO] Not executing Javadoc as the project is not a Java classpath-capable package
[INFO] Preparing source:jar
[WARNING] Removing: jar from forked lifecycle, to prevent recursive invocation.
[JENKINS] Archiving <https://builds.apache.org/job/tobago-trunk-deploy/ws/trunk-deploy/tobago-example/tobago-example-assembly/pom.xml>
to /home/hudson/hudson/jobs/tobago-trunk-deploy/modules/org.apache.myfaces.tobago$tobago-example-assembly/builds/2012-06-01_00-35-18/archive/org.apache.myfaces.tobago/tobago-example-assembly/1.6.0-SNAPSHOT/tobago-example-assembly-1.6.0-SNAPSHOT.pom
[INFO] [enforcer:enforce {execution: enforce}]
[INFO] [buildnumber:create {execution: default}]
[INFO] [source:jar {execution: attach-source}]
[INFO] [assembly:single {execution: source-release-assembly}]
[INFO] Skipping the assembly in this project because it's not the Execution Root
[WARNING] DEPRECATED [descriptor]: Please use descriptors instead
[INFO] [assembly:single {execution: generate-assembly}]
[INFO] Building tar : <https://builds.apache.org/job/tobago-trunk-deploy/ws/trunk-deploy/tobago-example/tobago-example-assembly/target/assembly/out/myfaces-tobago-1.6.0-SNAPSHOT-example.tar.gz>
[INFO] Building zip: <https://builds.apache.org/job/tobago-trunk-deploy/ws/trunk-deploy/tobago-example/tobago-example-assembly/target/assembly/out/myfaces-tobago-1.6.0-SNAPSHOT-example.zip>
[INFO] [install:install {execution: default-install}]
[INFO] Installing <https://builds.apache.org/job/tobago-trunk-deploy/ws/trunk-deploy/tobago-example/tobago-example-assembly/pom.xml>
to /export/home/hudson/hudson-slave/maven-repositories/0/org/apache/myfaces/tobago/tobago-example-assembly/1.6.0-SNAPSHOT/tobago-example-assembly-1.6.0-SNAPSHOT.pom
[INFO] Installing <https://builds.apache.org/job/tobago-trunk-deploy/ws/trunk-deploy/tobago-example/tobago-example-assembly/target/assembly/out/myfaces-tobago-1.6.0-SNAPSHOT-example.tar.gz>
to /export/home/hudson/hudson-slave/maven-repositories/0/org/apache/myfaces/tobago/tobago-example-assembly/1.6.0-SNAPSHOT/tobago-example-assembly-1.6.0-SNAPSHOT-example.tar.gz
[INFO] Installing <https://builds.apache.org/job/tobago-trunk-deploy/ws/trunk-deploy/tobago-example/tobago-example-assembly/target/assembly/out/myfaces-tobago-1.6.0-SNAPSHOT-example.zip>
to /export/home/hudson/hudson-slave/maven-repositories/0/org/apache/myfaces/tobago/tobago-example-assembly/1.6.0-SNAPSHOT/tobago-example-assembly-1.6.0-SNAPSHOT-example.zip
[INFO] [deploy:deploy {execution: default-deploy}]
[INFO] Retrieving previous build number from apache.snapshots.https
[WARNING] *** CHECKSUM FAILED - Checksum failed on download: local = '3c896542c3a756fdb90cad2fca939fe8409f3ebc';
remote = 'ed1e7648447cb8ab9350d24c2cff827f79306f2f' - RETRYING
[WARNING] *** CHECKSUM FAILED - Checksum failed on download: local = '3c896542c3a756fdb90cad2fca939fe8409f3ebc';
remote = 'ed1e7648447cb8ab9350d24c2cff827f79306f2f' - IGNORING
Uploading: https://repository.apache.org/content/repositories/snapshots/org/apache/myfaces/tobago/tobago-example-assembly/1.6.0-SNAPSHOT/tobago-example-assembly-1.6.0-SNAPSHOT.pom
3K uploaded  (tobago-example-assembly-1.6.0-SNAPSHOT.pom)
[INFO] Retrieving previous metadata from apache.snapshots.https
[WARNING] *** CHECKSUM FAILED - Checksum failed on download: local = '3c896542c3a756fdb90cad2fca939fe8409f3ebc';
remote = 'ed1e7648447cb8ab9350d24c2cff827f79306f2f' - RETRYING
[WARNING] *** CHECKSUM FAILED - Checksum failed on download: local = '3c896542c3a756fdb90cad2fca939fe8409f3ebc';
remote = 'ed1e7648447cb8ab9350d24c2cff827f79306f2f' - IGNORING
[INFO] Uploading repository metadata for: 'snapshot org.apache.myfaces.tobago:tobago-example-assembly:1.6.0-SNAPSHOT'
[INFO] Retrieving previous metadata from apache.snapshots.https
[INFO] Uploading repository metadata for: 'artifact org.apache.myfaces.tobago:tobago-example-assembly'
[INFO] Retrieving previous build number from apache.snapshots.https
Uploading: https://repository.apache.org/content/repositories/snapshots/org/apache/myfaces/tobago/tobago-example-assembly/1.6.0-SNAPSHOT/tobago-example-assembly-1.6.0-SNAPSHOT-example.tar.gz
4611K uploaded  (tobago-example-assembly-1.6.0-SNAPSHOT-example.tar.gz)
[INFO] Retrieving previous build number from apache.snapshots.https
Uploading: https://repository.apache.org/content/repositories/snapshots/org/apache/myfaces/tobago/tobago-example-assembly/1.6.0-SNAPSHOT/tobago-example-assembly-1.6.0-SNAPSHOT-example.zip
4611K uploaded  (tobago-example-assembly-1.6.0-SNAPSHOT-example.zip)
[JENKINS] Archiving <https://builds.apache.org/job/tobago-trunk-deploy/ws/trunk-deploy/tobago-example/tobago-example-assembly/target/assembly/out/myfaces-tobago-1.6.0-SNAPSHOT-example.tar.gz>
to /home/hudson/hudson/jobs/tobago-trunk-deploy/modules/org.apache.myfaces.tobago$tobago-example-assembly/builds/2012-06-01_00-35-18/archive/org.apache.myfaces.tobago/tobago-example-assembly/1.6.0-SNAPSHOT/tobago-example-assembly-1.6.0-SNAPSHOT-example.tar.gz
[JENKINS] Archiving <https://builds.apache.org/job/tobago-trunk-deploy/ws/trunk-deploy/tobago-example/tobago-example-assembly/target/assembly/out/myfaces-tobago-1.6.0-SNAPSHOT-example.zip>
to /home/hudson/hudson/jobs/tobago-trunk-deploy/modules/org.apache.myfaces.tobago$tobago-example-assembly/builds/2012-06-01_00-35-18/archive/org.apache.myfaces.tobago/tobago-example-assembly/1.6.0-SNAPSHOT/tobago-example-assembly-1.6.0-SNAPSHOT-example.zip
[INFO] ------------------------------------------------------------------------
[INFO] Building Tobago Assembly
[INFO]    task-segment: [clean, animal-sniffer:check, deploy]
[INFO] ------------------------------------------------------------------------
[INFO] [clean:clean {execution: default-clean}]
[INFO] Deleting <https://builds.apache.org/job/tobago-trunk-deploy/ws/trunk-deploy/tobago-assembly/target>
[INFO] [animal-sniffer:check {execution: default-cli}]
[INFO] Checking unresolved references to org.codehaus.mojo.signature:java15:1.0
[INFO] [enforcer:enforce {execution: enforce}]
[INFO] [buildnumber:create {execution: default}]
[INFO] [remote-resources:process {execution: default}]
[INFO] [dependency:copy {execution: copy-javadoc}]
[INFO] Configured Artifact: org.apache.myfaces.tobago:tobago-core:javadoc:1.6.0-SNAPSHOT:jar
[INFO] Configured Artifact: org.apache.myfaces.tobago:tobago-jsf-compat:javadoc:1.6.0-SNAPSHOT:jar
[INFO] Copying tobago-core-1.6.0-SNAPSHOT-javadoc.jar to <https://builds.apache.org/job/tobago-trunk-deploy/ws/trunk-deploy/tobago-assembly/target/javadoc/tobago-core-1.6.0-SNAPSHOT-javadoc.jar>
[INFO] Copying tobago-jsf-compat-1.6.0-SNAPSHOT-javadoc.jar to <https://builds.apache.org/job/tobago-trunk-deploy/ws/trunk-deploy/tobago-assembly/target/javadoc/tobago-jsf-compat-1.6.0-SNAPSHOT-javadoc.jar>
[INFO] [dependency:copy {execution: copy-sandbox}]
[INFO] Configured Artifact: org.apache.myfaces.tobago:tobago-sandbox:1.6.0-SNAPSHOT:jar
[INFO] Copying tobago-sandbox-1.6.0-SNAPSHOT.jar to <https://builds.apache.org/job/tobago-trunk-deploy/ws/trunk-deploy/tobago-assembly/target/sandbox/tobago-sandbox-1.6.0-SNAPSHOT.jar>
[INFO] [dependency:copy {execution: copy-tlddoc}]
[INFO] Configured Artifact: org.apache.myfaces.tobago:tobago-core:tlddoc:1.6.0-SNAPSHOT:jar
[INFO] Configured Artifact: org.apache.myfaces.tobago:tobago-taglib-extension:tlddoc:1.6.0-SNAPSHOT:jar
[INFO] Copying tobago-core-1.6.0-SNAPSHOT-tlddoc.jar to <https://builds.apache.org/job/tobago-trunk-deploy/ws/trunk-deploy/tobago-assembly/target/tlddoc/tobago-core-1.6.0-SNAPSHOT-tlddoc.jar>
[INFO] Copying tobago-taglib-extension-1.6.0-SNAPSHOT-tlddoc.jar to <https://builds.apache.org/job/tobago-trunk-deploy/ws/trunk-deploy/tobago-assembly/target/tlddoc/tobago-taglib-extension-1.6.0-SNAPSHOT-tlddoc.jar>
[INFO] [dependency:unpack {execution: copy-tld}]
[INFO] Configured Artifact: org.apache.myfaces.tobago:tobago-core:1.6.0-SNAPSHOT:jar
[INFO] Configured Artifact: org.apache.myfaces.tobago:tobago-taglib-extension:1.6.0-SNAPSHOT:jar
[INFO] Unpacking <https://builds.apache.org/job/tobago-trunk-deploy/ws/trunk-deploy/tobago-core/target/tobago-core-1.6.0-SNAPSHOT.jar>
to <https://builds.apache.org/job/tobago-trunk-deploy/ws/trunk-deploy/tobago-assembly/target/tld>
with includes "" and excludes ""
[INFO] Unpacking <https://builds.apache.org/job/tobago-trunk-deploy/ws/trunk-deploy/tobago-extension/tobago-taglib-extension/target/tobago-taglib-extension-1.6.0-SNAPSHOT.jar>
to <https://builds.apache.org/job/tobago-trunk-deploy/ws/trunk-deploy/tobago-assembly/target/tld>
with includes "" and excludes ""
[INFO] [dependency:copy {execution: copy-source}]
[INFO] Configured Artifact: org.apache.myfaces.tobago:tobago-core:sources:1.6.0-SNAPSHOT:jar
[INFO] Configured Artifact: org.apache.myfaces.tobago:tobago-jsf-compat:sources:1.6.0-SNAPSHOT:jar
[INFO] Configured Artifact: org.apache.myfaces.tobago:tobago-deprecation:sources:1.6.0-SNAPSHOT:jar
[INFO] Configured Artifact: org.apache.myfaces.tobago:tobago-theme-charlotteville:sources:1.6.0-SNAPSHOT:jar
[INFO] Configured Artifact: org.apache.myfaces.tobago:tobago-theme-richmond:sources:1.6.0-SNAPSHOT:jar
[INFO] Configured Artifact: org.apache.myfaces.tobago:tobago-theme-speyside:sources:1.6.0-SNAPSHOT:jar
[INFO] Configured Artifact: org.apache.myfaces.tobago:tobago-theme-scarborough:sources:1.6.0-SNAPSHOT:jar
[INFO] Configured Artifact: org.apache.myfaces.tobago:tobago-theme-standard:sources:1.6.0-SNAPSHOT:jar
[INFO] Configured Artifact: org.apache.myfaces.tobago:tobago-facelets:sources:1.6.0-SNAPSHOT:jar
[INFO] Configured Artifact: org.apache.myfaces.tobago:tobago-fileupload:sources:1.6.0-SNAPSHOT:jar
[INFO] Configured Artifact: org.apache.myfaces.tobago:tobago-taglib-extension:sources:1.6.0-SNAPSHOT:jar
[INFO] Copying tobago-core-1.6.0-SNAPSHOT-sources.jar to <https://builds.apache.org/job/tobago-trunk-deploy/ws/trunk-deploy/tobago-assembly/target/src/tobago-core-1.6.0-SNAPSHOT-sources.jar>
[INFO] Copying tobago-jsf-compat-1.6.0-SNAPSHOT-sources.jar to <https://builds.apache.org/job/tobago-trunk-deploy/ws/trunk-deploy/tobago-assembly/target/src/tobago-jsf-compat-1.6.0-SNAPSHOT-sources.jar>
[INFO] Copying tobago-deprecation-1.6.0-SNAPSHOT-sources.jar to <https://builds.apache.org/job/tobago-trunk-deploy/ws/trunk-deploy/tobago-assembly/target/src/tobago-deprecation-1.6.0-SNAPSHOT-sources.jar>
[INFO] Copying tobago-theme-charlotteville-1.6.0-SNAPSHOT-sources.jar to <https://builds.apache.org/job/tobago-trunk-deploy/ws/trunk-deploy/tobago-assembly/target/src/tobago-theme-charlotteville-1.6.0-SNAPSHOT-sources.jar>
[INFO] Copying tobago-theme-richmond-1.6.0-SNAPSHOT-sources.jar to <https://builds.apache.org/job/tobago-trunk-deploy/ws/trunk-deploy/tobago-assembly/target/src/tobago-theme-richmond-1.6.0-SNAPSHOT-sources.jar>
[INFO] Copying tobago-theme-speyside-1.6.0-SNAPSHOT-sources.jar to <https://builds.apache.org/job/tobago-trunk-deploy/ws/trunk-deploy/tobago-assembly/target/src/tobago-theme-speyside-1.6.0-SNAPSHOT-sources.jar>
[INFO] Copying tobago-theme-scarborough-1.6.0-SNAPSHOT-sources.jar to <https://builds.apache.org/job/tobago-trunk-deploy/ws/trunk-deploy/tobago-assembly/target/src/tobago-theme-scarborough-1.6.0-SNAPSHOT-sources.jar>
[INFO] Copying tobago-theme-standard-1.6.0-SNAPSHOT-sources.jar to <https://builds.apache.org/job/tobago-trunk-deploy/ws/trunk-deploy/tobago-assembly/target/src/tobago-theme-standard-1.6.0-SNAPSHOT-sources.jar>
[INFO] Copying tobago-facelets-1.6.0-SNAPSHOT-sources.jar to <https://builds.apache.org/job/tobago-trunk-deploy/ws/trunk-deploy/tobago-assembly/target/src/tobago-facelets-1.6.0-SNAPSHOT-sources.jar>
[INFO] Copying tobago-fileupload-1.6.0-SNAPSHOT-sources.jar to <https://builds.apache.org/job/tobago-trunk-deploy/ws/trunk-deploy/tobago-assembly/target/src/tobago-fileupload-1.6.0-SNAPSHOT-sources.jar>
[INFO] Copying tobago-taglib-extension-1.6.0-SNAPSHOT-sources.jar to <https://builds.apache.org/job/tobago-trunk-deploy/ws/trunk-deploy/tobago-assembly/target/src/tobago-taglib-extension-1.6.0-SNAPSHOT-sources.jar>
[INFO] [build-helper:add-source {execution: default}]
[INFO] Source directory: <https://builds.apache.org/job/tobago-trunk-deploy/ws/trunk-deploy/tobago-assembly/src/main/java-jsf-1.2>
added.
[INFO] [site:attach-descriptor {execution: default-attach-descriptor}]
[INFO] [javadoc:jar {execution: attach-javadoc}]
[INFO] Not executing Javadoc as the project is not a Java classpath-capable package
[INFO] Preparing source:jar
[WARNING] Removing: jar from forked lifecycle, to prevent recursive invocation.
[JENKINS] Archiving <https://builds.apache.org/job/tobago-trunk-deploy/ws/trunk-deploy/tobago-assembly/pom.xml>
to /home/hudson/hudson/jobs/tobago-trunk-deploy/modules/org.apache.myfaces.tobago$tobago-assembly/builds/2012-06-01_00-35-18/archive/org.apache.myfaces.tobago/tobago-assembly/1.6.0-SNAPSHOT/tobago-assembly-1.6.0-SNAPSHOT.pom
[INFO] [enforcer:enforce {execution: enforce}]
[INFO] [buildnumber:create {execution: default}]
[INFO] [source:jar {execution: attach-source}]
[INFO] [assembly:single {execution: source-release-assembly}]
[INFO] Skipping the assembly in this project because it's not the Execution Root
[WARNING] DEPRECATED [descriptor]: Please use descriptors instead
[INFO] [assembly:single {execution: generate-assembly}]
[WARNING] Cannot include project artifact: org.apache.myfaces.tobago:tobago-assembly:pom:1.6.0-SNAPSHOT;
it doesn't have an associated file or directory.
[INFO] myfaces-tobago-1.6.0-SNAPSHOT/tld/ already added, skipping
[INFO] Building tar : <https://builds.apache.org/job/tobago-trunk-deploy/ws/trunk-deploy/tobago-assembly/target/assembly/out/myfaces-tobago-1.6.0-SNAPSHOT-dist.tar.gz>
[INFO] myfaces-tobago-1.6.0-SNAPSHOT/tld/ already added, skipping
[WARNING] Cannot include project artifact: org.apache.myfaces.tobago:tobago-assembly:pom:1.6.0-SNAPSHOT;
it doesn't have an associated file or directory.
[INFO] myfaces-tobago-1.6.0-SNAPSHOT/tld/ already added, skipping
[INFO] Building zip: <https://builds.apache.org/job/tobago-trunk-deploy/ws/trunk-deploy/tobago-assembly/target/assembly/out/myfaces-tobago-1.6.0-SNAPSHOT-dist.zip>
[INFO] myfaces-tobago-1.6.0-SNAPSHOT/tld/ already added, skipping
[INFO] [install:install {execution: default-install}]
[INFO] Installing <https://builds.apache.org/job/tobago-trunk-deploy/ws/trunk-deploy/tobago-assembly/pom.xml>
to /export/home/hudson/hudson-slave/maven-repositories/0/org/apache/myfaces/tobago/tobago-assembly/1.6.0-SNAPSHOT/tobago-assembly-1.6.0-SNAPSHOT.pom
[INFO] Installing <https://builds.apache.org/job/tobago-trunk-deploy/ws/trunk-deploy/tobago-assembly/target/assembly/out/myfaces-tobago-1.6.0-SNAPSHOT-dist.tar.gz>
to /export/home/hudson/hudson-slave/maven-repositories/0/org/apache/myfaces/tobago/tobago-assembly/1.6.0-SNAPSHOT/tobago-assembly-1.6.0-SNAPSHOT-dist.tar.gz
[INFO] Installing <https://builds.apache.org/job/tobago-trunk-deploy/ws/trunk-deploy/tobago-assembly/target/assembly/out/myfaces-tobago-1.6.0-SNAPSHOT-dist.zip>
to /export/home/hudson/hudson-slave/maven-repositories/0/org/apache/myfaces/tobago/tobago-assembly/1.6.0-SNAPSHOT/tobago-assembly-1.6.0-SNAPSHOT-dist.zip
[INFO] [deploy:deploy {execution: default-deploy}]
[INFO] Retrieving previous build number from apache.snapshots.https
[WARNING] *** CHECKSUM FAILED - Checksum failed on download: local = 'b393ae9fc275c2d9d727d374401564e1e5aa140d';
remote = '9c0b136113f4339253c9fdb3debb48eb2cf7043f' - RETRYING
[WARNING] *** CHECKSUM FAILED - Checksum failed on download: local = 'b393ae9fc275c2d9d727d374401564e1e5aa140d';
remote = '9c0b136113f4339253c9fdb3debb48eb2cf7043f' - IGNORING
Uploading: https://repository.apache.org/content/repositories/snapshots/org/apache/myfaces/tobago/tobago-assembly/1.6.0-SNAPSHOT/tobago-assembly-1.6.0-SNAPSHOT.pom
17K uploaded  (tobago-assembly-1.6.0-SNAPSHOT.pom)
[INFO] Retrieving previous metadata from apache.snapshots.https
[WARNING] *** CHECKSUM FAILED - Checksum failed on download: local = 'b393ae9fc275c2d9d727d374401564e1e5aa140d';
remote = '9c0b136113f4339253c9fdb3debb48eb2cf7043f' - RETRYING
[WARNING] *** CHECKSUM FAILED - Checksum failed on download: local = 'b393ae9fc275c2d9d727d374401564e1e5aa140d';
remote = '9c0b136113f4339253c9fdb3debb48eb2cf7043f' - IGNORING
[INFO] Uploading repository metadata for: 'snapshot org.apache.myfaces.tobago:tobago-assembly:1.6.0-SNAPSHOT'
[INFO] Retrieving previous metadata from apache.snapshots.https
[INFO] Uploading repository metadata for: 'artifact org.apache.myfaces.tobago:tobago-assembly'
[INFO] Retrieving previous build number from apache.snapshots.https
Uploading: https://repository.apache.org/content/repositories/snapshots/org/apache/myfaces/tobago/tobago-assembly/1.6.0-SNAPSHOT/tobago-assembly-1.6.0-SNAPSHOT-dist.tar.gz
7144K uploaded  (tobago-assembly-1.6.0-SNAPSHOT-dist.tar.gz)
[INFO] Retrieving previous build number from apache.snapshots.https
Uploading: https://repository.apache.org/content/repositories/snapshots/org/apache/myfaces/tobago/tobago-assembly/1.6.0-SNAPSHOT/tobago-assembly-1.6.0-SNAPSHOT-dist.zip
7172K uploaded  (tobago-assembly-1.6.0-SNAPSHOT-dist.zip)
[JENKINS] Archiving <https://builds.apache.org/job/tobago-trunk-deploy/ws/trunk-deploy/tobago-assembly/target/assembly/out/myfaces-tobago-1.6.0-SNAPSHOT-dist.tar.gz>
to /home/hudson/hudson/jobs/tobago-trunk-deploy/modules/org.apache.myfaces.tobago$tobago-assembly/builds/2012-06-01_00-35-18/archive/org.apache.myfaces.tobago/tobago-assembly/1.6.0-SNAPSHOT/tobago-assembly-1.6.0-SNAPSHOT-dist.tar.gz
[JENKINS] Archiving <https://builds.apache.org/job/tobago-trunk-deploy/ws/trunk-deploy/tobago-assembly/target/assembly/out/myfaces-tobago-1.6.0-SNAPSHOT-dist.zip>
to /home/hudson/hudson/jobs/tobago-trunk-deploy/modules/org.apache.myfaces.tobago$tobago-assembly/builds/2012-06-01_00-35-18/archive/org.apache.myfaces.tobago/tobago-assembly/1.6.0-SNAPSHOT/tobago-assembly-1.6.0-SNAPSHOT-dist.zip
Build timed out (after 150 minutes). Marking the build as failed.
channel stopped
[INFO] ------------------------------------------------------------------------
[ERROR] FATAL ERROR
[INFO] ------------------------------------------------------------------------
[INFO] null
[INFO] ------------------------------------------------------------------------
[INFO] Trace
java.lang.reflect.UndeclaredThrowableException
	at $Proxy2.isArchivingDisabled(Unknown Source)
	at hudson.maven.MavenBuildProxy$Filter.isArchivingDisabled(MavenBuildProxy.java:227)
	at hudson.maven.reporters.MavenArtifact.archive(MavenArtifact.java:223)
	at hudson.maven.reporters.MavenArtifactArchiver.postBuild(MavenArtifactArchiver.java:108)
	at hudson.maven.Maven2Builder.postModule(Maven2Builder.java:127)
	at hudson.maven.MavenBuilder$Adapter.fireLeaveModule(MavenBuilder.java:327)
	at hudson.maven.MavenBuilder$Adapter.postBuild(MavenBuilder.java:285)
	at org.apache.maven.lifecycle.LifecycleExecutorInterceptor.execute(LifecycleExecutorInterceptor.java:68)
	at org.apache.maven.DefaultMaven.doExecute(DefaultMaven.java:328)
	at org.apache.maven.DefaultMaven.execute(DefaultMaven.java:138)
	at org.apache.maven.cli.MavenCli.main(MavenCli.java:362)
	at sun.reflect.NativeMethodAccessorImpl.invoke0(Native Method)
	at sun.reflect.NativeMethodAccessorImpl.invoke(NativeMethodAccessorImpl.java:39)
	at sun.reflect.DelegatingMethodAccessorImpl.invoke(DelegatingMethodAccessorImpl.java:25)
	at java.lang.reflect.Method.invoke(Method.java:597)
	at org.codehaus.classworlds.Launcher.launchEnhanced(Launcher.java:315)
	at org.codehaus.classworlds.Launcher.launch(Launcher.java:255)
	at hudson.maven.agent.Main.launch(Main.java:185)
	at hudson.maven.MavenBuilder.call(MavenBuilder.java:151)
	at hudson.maven.Maven2Builder.call(Maven2Builder.java:77)
	at hudson.maven.Maven2Builder.call(Maven2Builder.java:53)
	at hudson.remoting.UserRequest.perform(UserRequest.java:118)
	at hudson.remoting.UserRequest.perform(UserRequest.java:48)
	at hudson.remoting.Request$2.run(Request.java:287)
	at hudson.remoting.InterceptingExecutorService$1.call(InterceptingExecutorService.java:72)
	at java.util.concurrent.FutureTask$Sync.innerRun(FutureTask.java:303)
	at java.util.concurrent.FutureTask.run(FutureTask.java:138)
	at java.util.concurrent.ThreadPoolExecutor$Worker.runTask(ThreadPoolExecutor.java:886)
	at java.util.concurrent.ThreadPoolExecutor$Worker.run(ThreadPoolExecutor.java:908)
	at java.lang.Thread.run(Thread.java:662)
Caused by: hudson.remoting.ChannelClosedException: channel is already closed
	at hudson.remoting.Channel.send(Channel.java:475)
	at hudson.remoting.Request.call(Request.java:110)
	at hudson.remoting.Channel.call(Channel.java:646)
	at hudson.remoting.RemoteInvocationHandler.invoke(RemoteInvocationHandler.java:158)
	... 30 more
Caused by: hudson.remoting.Channel$OrderlyShutdown
	at hudson.remoting.Channel$CloseCommand.execute(Channel.java:818)
	at hudson.remoting.Channel$1.handle(Channel.java:416)
	at hudson.remoting.SynchronousCommandTransport$ReaderThread.run(SynchronousCommandTransport.java:60)
Caused by: Command close created at
	at hudson.remoting.Command.<init>(Command.java:54)
	at hudson.remoting.Channel$CloseCommand.<init>(Channel.java:812)
	at hudson.remoting.Channel$CloseCommand.<init>(Channel.java:810)
	at hudson.remoting.Channel.close(Channel.java:877)
	at hudson.remoting.Channel.close(Channel.java:860)
	at hudson.slaves.Channels$1.close(Channels.java:91)
	at hudson.maven.ProcessCache$MavenProcess.discard(ProcessCache.java:145)
	at hudson.maven.MavenModuleSetBuild$RunnerImpl.doRun(MavenModuleSetBuild.java:796)
	at hudson.model.AbstractBuild$AbstractRunner.run(AbstractBuild.java:480)
	at hudson.model.Run.run(Run.java:1434)
	at hudson.maven.MavenModuleSetBuild.run(MavenModuleSetBuild.java:477)
	at hudson.model.ResourceController.execute(ResourceController.java:88)
	at hudson.model.Executor.run(Executor.java:239)
[INFO] ------------------------------------------------------------------------
[INFO] Total time: 128 minutes 1 second
[INFO] Finished at: Fri Jun 01 02:51:14 GMT+00:00 2012
[INFO] Final Memory: 181M/431M
[INFO] ------------------------------------------------------------------------

Mime
View raw message