myfaces-commits mailing list archives

Site index · List index
Message view « Date » · « Thread »
Top « Date » · « Thread »
From Apache Jenkins Server <jenk...@builds.apache.org>
Subject Build failed in Jenkins: tobago-1.5.x #62
Date Fri, 29 Jun 2012 17:54:17 GMT
See <https://builds.apache.org/job/tobago-1.5.x/62/>

------------------------------------------
[...truncated 14638 lines...]
[INFO]    task-segment: [clean, animal-sniffer:check, checkstyle:check, install]
[INFO] ------------------------------------------------------------------------
[JENKINS] Recording test results
[JENKINS] Archiving <https://builds.apache.org/job/tobago-1.5.x/ws/tobago-1.5.x/tobago-theme/tobago-theme-scarborough/pom.xml>
to /home/hudson/hudson/jobs/tobago-1.5.x/modules/org.apache.myfaces.tobago$tobago-theme-scarborough/builds/2012-06-29_15-01-41/archive/org.apache.myfaces.tobago/tobago-theme-scarborough/1.5.7-SNAPSHOT/tobago-theme-scarborough-1.5.7-SNAPSHOT.pom
[JENKINS] Archiving <https://builds.apache.org/job/tobago-1.5.x/ws/tobago-1.5.x/tobago-theme/tobago-theme-scarborough/target/tobago-theme-scarborough-1.5.7-SNAPSHOT.jar>
to /home/hudson/hudson/jobs/tobago-1.5.x/modules/org.apache.myfaces.tobago$tobago-theme-scarborough/builds/2012-06-29_15-01-41/archive/org.apache.myfaces.tobago/tobago-theme-scarborough/1.5.7-SNAPSHOT/tobago-theme-scarborough-1.5.7-SNAPSHOT.jar
[INFO] [clean:clean {execution: default-clean}]
[INFO] Deleting <https://builds.apache.org/job/tobago-1.5.x/ws/tobago-1.5.x/tobago-theme/tobago-theme-scarborough/target>
[INFO] [animal-sniffer:check {execution: default-cli}]
[INFO] Checking unresolved references to org.codehaus.mojo.signature:java15:1.0
[INFO] [checkstyle:check {execution: default-cli}]
[INFO] 
[INFO] [enforcer:enforce {execution: enforce}]
[INFO] [remote-resources:process {execution: default}]
[debug] execute contextualize
[INFO] [resources:resources {execution: default-resources}]
[INFO] Using 'UTF-8' encoding to copy filtered resources.
[INFO] Copying 111 resources
[INFO] Copying 3 resources
[INFO] [build-helper:add-source {execution: default}]
[INFO] Source directory: <https://builds.apache.org/job/tobago-1.5.x/ws/tobago-1.5.x/tobago-theme/tobago-theme-scarborough/src/main/java-jsf-1.2>
added.
[INFO] [yuicompressor:compress {execution: default}]
[INFO] style.css (29835b) -> style.min.css (20106b)[67%]
[INFO] style.css (973b) -> style.min.css (95b)[9%]
[INFO] style.css (1340b) -> style.min.css (115b)[8%]
[INFO] style.css (1813b) -> style.min.css (494b)[27%]
[INFO] style.css (1046b) -> style.min.css (30b)[2%]
[INFO] style.css (1043b) -> style.min.css (95b)[9%]
[INFO] style.css (1929b) -> style.min.css (589b)[30%]
[INFO] style.css (1529b) -> style.min.css (309b)[20%]
[INFO] style.css (1050b) -> style.min.css (61b)[5%]
[INFO] total input (40558b) -> output (21894b)[53%]
[INFO] nb warnings: 0, nb errors: 0
[INFO] [compiler:compile {execution: default-compile}]
[INFO] Compiling 70 source files to <https://builds.apache.org/job/tobago-1.5.x/ws/tobago-1.5.x/tobago-theme/tobago-theme-scarborough/target/classes>
[INFO] [antrun:run {execution: strip-javascript}]
[INFO] Executing tasks

main:
[INFO] Executed tasks
[INFO] [exec:exec {execution: compress-standard}]
[debug] execute contextualize
[INFO] [resources:testResources {execution: default-testResources}]
[INFO] Using 'UTF-8' encoding to copy filtered resources.
[INFO] skip non existing resourceDirectory <https://builds.apache.org/job/tobago-1.5.x/ws/tobago-1.5.x/tobago-theme/tobago-theme-scarborough/src/test/resources>
[INFO] Copying 3 resources
[INFO] [compiler:testCompile {execution: default-testCompile}]
[INFO] Compiling 4 source files to <https://builds.apache.org/job/tobago-1.5.x/ws/tobago-1.5.x/tobago-theme/tobago-theme-scarborough/target/test-classes>
[INFO] [surefire:test {execution: default-test}]
[INFO] Surefire report directory: <https://builds.apache.org/job/tobago-1.5.x/ws/tobago-1.5.x/tobago-theme/tobago-theme-scarborough/target/surefire-reports>

-------------------------------------------------------
 T E S T S
-------------------------------------------------------
Running org.apache.myfaces.tobago.renderkit.html.scarborough.standard.tag.TreeNodeRendererUnitTest
Tests run: 1, Failures: 0, Errors: 0, Skipped: 0, Time elapsed: 0.194 sec

Results :

Tests run: 1, Failures: 0, Errors: 0, Skipped: 0

[INFO] [jar:jar {execution: default-jar}]
[INFO] Building jar: <https://builds.apache.org/job/tobago-1.5.x/ws/tobago-1.5.x/tobago-theme/tobago-theme-scarborough/target/tobago-theme-scarborough-1.5.7-SNAPSHOT.jar>
[INFO] [install:install {execution: default-install}]
[INFO] Installing <https://builds.apache.org/job/tobago-1.5.x/ws/tobago-1.5.x/tobago-theme/tobago-theme-scarborough/target/tobago-theme-scarborough-1.5.7-SNAPSHOT.jar>
to /export/home/hudson/hudson-slave/maven-repositories/0/org/apache/myfaces/tobago/tobago-theme-scarborough/1.5.7-SNAPSHOT/tobago-theme-scarborough-1.5.7-SNAPSHOT.jar
[INFO] ------------------------------------------------------------------------
[INFO] Building Tobago Theme Speyside
[INFO]    task-segment: [clean, animal-sniffer:check, checkstyle:check, install]
[INFO] ------------------------------------------------------------------------
[JENKINS] Recording test results
[JENKINS] Archiving <https://builds.apache.org/job/tobago-1.5.x/ws/tobago-1.5.x/tobago-theme/tobago-theme-speyside/pom.xml>
to /home/hudson/hudson/jobs/tobago-1.5.x/modules/org.apache.myfaces.tobago$tobago-theme-speyside/builds/2012-06-29_15-01-42/archive/org.apache.myfaces.tobago/tobago-theme-speyside/1.5.7-SNAPSHOT/tobago-theme-speyside-1.5.7-SNAPSHOT.pom
[JENKINS] Archiving <https://builds.apache.org/job/tobago-1.5.x/ws/tobago-1.5.x/tobago-theme/tobago-theme-speyside/target/tobago-theme-speyside-1.5.7-SNAPSHOT.jar>
to /home/hudson/hudson/jobs/tobago-1.5.x/modules/org.apache.myfaces.tobago$tobago-theme-speyside/builds/2012-06-29_15-01-42/archive/org.apache.myfaces.tobago/tobago-theme-speyside/1.5.7-SNAPSHOT/tobago-theme-speyside-1.5.7-SNAPSHOT.jar
[INFO] [clean:clean {execution: default-clean}]
[INFO] Deleting <https://builds.apache.org/job/tobago-1.5.x/ws/tobago-1.5.x/tobago-theme/tobago-theme-speyside/target>
[INFO] [animal-sniffer:check {execution: default-cli}]
[INFO] Checking unresolved references to org.codehaus.mojo.signature:java15:1.0
[INFO] [checkstyle:check {execution: default-cli}]
[INFO] 
[INFO] [enforcer:enforce {execution: enforce}]
[INFO] [remote-resources:process {execution: default}]
[debug] execute contextualize
[INFO] [resources:resources {execution: default-resources}]
[INFO] Using 'UTF-8' encoding to copy filtered resources.
[INFO] Copying 89 resources
[INFO] Copying 3 resources
[INFO] [build-helper:add-source {execution: default}]
[INFO] Source directory: <https://builds.apache.org/job/tobago-1.5.x/ws/tobago-1.5.x/tobago-theme/tobago-theme-speyside/src/main/java-jsf-1.2>
added.
[INFO] [yuicompressor:compress {execution: default}]
[INFO] style.css (17274b) -> style.min.css (9870b)[57%]
[INFO] style.css (1617b) -> style.min.css (434b)[26%]
[INFO] style.css (962b) -> style.min.css (28b)[2%]
[INFO] style.css (1245b) -> style.min.css (209b)[16%]
[INFO] total input (21098b) -> output (10541b)[49%]
[INFO] nb warnings: 0, nb errors: 0
[INFO] [compiler:compile {execution: default-compile}]
[INFO] Compiling 2 source files to <https://builds.apache.org/job/tobago-1.5.x/ws/tobago-1.5.x/tobago-theme/tobago-theme-speyside/target/classes>
[debug] execute contextualize
[INFO] [resources:testResources {execution: default-testResources}]
[INFO] Using 'UTF-8' encoding to copy filtered resources.
[INFO] skip non existing resourceDirectory <https://builds.apache.org/job/tobago-1.5.x/ws/tobago-1.5.x/tobago-theme/tobago-theme-speyside/src/test/resources>
[INFO] Copying 3 resources
[INFO] [compiler:testCompile {execution: default-testCompile}]
[INFO] No sources to compile
[INFO] [surefire:test {execution: default-test}]
[INFO] Surefire report directory: <https://builds.apache.org/job/tobago-1.5.x/ws/tobago-1.5.x/tobago-theme/tobago-theme-speyside/target/surefire-reports>

-------------------------------------------------------
 T E S T S
-------------------------------------------------------

Results :

Tests run: 0, Failures: 0, Errors: 0, Skipped: 0

[INFO] [dependency:unpack {execution: unpack-external-images}]
[INFO] Configured Artifact: org.tango-project:tango-icon-theme:0.8.0:jar
[INFO] Unpacking /export/home/hudson/hudson-slave/maven-repositories/0/org/tango-project/tango-icon-theme/0.8.0/tango-icon-theme-0.8.0.jar
to <https://builds.apache.org/job/tobago-1.5.x/ws/tobago-1.5.x/tobago-theme/tobago-theme-speyside/target/external-images>
with includes "" and excludes ""
[debug] execute contextualize
[INFO] [resources:copy-resources {execution: copy-external-images}]
[INFO] Using 'UTF-8' encoding to copy filtered resources.
[INFO] Copying 3 resources to org/apache/myfaces/tobago/renderkit/html/speyside/standard/image
[INFO] Copying 1 resource to org/apache/myfaces/tobago/renderkit/html/speyside/standard/image
[INFO] [jar:jar {execution: default-jar}]
[INFO] Building jar: <https://builds.apache.org/job/tobago-1.5.x/ws/tobago-1.5.x/tobago-theme/tobago-theme-speyside/target/tobago-theme-speyside-1.5.7-SNAPSHOT.jar>
[INFO] [install:install {execution: default-install}]
[INFO] Installing <https://builds.apache.org/job/tobago-1.5.x/ws/tobago-1.5.x/tobago-theme/tobago-theme-speyside/target/tobago-theme-speyside-1.5.7-SNAPSHOT.jar>
to /export/home/hudson/hudson-slave/maven-repositories/0/org/apache/myfaces/tobago/tobago-theme-speyside/1.5.7-SNAPSHOT/tobago-theme-speyside-1.5.7-SNAPSHOT.jar
[INFO] ------------------------------------------------------------------------
[INFO] Building Tobago Theme Richmond
[INFO]    task-segment: [clean, animal-sniffer:check, checkstyle:check, install]
[INFO] ------------------------------------------------------------------------
[JENKINS] Recording test results
[JENKINS] Archiving <https://builds.apache.org/job/tobago-1.5.x/ws/tobago-1.5.x/tobago-theme/tobago-theme-richmond/pom.xml>
to /home/hudson/hudson/jobs/tobago-1.5.x/modules/org.apache.myfaces.tobago$tobago-theme-richmond/builds/2012-06-29_15-01-43/archive/org.apache.myfaces.tobago/tobago-theme-richmond/1.5.7-SNAPSHOT/tobago-theme-richmond-1.5.7-SNAPSHOT.pom
[JENKINS] Archiving <https://builds.apache.org/job/tobago-1.5.x/ws/tobago-1.5.x/tobago-theme/tobago-theme-richmond/target/tobago-theme-richmond-1.5.7-SNAPSHOT.jar>
to /home/hudson/hudson/jobs/tobago-1.5.x/modules/org.apache.myfaces.tobago$tobago-theme-richmond/builds/2012-06-29_15-01-43/archive/org.apache.myfaces.tobago/tobago-theme-richmond/1.5.7-SNAPSHOT/tobago-theme-richmond-1.5.7-SNAPSHOT.jar
[INFO] [clean:clean {execution: default-clean}]
[INFO] Deleting <https://builds.apache.org/job/tobago-1.5.x/ws/tobago-1.5.x/tobago-theme/tobago-theme-richmond/target>
[INFO] [animal-sniffer:check {execution: default-cli}]
[INFO] Checking unresolved references to org.codehaus.mojo.signature:java15:1.0
[INFO] [checkstyle:check {execution: default-cli}]
[INFO] 
[INFO] [enforcer:enforce {execution: enforce}]
[INFO] [remote-resources:process {execution: default}]
[debug] execute contextualize
[INFO] [resources:resources {execution: default-resources}]
[INFO] Using 'UTF-8' encoding to copy filtered resources.
[INFO] Copying 55 resources
[INFO] Copying 3 resources
[INFO] [build-helper:add-source {execution: default}]
[INFO] Source directory: <https://builds.apache.org/job/tobago-1.5.x/ws/tobago-1.5.x/tobago-theme/tobago-theme-richmond/src/main/java-jsf-1.2>
added.
[INFO] [yuicompressor:compress {execution: default}]
[INFO] style.css (8223b) -> style.min.css (4572b)[55%]
[INFO] style.css (1227b) -> style.min.css (246b)[20%]
[INFO] total input (9450b) -> output (4818b)[50%]
[INFO] nb warnings: 0, nb errors: 0
[INFO] [compiler:compile {execution: default-compile}]
[INFO] No sources to compile
[debug] execute contextualize
[INFO] [resources:testResources {execution: default-testResources}]
[INFO] Using 'UTF-8' encoding to copy filtered resources.
[INFO] skip non existing resourceDirectory <https://builds.apache.org/job/tobago-1.5.x/ws/tobago-1.5.x/tobago-theme/tobago-theme-richmond/src/test/resources>
[INFO] Copying 3 resources
[INFO] [compiler:testCompile {execution: default-testCompile}]
[INFO] No sources to compile
[INFO] [surefire:test {execution: default-test}]
[INFO] Surefire report directory: <https://builds.apache.org/job/tobago-1.5.x/ws/tobago-1.5.x/tobago-theme/tobago-theme-richmond/target/surefire-reports>

-------------------------------------------------------
 T E S T S
-------------------------------------------------------

Results :

Tests run: 0, Failures: 0, Errors: 0, Skipped: 0

[INFO] [jar:jar {execution: default-jar}]
[INFO] Building jar: <https://builds.apache.org/job/tobago-1.5.x/ws/tobago-1.5.x/tobago-theme/tobago-theme-richmond/target/tobago-theme-richmond-1.5.7-SNAPSHOT.jar>
[INFO] [install:install {execution: default-install}]
[INFO] Installing <https://builds.apache.org/job/tobago-1.5.x/ws/tobago-1.5.x/tobago-theme/tobago-theme-richmond/target/tobago-theme-richmond-1.5.7-SNAPSHOT.jar>
to /export/home/hudson/hudson-slave/maven-repositories/0/org/apache/myfaces/tobago/tobago-theme-richmond/1.5.7-SNAPSHOT/tobago-theme-richmond-1.5.7-SNAPSHOT.jar
Build timed out (after 150 minutes). Marking the build as failed.
[INFO] ------------------------------------------------------------------------
[INFO] Building Tobago Theme Charlotteville
[INFO]    task-segment: [clean, animal-sniffer:check, checkstyle:check, install]
[INFO] ------------------------------------------------------------------------
[INFO] ------------------------------------------------------------------------
[ERROR] FATAL ERROR
[INFO] ------------------------------------------------------------------------
channel stopped
[INFO] hudson.remoting.RequestAbortedException: hudson.remoting.Channel$OrderlyShutdown
[INFO] ------------------------------------------------------------------------
[INFO] Trace
hudson.remoting.RequestAbortedException: hudson.remoting.RequestAbortedException: hudson.remoting.Channel$OrderlyShutdown
	at hudson.remoting.Request.call(Request.java:149)
	at hudson.remoting.Channel.call(Channel.java:646)
	at hudson.remoting.RemoteInvocationHandler.invoke(RemoteInvocationHandler.java:158)
	at $Proxy2.isArchivingDisabled(Unknown Source)
	at hudson.maven.MavenBuildProxy$Filter.isArchivingDisabled(MavenBuildProxy.java:227)
	at hudson.maven.reporters.MavenArtifact.archive(MavenArtifact.java:223)
	at hudson.maven.reporters.MavenArtifactArchiver.postBuild(MavenArtifactArchiver.java:108)
	at hudson.maven.Maven2Builder.postModule(Maven2Builder.java:127)
	at hudson.maven.MavenBuilder$Adapter.fireLeaveModule(MavenBuilder.java:327)
	at hudson.maven.MavenBuilder$Adapter.postBuild(MavenBuilder.java:285)
	at org.apache.maven.lifecycle.LifecycleExecutorInterceptor.execute(LifecycleExecutorInterceptor.java:68)
	at org.apache.maven.DefaultMaven.doExecute(DefaultMaven.java:328)
	at org.apache.maven.DefaultMaven.execute(DefaultMaven.java:138)
	at org.apache.maven.cli.MavenCli.main(MavenCli.java:362)
	at sun.reflect.NativeMethodAccessorImpl.invoke0(Native Method)
	at sun.reflect.NativeMethodAccessorImpl.invoke(NativeMethodAccessorImpl.java:39)
	at sun.reflect.DelegatingMethodAccessorImpl.invoke(DelegatingMethodAccessorImpl.java:25)
	at java.lang.reflect.Method.invoke(Method.java:597)
	at org.codehaus.classworlds.Launcher.launchEnhanced(Launcher.java:315)
	at org.codehaus.classworlds.Launcher.launch(Launcher.java:255)
	at hudson.maven.agent.Main.launch(Main.java:185)
	at hudson.maven.MavenBuilder.call(MavenBuilder.java:151)
	at hudson.maven.Maven2Builder.call(Maven2Builder.java:77)
	at hudson.maven.Maven2Builder.call(Maven2Builder.java:53)
	at hudson.remoting.UserRequest.perform(UserRequest.java:118)
	at hudson.remoting.UserRequest.perform(UserRequest.java:48)
	at hudson.remoting.Request$2.run(Request.java:287)
	at hudson.remoting.InterceptingExecutorService$1.call(InterceptingExecutorService.java:72)
	at java.util.concurrent.FutureTask$Sync.innerRun(FutureTask.java:303)
	at java.util.concurrent.FutureTask.run(FutureTask.java:138)
	at java.util.concurrent.ThreadPoolExecutor$Worker.runTask(ThreadPoolExecutor.java:886)
	at java.util.concurrent.ThreadPoolExecutor$Worker.run(ThreadPoolExecutor.java:908)
	at java.lang.Thread.run(Thread.java:662)
Caused by: hudson.remoting.RequestAbortedException: hudson.remoting.Channel$OrderlyShutdown
	at hudson.remoting.Request.abort(Request.java:273)
	at hudson.remoting.Channel.terminate(Channel.java:702)
	at hudson.remoting.Channel$CloseCommand.execute(Channel.java:818)
	at hudson.remoting.Channel$1.handle(Channel.java:416)
	at hudson.remoting.SynchronousCommandTransport$ReaderThread.run(SynchronousCommandTransport.java:60)
Caused by: hudson.remoting.Channel$OrderlyShutdown
	... 3 more
Caused by: Command close created at
	at hudson.remoting.Command.<init>(Command.java:54)
	at hudson.remoting.Channel$CloseCommand.<init>(Channel.java:812)
	at hudson.remoting.Channel$CloseCommand.<init>(Channel.java:810)
	at hudson.remoting.Channel.close(Channel.java:877)
	at hudson.remoting.Channel.close(Channel.java:860)
	at hudson.slaves.Channels$1.close(Channels.java:91)
	at hudson.maven.ProcessCache$MavenProcess.discard(ProcessCache.java:145)
	at hudson.maven.MavenModuleSetBuild$MavenModuleSetBuildExecution.doRun(MavenModuleSetBuild.java:796)
	at hudson.model.AbstractBuild$AbstractBuildExecution.run(AbstractBuild.java:499)
	at hudson.model.Run.execute(Run.java:1460)
	at hudson.maven.MavenModuleSetBuild.run(MavenModuleSetBuild.java:477)
	at hudson.model.ResourceController.execute(ResourceController.java:88)
	at hudson.model.Executor.run(Executor.java:239)
[INFO] ------------------------------------------------------------------------
[INFO] Total time: 136 minutes 13 seconds
[INFO] Finished at: Fri Jun 29 17:31:29 GMT+00:00 2012
[INFO] Final Memory: 110M/426M
[INFO] ------------------------------------------------------------------------

Mime
View raw message