myfaces-commits mailing list archives

Site index · List index
Message view « Date » · « Thread »
Top « Date » · « Thread »
From Apache Jenkins Server <jenk...@builds.apache.org>
Subject Build failed in Jenkins: Trinidad Core Trunk (snapshot) #11
Date Fri, 15 Jun 2012 01:26:08 GMT
See <https://builds.apache.org/job/Trinidad%20Core%20Trunk%20(snapshot)/11/changes>

Changes:

[sobryan] Minor fix to handle older JDK's which don't resolve some of the Generic grammar
correctly.

------------------------------------------
[...truncated 34536 lines...]
Downloaded: http://repo1.maven.org/maven2/org/apache/maven/maven-artifact-manager/2.0.2/maven-artifact-manager-2.0.2.pom
(2 KB at 2.6 KB/sec)
Downloading: http://repo1.maven.org/maven2/org/apache/maven/maven-repository-metadata/2.0.2/maven-repository-metadata-2.0.2.pom
Downloaded: http://repo1.maven.org/maven2/org/apache/maven/maven-repository-metadata/2.0.2/maven-repository-metadata-2.0.2.pom
(2 KB at 2.7 KB/sec)
Downloading: http://repo1.maven.org/maven2/org/apache/maven/maven-artifact/2.0.2/maven-artifact-2.0.2.pom
Downloaded: http://repo1.maven.org/maven2/org/apache/maven/maven-artifact/2.0.2/maven-artifact-2.0.2.pom
(765 B at 1.5 KB/sec)
Downloading: http://repo1.maven.org/maven2/org/apache/maven/maven-core/2.0.2/maven-core-2.0.2.pom
Downloaded: http://repo1.maven.org/maven2/org/apache/maven/maven-core/2.0.2/maven-core-2.0.2.pom
(6 KB at 9.3 KB/sec)
Downloading: http://repo1.maven.org/maven2/org/apache/maven/maven-settings/2.0.2/maven-settings-2.0.2.pom
Downloaded: http://repo1.maven.org/maven2/org/apache/maven/maven-settings/2.0.2/maven-settings-2.0.2.pom
(2 KB at 3.1 KB/sec)
Downloading: http://repo1.maven.org/maven2/org/apache/maven/maven-plugin-parameter-documenter/2.0.2/maven-plugin-parameter-documenter-2.0.2.pom
Downloaded: http://repo1.maven.org/maven2/org/apache/maven/maven-plugin-parameter-documenter/2.0.2/maven-plugin-parameter-documenter-2.0.2.pom
(2 KB at 3.2 KB/sec)
Downloading: http://repo1.maven.org/maven2/org/apache/maven/reporting/maven-reporting-api/2.0.2/maven-reporting-api-2.0.2.pom
Downloaded: http://repo1.maven.org/maven2/org/apache/maven/reporting/maven-reporting-api/2.0.2/maven-reporting-api-2.0.2.pom
(902 B at 1.8 KB/sec)
Downloading: http://repo1.maven.org/maven2/org/apache/maven/reporting/maven-reporting/2.0.2/maven-reporting-2.0.2.pom
Downloaded: http://repo1.maven.org/maven2/org/apache/maven/reporting/maven-reporting/2.0.2/maven-reporting-2.0.2.pom
(738 B at 1.5 KB/sec)
Downloading: http://repo1.maven.org/maven2/org/apache/maven/maven-error-diagnostics/2.0.2/maven-error-diagnostics-2.0.2.pom
Downloaded: http://repo1.maven.org/maven2/org/apache/maven/maven-error-diagnostics/2.0.2/maven-error-diagnostics-2.0.2.pom
(854 B at 1.6 KB/sec)
Downloading: http://repo1.maven.org/maven2/org/apache/maven/maven-plugin-registry/2.0.2/maven-plugin-registry-2.0.2.pom
Downloaded: http://repo1.maven.org/maven2/org/apache/maven/maven-plugin-registry/2.0.2/maven-plugin-registry-2.0.2.pom
(2 KB at 2.6 KB/sec)
Downloading: http://repo1.maven.org/maven2/org/apache/maven/maven-plugin-descriptor/2.0.2/maven-plugin-descriptor-2.0.2.pom
Downloaded: http://repo1.maven.org/maven2/org/apache/maven/maven-plugin-descriptor/2.0.2/maven-plugin-descriptor-2.0.2.pom
(2 KB at 2.6 KB/sec)
Downloading: http://repo1.maven.org/maven2/org/apache/maven/maven-monitor/2.0.2/maven-monitor-2.0.2.pom
Downloaded: http://repo1.maven.org/maven2/org/apache/maven/maven-monitor/2.0.2/maven-monitor-2.0.2.pom
(442 B at 1.1 KB/sec)
Downloading: http://repo1.maven.org/maven2/org/apache/maven/maven-plugin-api/2.0.2/maven-plugin-api-2.0.2.pom
Downloaded: http://repo1.maven.org/maven2/org/apache/maven/maven-plugin-api/2.0.2/maven-plugin-api-2.0.2.pom
(643 B at 1.3 KB/sec)
Downloading: http://repo1.maven.org/maven2/org/apache/maven/reporting/maven-reporting-api/2.0.2/maven-reporting-api-2.0.2.jar
Downloaded: http://repo1.maven.org/maven2/org/apache/maven/reporting/maven-reporting-api/2.0.2/maven-reporting-api-2.0.2.jar
(5 KB at 10.0 KB/sec)
mojoSucceeded org.codehaus.mojo:build-helper-maven-plugin:1.5(default)
mojoStarted org.apache.maven.plugins:maven-enforcer-plugin:1.0.1(enforce-maven)
[INFO] 
[INFO] --- maven-enforcer-plugin:1.0.1:enforce (enforce-maven) @ trinidad-api ---
mojoSucceeded org.apache.maven.plugins:maven-enforcer-plugin:1.0.1(enforce-maven)
mojoStarted org.apache.myfaces.trinidadbuild:maven-xrts-plugin:2.0.8-SNAPSHOT(default)[INFO]
Generating 54 XRTS bundles to <https://builds.apache.org/job/Trinidad%20Core%20Trunk%20(snapshot)/ws/trinidad-api/target/maven-xrts-plugin/main/java>

[INFO] 
[INFO] --- maven-xrts-plugin:2.0.8-SNAPSHOT:generate-sources (default) @ trinidad-api ---
mojoSucceeded org.apache.myfaces.trinidadbuild:maven-xrts-plugin:2.0.8-SNAPSHOT(default)
mojoStarted org.apache.myfaces.buildtools:myfaces-builder-plugin:1.0.9(default)Downloading:
http://repo1.maven.org/maven2/org/apache/maven/plugins/maven-dependency-plugin/2.1/maven-dependency-plugin-2.1.pom

[INFO] 
[INFO] --- myfaces-builder-plugin:1.0.9:build-metadata (default) @ trinidad-api ---
Downloaded: http://repo1.maven.org/maven2/org/apache/maven/plugins/maven-dependency-plugin/2.1/maven-dependency-plugin-2.1.pom
(8 KB at 26.1 KB/sec)
Downloading: http://repo1.maven.org/maven2/org/apache/maven/plugins/maven-plugins/12/maven-plugins-12.pom
Downloaded: http://repo1.maven.org/maven2/org/apache/maven/plugins/maven-plugins/12/maven-plugins-12.pom
(12 KB at 23.0 KB/sec)
Downloading: http://repo1.maven.org/maven2/org/codehaus/plexus/plexus-archiver/1.0-alpha-9/plexus-archiver-1.0-alpha-9.pom
Downloaded: http://repo1.maven.org/maven2/org/codehaus/plexus/plexus-archiver/1.0-alpha-9/plexus-archiver-1.0-alpha-9.pom
(2 KB at 3.6 KB/sec)
Downloading: http://repo1.maven.org/maven2/org/codehaus/plexus/plexus-io/1.0-alpha-1/plexus-io-1.0-alpha-1.pom
Downloaded: http://repo1.maven.org/maven2/org/codehaus/plexus/plexus-io/1.0-alpha-1/plexus-io-1.0-alpha-1.pom
(2 KB at 2.5 KB/sec)
Downloading: http://repo1.maven.org/maven2/org/apache/maven/shared/file-management/1.1/file-management-1.1.pom
Downloaded: http://repo1.maven.org/maven2/org/apache/maven/shared/file-management/1.1/file-management-1.1.pom
(3 KB at 5.5 KB/sec)
Downloading: http://repo1.maven.org/maven2/org/apache/maven/shared/maven-shared-io/1.0/maven-shared-io-1.0.pom
Downloaded: http://repo1.maven.org/maven2/org/apache/maven/shared/maven-shared-io/1.0/maven-shared-io-1.0.pom
(3 KB at 5.8 KB/sec)
Downloading: http://repo1.maven.org/maven2/org/apache/maven/wagon/wagon-provider-api/1.0-alpha-6/wagon-provider-api-1.0-alpha-6.pom
Downloaded: http://repo1.maven.org/maven2/org/apache/maven/wagon/wagon-provider-api/1.0-alpha-6/wagon-provider-api-1.0-alpha-6.pom
(588 B at 1.2 KB/sec)
Downloading: http://repo1.maven.org/maven2/org/apache/maven/wagon/wagon/1.0-alpha-6/wagon-1.0-alpha-6.pom
Downloaded: http://repo1.maven.org/maven2/org/apache/maven/wagon/wagon/1.0-alpha-6/wagon-1.0-alpha-6.pom
(7 KB at 12.6 KB/sec)
Downloading: http://repo1.maven.org/maven2/org/apache/maven/shared/maven-dependency-analyzer/1.1/maven-dependency-analyzer-1.1.pom
Downloaded: http://repo1.maven.org/maven2/org/apache/maven/shared/maven-dependency-analyzer/1.1/maven-dependency-analyzer-1.1.pom
(5 KB at 8.8 KB/sec)
Downloading: http://repo1.maven.org/maven2/org/apache/maven/shared/maven-shared-components/10/maven-shared-components-10.pom
Downloaded: http://repo1.maven.org/maven2/org/apache/maven/shared/maven-shared-components/10/maven-shared-components-10.pom
(9 KB at 14.8 KB/sec)
Downloading: http://repo1.maven.org/maven2/asm/asm/3.0/asm-3.0.pom
Downloaded: http://repo1.maven.org/maven2/asm/asm/3.0/asm-3.0.pom (360 B at 0.8 KB/sec)
Downloading: http://repo1.maven.org/maven2/asm/asm-parent/3.0/asm-parent-3.0.pom
Downloaded: http://repo1.maven.org/maven2/asm/asm-parent/3.0/asm-parent-3.0.pom (3 KB at 4.9
KB/sec)
Downloading: http://repo1.maven.org/maven2/org/apache/maven/maven-project/2.0.8/maven-project-2.0.8.pom
Downloaded: http://repo1.maven.org/maven2/org/apache/maven/maven-project/2.0.8/maven-project-2.0.8.pom
(3 KB at 5.5 KB/sec)
Downloading: http://repo1.maven.org/maven2/org/apache/maven/maven-settings/2.0.8/maven-settings-2.0.8.pom
Downloaded: http://repo1.maven.org/maven2/org/apache/maven/maven-settings/2.0.8/maven-settings-2.0.8.pom
(3 KB at 4.1 KB/sec)
Downloading: http://repo1.maven.org/maven2/org/apache/maven/maven-profile/2.0.8/maven-profile-2.0.8.pom
Downloaded: http://repo1.maven.org/maven2/org/apache/maven/maven-profile/2.0.8/maven-profile-2.0.8.pom
(2 KB at 4.0 KB/sec)
Downloading: http://repo1.maven.org/maven2/org/apache/maven/maven-artifact-manager/2.0.8/maven-artifact-manager-2.0.8.pom
Downloaded: http://repo1.maven.org/maven2/org/apache/maven/maven-artifact-manager/2.0.8/maven-artifact-manager-2.0.8.pom
(3 KB at 5.4 KB/sec)
Downloading: http://repo1.maven.org/maven2/org/apache/maven/maven-repository-metadata/2.0.8/maven-repository-metadata-2.0.8.pom
Downloaded: http://repo1.maven.org/maven2/org/apache/maven/maven-repository-metadata/2.0.8/maven-repository-metadata-2.0.8.pom
(2 KB at 3.0 KB/sec)
Downloading: http://repo1.maven.org/maven2/org/apache/maven/maven-plugin-registry/2.0.8/maven-plugin-registry-2.0.8.pom
Downloaded: http://repo1.maven.org/maven2/org/apache/maven/maven-plugin-registry/2.0.8/maven-plugin-registry-2.0.8.pom
(2 KB at 5.2 KB/sec)
Downloading: http://repo1.maven.org/maven2/com/thoughtworks/qdox/qdox/1.12/qdox-1.12.pom
Downloaded: http://repo1.maven.org/maven2/com/thoughtworks/qdox/qdox/1.12/qdox-1.12.pom (19
KB at 36.9 KB/sec)
Downloading: http://repo1.maven.org/maven2/commons-digester/commons-digester/1.8/commons-digester-1.8.pom
Downloaded: http://repo1.maven.org/maven2/commons-digester/commons-digester/1.8/commons-digester-1.8.pom
(7 KB at 13.6 KB/sec)
Downloading: http://repo1.maven.org/maven2/stax/stax/1.2.0/stax-1.2.0.pom
Downloaded: http://repo1.maven.org/maven2/stax/stax/1.2.0/stax-1.2.0.pom (4 KB at 6.8 KB/sec)
Downloading: http://repo1.maven.org/maven2/org/apache/velocity/velocity/1.6.4/velocity-1.6.4.pom
Downloaded: http://repo1.maven.org/maven2/org/apache/velocity/velocity/1.6.4/velocity-1.6.4.pom
(11 KB at 20.7 KB/sec)
Downloading: http://repo1.maven.org/maven2/logkit/logkit/2.0/logkit-2.0.pom
Downloaded: http://repo1.maven.org/maven2/logkit/logkit/2.0/logkit-2.0.pom (144 B at 0.3 KB/sec)
Downloading: http://repo1.maven.org/maven2/org/apache/maven/reporting/maven-reporting-impl/2.0.5/maven-reporting-impl-2.0.5.pom
Downloaded: http://repo1.maven.org/maven2/org/apache/maven/reporting/maven-reporting-impl/2.0.5/maven-reporting-impl-2.0.5.pom
(5 KB at 8.6 KB/sec)
Downloading: http://repo1.maven.org/maven2/org/codehaus/plexus/plexus-utils/1.5.7/plexus-utils-1.5.7.pom
Downloaded: http://repo1.maven.org/maven2/org/codehaus/plexus/plexus-utils/1.5.7/plexus-utils-1.5.7.pom
(8 KB at 16.1 KB/sec)
Downloading: http://repo1.maven.org/maven2/org/apache/maven/shared/maven-doxia-tools/1.0.2/maven-doxia-tools-1.0.2.pom
Downloaded: http://repo1.maven.org/maven2/org/apache/maven/shared/maven-doxia-tools/1.0.2/maven-doxia-tools-1.0.2.pom
(6 KB at 11.9 KB/sec)
Downloading: http://repo1.maven.org/maven2/log4j/log4j/1.2.13/log4j-1.2.13.pom
Downloaded: http://repo1.maven.org/maven2/log4j/log4j/1.2.13/log4j-1.2.13.pom (389 B at 0.6
KB/sec)
Downloading: http://repo1.maven.org/maven2/org/apache/maven/plugins/maven-dependency-plugin/2.1/maven-dependency-plugin-2.1.jar
Downloading: http://repo1.maven.org/maven2/org/codehaus/plexus/plexus-archiver/1.0-alpha-9/plexus-archiver-1.0-alpha-9.jar
Downloading: http://repo1.maven.org/maven2/org/apache/maven/shared/file-management/1.1/file-management-1.1.jar
Downloading: http://repo1.maven.org/maven2/org/apache/maven/shared/maven-shared-io/1.0/maven-shared-io-1.0.jar
Downloading: http://repo1.maven.org/maven2/org/apache/maven/shared/maven-dependency-analyzer/1.1/maven-dependency-analyzer-1.1.jar
Downloaded: http://repo1.maven.org/maven2/org/apache/maven/plugins/maven-dependency-plugin/2.1/maven-dependency-plugin-2.1.jar
(104 KB at 77.0 KB/sec)
Downloading: http://repo1.maven.org/maven2/asm/asm/3.0/asm-3.0.jar
Downloaded: http://repo1.maven.org/maven2/org/apache/maven/shared/file-management/1.1/file-management-1.1.jar
(31 KB at 19.1 KB/sec)
Downloading: http://repo1.maven.org/maven2/org/codehaus/plexus/plexus-io/1.0-alpha-1/plexus-io-1.0-alpha-1.jar
Downloaded: http://repo1.maven.org/maven2/org/codehaus/plexus/plexus-archiver/1.0-alpha-9/plexus-archiver-1.0-alpha-9.jar
(154 KB at 83.2 KB/sec)
Downloading: http://repo1.maven.org/maven2/com/thoughtworks/qdox/qdox/1.12/qdox-1.12.jar
Downloaded: http://repo1.maven.org/maven2/org/apache/maven/shared/maven-dependency-analyzer/1.1/maven-dependency-analyzer-1.1.jar
(27 KB at 12.6 KB/sec)
Downloading: http://repo1.maven.org/maven2/commons-digester/commons-digester/1.8/commons-digester-1.8.jar
Downloaded: http://repo1.maven.org/maven2/org/apache/maven/shared/maven-shared-io/1.0/maven-shared-io-1.0.jar
(33 KB at 13.9 KB/sec)
Downloading: http://repo1.maven.org/maven2/stax/stax/1.2.0/stax-1.2.0.jar
Downloaded: http://repo1.maven.org/maven2/asm/asm/3.0/asm-3.0.jar (42 KB at 16.7 KB/sec)
Downloading: http://repo1.maven.org/maven2/org/apache/velocity/velocity/1.6.4/velocity-1.6.4.jar
Downloaded: http://repo1.maven.org/maven2/org/codehaus/plexus/plexus-io/1.0-alpha-1/plexus-io-1.0-alpha-1.jar
(12 KB at 4.8 KB/sec)
Downloading: http://repo1.maven.org/maven2/logkit/logkit/2.0/logkit-2.0.jar
Downloaded: http://repo1.maven.org/maven2/com/thoughtworks/qdox/qdox/1.12/qdox-1.12.jar (176
KB at 70.1 KB/sec)
Downloading: http://repo1.maven.org/maven2/commons-collections/commons-collections/3.1/commons-collections-3.1.jar
Downloaded: http://repo1.maven.org/maven2/commons-digester/commons-digester/1.8/commons-digester-1.8.jar
(141 KB at 55.9 KB/sec)
Downloading: http://repo1.maven.org/maven2/org/apache/maven/reporting/maven-reporting-impl/2.0.5/maven-reporting-impl-2.0.5.jar
Downloaded: http://repo1.maven.org/maven2/stax/stax/1.2.0/stax-1.2.0.jar (176 KB at 63.6 KB/sec)
Downloading: http://repo1.maven.org/maven2/org/apache/maven/shared/maven-doxia-tools/1.0.2/maven-doxia-tools-1.0.2.jar
Downloaded: http://repo1.maven.org/maven2/org/apache/velocity/velocity/1.6.4/velocity-1.6.4.jar
(412 KB at 163.8 KB/sec)
Downloading: http://repo1.maven.org/maven2/org/codehaus/plexus/plexus-utils/1.5.15/plexus-utils-1.5.15.jar
Downloaded: http://repo1.maven.org/maven2/logkit/logkit/2.0/logkit-2.0.jar (80 KB at 31.4
KB/sec)
Downloading: http://repo1.maven.org/maven2/log4j/log4j/1.2.13/log4j-1.2.13.jar
Downloaded: http://repo1.maven.org/maven2/org/apache/maven/reporting/maven-reporting-impl/2.0.5/maven-reporting-impl-2.0.5.jar
(21 KB at 9.0 KB/sec)
Downloaded: http://repo1.maven.org/maven2/commons-collections/commons-collections/3.1/commons-collections-3.1.jar
(547 KB at 199.0 KB/sec)
Downloaded: http://repo1.maven.org/maven2/org/apache/maven/shared/maven-doxia-tools/1.0.2/maven-doxia-tools-1.0.2.jar
(41 KB at 17.8 KB/sec)
Downloaded: http://repo1.maven.org/maven2/org/codehaus/plexus/plexus-utils/1.5.15/plexus-utils-1.5.15.jar
(223 KB at 127.5 KB/sec)
Downloaded: http://repo1.maven.org/maven2/log4j/log4j/1.2.13/log4j-1.2.13.jar (350 KB at 187.7
KB/sec)
log4j:WARN No appenders could be found for logger (org.apache.commons.digester.Digester.sax).
log4j:WARN Please initialize the log4j system properly.
mojoSucceeded org.apache.myfaces.buildtools:myfaces-builder-plugin:1.0.9(default)
mojoStarted org.apache.myfaces.trinidadbuild:maven-faces-plugin:2.0.8-SNAPSHOT(default)
[INFO] 
[INFO] --- maven-faces-plugin:2.0.8-SNAPSHOT:generate-components (default) @ trinidad-api
---
[INFO] Generated 134 component(s)
mojoSucceeded org.apache.myfaces.trinidadbuild:maven-faces-plugin:2.0.8-SNAPSHOT(default)
[INFO] Generating LocaleElements
mojoStarted org.apache.myfaces.trinidadbuild:maven-i18n-plugin:2.0.8-SNAPSHOT(default)
[INFO] 
[INFO] --- maven-i18n-plugin:2.0.8-SNAPSHOT:generate-locale-elements (default) @ trinidad-api
---
mojoSucceeded org.apache.myfaces.trinidadbuild:maven-i18n-plugin:2.0.8-SNAPSHOT(default)
mojoStarted org.apache.maven.plugins:maven-remote-resources-plugin:1.0-alpha-6(default)
[INFO] 
[INFO] --- maven-remote-resources-plugin:1.0-alpha-6:process (default) @ trinidad-api ---
mojoSucceeded org.apache.maven.plugins:maven-remote-resources-plugin:1.0-alpha-6(default)
mojoStarted org.apache.maven.plugins:maven-resources-plugin:2.5(default-resources)[debug]
execute contextualize
[INFO] Using 'UTF-8' encoding to copy filtered resources.
[INFO] Copying 3 resources
[INFO] Copying 1 resource
[INFO] Copying 2 resources

[INFO] 
[INFO] --- maven-resources-plugin:2.5:resources (default-resources) @ trinidad-api ---
mojoSucceeded org.apache.maven.plugins:maven-resources-plugin:2.5(default-resources)
mojoStarted org.apache.maven.plugins:maven-compiler-plugin:2.3.2(default-compile)
[INFO] 
[INFO] --- maven-compiler-plugin:2.3.2:compile (default-compile) @ trinidad-api ---
[INFO] Compiling 453 source files to <https://builds.apache.org/job/Trinidad%20Core%20Trunk%20(snapshot)/ws/trinidad-api/target/classes>
[INFO] -------------------------------------------------------------
[ERROR] COMPILATION ERROR : 
[INFO] -------------------------------------------------------------
[ERROR] <https://builds.apache.org/job/Trinidad%20Core%20Trunk%20(snapshot)/ws/trinidad-api/src/main/java/org/apache/myfaces/trinidad/util/ClassLoaderUtils.java>:[258,11]
incompatible types
found   : T
required: java.util.List<T>
[INFO] 1 error
[INFO] -------------------------------------------------------------
mojoFailed org.apache.maven.plugins:maven-compiler-plugin:2.3.2(default-compile)
projectFailed org.apache.myfaces.trinidad:trinidad-api:2.1.0-SNAPSHOT
sessionEnded
[INFO] ------------------------------------------------------------------------
[INFO] Reactor Summary:
[INFO] 
[INFO] Apache MyFaces Trinidad ........................... SUCCESS [2:36.494s]
[INFO] Apache MyFaces Trinidad Build ..................... SUCCESS [37.577s]
[INFO] Apache MyFaces Trinidad API ....................... FAILURE [1:06.577s]
[INFO] Apache MyFaces Trinidad Impl ...................... SKIPPED
[INFO] ------------------------------------------------------------------------
[INFO] BUILD FAILURE
[INFO] ------------------------------------------------------------------------
[INFO] Total time: 4:23.686s
[INFO] Finished at: Fri Jun 15 01:25:58 UTC 2012
[INFO] Final Memory: 42M/649M
[INFO] ------------------------------------------------------------------------
Projects to build: [MavenProject: org.apache.myfaces.trinidad:trinidad:2.1.0-SNAPSHOT @ <https://builds.apache.org/job/Trinidad%20Core%20Trunk%20(snapshot)/ws/pom.xml,>
MavenProject: org.apache.myfaces.trinidad:trinidad-build:2.1.0-SNAPSHOT @ <https://builds.apache.org/job/Trinidad%20Core%20Trunk%20(snapshot)/ws/trinidad-build/pom.xml,>
MavenProject: org.apache.myfaces.trinidad:trinidad-api:2.1.0-SNAPSHOT @ <https://builds.apache.org/job/Trinidad%20Core%20Trunk%20(snapshot)/ws/trinidad-api/pom.xml,>
MavenProject: org.apache.myfaces.trinidad:trinidad-impl:2.1.0-SNAPSHOT @ <https://builds.apache.org/job/Trinidad%20Core%20Trunk%20(snapshot)/ws/trinidad-impl/pom.xml]>
[JENKINS] Archiving <https://builds.apache.org/job/Trinidad%20Core%20Trunk%20(snapshot)/ws/pom.xml>
to /home/hudson/hudson/jobs/Trinidad Core Trunk (snapshot)/modules/org.apache.myfaces.trinidad$trinidad/builds/2012-06-15_01-21-23/archive/org.apache.myfaces.trinidad/trinidad/2.1.0-SNAPSHOT/trinidad-2.1.0-SNAPSHOT.pom
[JENKINS] Archiving <https://builds.apache.org/job/Trinidad%20Core%20Trunk%20(snapshot)/ws/target/trinidad-2.1.0-SNAPSHOT-site.xml>
to /home/hudson/hudson/jobs/Trinidad Core Trunk (snapshot)/modules/org.apache.myfaces.trinidad$trinidad/builds/2012-06-15_01-21-23/archive/org.apache.myfaces.trinidad/trinidad/2.1.0-20120615.012412-12/trinidad-2.1.0-20120615.012412-12-site.xml
[JENKINS] Archiving <https://builds.apache.org/job/Trinidad%20Core%20Trunk%20(snapshot)/ws/trinidad-api/pom.xml>
to /home/hudson/hudson/jobs/Trinidad Core Trunk (snapshot)/modules/org.apache.myfaces.trinidad$trinidad-api/builds/2012-06-15_01-21-23/archive/org.apache.myfaces.trinidad/trinidad-api/2.1.0-SNAPSHOT/trinidad-api-2.1.0-SNAPSHOT.pom
[JENKINS] Archiving <https://builds.apache.org/job/Trinidad%20Core%20Trunk%20(snapshot)/ws/trinidad-impl/pom.xml>
to /home/hudson/hudson/jobs/Trinidad Core Trunk (snapshot)/modules/org.apache.myfaces.trinidad$trinidad-impl/builds/2012-06-15_01-21-23/archive/org.apache.myfaces.trinidad/trinidad-impl/2.1.0-SNAPSHOT/trinidad-impl-2.1.0-SNAPSHOT.pom
[JENKINS] Archiving <https://builds.apache.org/job/Trinidad%20Core%20Trunk%20(snapshot)/ws/trinidad-build/pom.xml>
to /home/hudson/hudson/jobs/Trinidad Core Trunk (snapshot)/modules/org.apache.myfaces.trinidad$trinidad-build/builds/2012-06-15_01-21-23/archive/org.apache.myfaces.trinidad/trinidad-build/2.1.0-SNAPSHOT/trinidad-build-2.1.0-SNAPSHOT.pom
[JENKINS] Archiving <https://builds.apache.org/job/Trinidad%20Core%20Trunk%20(snapshot)/ws/trinidad-build/target/trinidad-build-2.1.0-SNAPSHOT.jar>
to /home/hudson/hudson/jobs/Trinidad Core Trunk (snapshot)/modules/org.apache.myfaces.trinidad$trinidad-build/builds/2012-06-15_01-21-23/archive/org.apache.myfaces.trinidad/trinidad-build/2.1.0-20120615.012449-12/trinidad-build-2.1.0-20120615.012449-12.jar
[JENKINS] Archiving <https://builds.apache.org/job/Trinidad%20Core%20Trunk%20(snapshot)/ws/trinidad-build/target/trinidad-build-2.1.0-SNAPSHOT-sources.jar>
to /home/hudson/hudson/jobs/Trinidad Core Trunk (snapshot)/modules/org.apache.myfaces.trinidad$trinidad-build/builds/2012-06-15_01-21-23/archive/org.apache.myfaces.trinidad/trinidad-build/2.1.0-20120615.012449-12/trinidad-build-2.1.0-20120615.012449-12-sources.jar
Waiting for Jenkins to finish collecting data
mavenExecutionResult exceptions not empty
message : Failed to execute goal org.apache.maven.plugins:maven-compiler-plugin:2.3.2:compile
(default-compile) on project trinidad-api: Compilation failure
<https://builds.apache.org/job/Trinidad%20Core%20Trunk%20(snapshot)/ws/trinidad-api/src/main/java/org/apache/myfaces/trinidad/util/ClassLoaderUtils.java>:[258,11]
incompatible types
found   : T
required: java.util.List<T>

cause : Compilation failure
<https://builds.apache.org/job/Trinidad%20Core%20Trunk%20(snapshot)/ws/trinidad-api/src/main/java/org/apache/myfaces/trinidad/util/ClassLoaderUtils.java>:[258,11]
incompatible types
found   : T
required: java.util.List<T>

Stack trace : 
org.apache.maven.lifecycle.LifecycleExecutionException: Failed to execute goal org.apache.maven.plugins:maven-compiler-plugin:2.3.2:compile
(default-compile) on project trinidad-api: Compilation failure
<https://builds.apache.org/job/Trinidad%20Core%20Trunk%20(snapshot)/ws/trinidad-api/src/main/java/org/apache/myfaces/trinidad/util/ClassLoaderUtils.java>:[258,11]
incompatible types
found   : T
required: java.util.List<T>

	at org.apache.maven.lifecycle.internal.MojoExecutor.execute(MojoExecutor.java:213)
	at org.apache.maven.lifecycle.internal.MojoExecutor.execute(MojoExecutor.java:153)
	at org.apache.maven.lifecycle.internal.MojoExecutor.execute(MojoExecutor.java:145)
	at org.apache.maven.lifecycle.internal.LifecycleModuleBuilder.buildProject(LifecycleModuleBuilder.java:84)
	at org.apache.maven.lifecycle.internal.LifecycleModuleBuilder.buildProject(LifecycleModuleBuilder.java:59)
	at org.apache.maven.lifecycle.internal.LifecycleStarter.singleThreadedBuild(LifecycleStarter.java:183)
	at org.apache.maven.lifecycle.internal.LifecycleStarter.execute(LifecycleStarter.java:161)
	at org.apache.maven.DefaultMaven.doExecute(DefaultMaven.java:319)
	at org.apache.maven.DefaultMaven.execute(DefaultMaven.java:156)
	at org.jvnet.hudson.maven3.launcher.Maven3Launcher.main(Maven3Launcher.java:79)
	at sun.reflect.NativeMethodAccessorImpl.invoke0(Native Method)
	at sun.reflect.NativeMethodAccessorImpl.invoke(NativeMethodAccessorImpl.java:39)
	at sun.reflect.DelegatingMethodAccessorImpl.invoke(DelegatingMethodAccessorImpl.java:25)
	at java.lang.reflect.Method.invoke(Method.java:597)
	at org.codehaus.plexus.classworlds.launcher.Launcher.launchStandard(Launcher.java:329)
	at org.codehaus.plexus.classworlds.launcher.Launcher.launch(Launcher.java:239)
	at org.jvnet.hudson.maven3.agent.Maven3Main.launch(Maven3Main.java:158)
	at hudson.maven.Maven3Builder.call(Maven3Builder.java:98)
	at hudson.maven.Maven3Builder.call(Maven3Builder.java:64)
	at hudson.remoting.UserRequest.perform(UserRequest.java:118)
	at hudson.remoting.UserRequest.perform(UserRequest.java:48)
	at hudson.remoting.Request$2.run(Request.java:287)
	at hudson.remoting.InterceptingExecutorService$1.call(InterceptingExecutorService.java:72)
	at java.util.concurrent.FutureTask$Sync.innerRun(FutureTask.java:303)
	at java.util.concurrent.FutureTask.run(FutureTask.java:138)
	at java.util.concurrent.ThreadPoolExecutor$Worker.runTask(ThreadPoolExecutor.java:886)
	at java.util.concurrent.ThreadPoolExecutor$Worker.run(ThreadPoolExecutor.java:908)
	at java.lang.Thread.run(Thread.java:662)
Caused by: org.apache.maven.plugin.CompilationFailureException: Compilation failure
<https://builds.apache.org/job/Trinidad%20Core%20Trunk%20(snapshot)/ws/trinidad-api/src/main/java/org/apache/myfaces/trinidad/util/ClassLoaderUtils.java>:[258,11]
incompatible types
found   : T
required: java.util.List<T>

	at org.apache.maven.plugin.AbstractCompilerMojo.execute(AbstractCompilerMojo.java:656)
	at org.apache.maven.plugin.CompilerMojo.execute(CompilerMojo.java:128)
	at org.apache.maven.plugin.DefaultBuildPluginManager.executeMojo(DefaultBuildPluginManager.java:101)
	at org.apache.maven.lifecycle.internal.MojoExecutor.execute(MojoExecutor.java:209)
	... 27 more
Sending e-mails to: commits@myfaces.apache.org sobryan@apache.org
channel stopped

Mime
View raw message